{"text_format":"1","workbook":"xlsx","n_sheets":21,"sheets":["Membership #","Stall List","MBRA ","Sheet1","SMALLFRY","PONY","EXHIBITION Barrels","JUNIOR HORSE BARRELS","Adult Green Barrels","ADULT GREEN POLES","YOUTH BARRELS","YOUTH POLES","NOVICE BARRELS","OPEN BARRELS","NOVICE POLES","OPEN POLES","3D Barrels","GT_Custom","Payouts","Show Report","Sheet3"],"not_rendered":{"charts":0,"images":0,"macros":1,"external_links":1,"defined_names":17,"comments":0,"pivot_tables":1},"unopened":[],"bounds":{"document_bytes":16777216,"sheet_cells":100000,"rows_first":2000,"rows_last":500,"rows_between":2000,"halvings":0,"cell_chars":16384,"cell_head_chars":4096},"cells_cut":0,"cells_raw":0,"read":"whole","date_system":"1900"}

{"sheet":"Membership #","index":0,"n_rows":471,"n_cols":3,"rows_kept":471,"cut":false,"hidden":false,"merged":[]}
[19,"Jacie Burke","She's Just That Sassy"]
[77,"Travis Patterson","Dacs Breezin Rome"]
[969,"Kenzie Cook","Pocos Lady Emerald"]
[973,"Sara Ivey","Ms Heavenly Gator"]
[81,"Peyton Lynds","Roxy"]
[82,"Scotia MacEachern","Hick-a-Licious"]
[83,"Taylor Dickson","Smarts Hicks"]
[84,"Amber Lloyd","Lilly"]
[85,"Kaelyn Keddy","Sight to Behold"]
[85,"Katelyn Keddy","Sight to Behold"]
[86,"Chantelle Oulton","Jack Sparrow"]
[86,"Chantelle Oulton","Jack Sparrow"]
[87,"Kerissa Martin","Wild Steppin' Phoenix"]
[89,"Hannah Rafuse","Cookie"]
[90,"Tarissa Rafuse","Sparkles"]
[974,"Kerissa Martin","Wild Steppin Phoenix"]
[93,"Nicole Kent","Legacy's Lacy Invite"]
[94,"Ainsley Marshall","JW"]
[97,"MacKenize Hughes","Batmans Famous Bugs"]
[99,"Ella Cowley","Blazin Boots"]
[100,"Taylor Payzant","Money out of my Pocket"]
[501,"Chuck Patterson"]
[501,"Marion MacDonald","Looking for a Pay Day"]
[502,"Ryson Doucette","Plan B"]
[503,"Kate Dew"]
[504,"Pat McLean","Johnny Drama"]
[505,"Chris Bezanson","Miss Conjelena Doc"]
[506,"Elaine MacLean","Fast Tick to Vegas"]
[507,"Jason Wilkins / Alexis Wilkins","PB King Leo Buck"]
[508,"Chris Philips","Justa Blurr ta Fame"]
[509,"Emma Simpson","She's a Myan Princess"]
[510,"Jason Lively","Tip One Back"]
[511,"Elaine MacLean","Wicked Latigo Doc"]
[512,"Kenny Burt"]
[513,"Justin Wade","The Gentleman"]
[514,"Heather Morrison","Black Fire Dash"]
[515,"Ed Grant","I Own A Corona"]
[516,"Laurie Don Reginato","TCR Gold Runny"]
[517,"Jessica Hawkins"]
[518,"Sylvester Weatherbie","J.R."]
[519,"Charlsea Fiske","Lights Out Goys"]
[520,"John McAssey"]
[521,"Royden Naugler","RR Smooth Richochet"]
[522,"Emma Taylor","Takin A Chance"]
[523,"Nicole Dobson","Barbeesimpossibleinprint"]
[524,"Stan Brown","Kicked In Overdrive"]
[525,"Charmaine Gallant","Six Viking"]
[526,"Talor Naugler","Blazing Hot"]
[527,"Royce Naugler","Rockin Ronnie"]
[528,"Talor Naugler","A Touch of Lace"]
[529,"Reese LeBlanc","Badger Bar ToWinSome"]
[530,"Joan Grant","SLS Dash to Holland"]
[531,"Addison Peters","He's A Little Wonder"]
[532,"Gracie MacLean","Secret"]
[533,"Jessica Taylor","Farrells Finest Man"]
[534,"Mary Lou Rankin Dentin","Brandy's Chocolena"]
[535,"Shaun Allen","Fancy"]
[536,"MaryLouRankinDenton","Grey Check Lady"]
[537,"Alka Virick","Corona Identity"]
[538,"Jean DuGas","Pal's Lilguy"]
[539,"Alex Singer","Plain White Trash"]
[540,"NOT TO BE USED"]
[541,"Mark McLean","Mr. Lucky Fame"]
[542,"Kate Madsen","Return Two Fame"]
[543,"Kathleen Zwaneveld","Dirk Digler"]
[544,"Kevin Bateman","Conquistadorwhizchc"]
[545,"Karen MacDonald","Doc Belle Bandit"]
[546,"Charmaine Gallant","Maybull"]
[547,"Lindsay Hilchie"]
[548,"Lindsay Hilchie","Tri Bright Chance"]
[549,"Chris MacLean","Lena`s Little Hayday"]
[550,"Eunice Dykstra"]
[551,"Riley Reginato","Straight Firen Jet"]
[552,"Emily Messenger","Luckys Starlet"]
[553,"Monica Buffett","MB Victory Dance"]
[554,"Ashley Crane","Diesel Powered Jet"]
[555,"Stephanie Clark","OK Den"]
[556,"Stephaine Clark","Perks A Flyin"]
[557,"Paige Angevine","Tac Off"]
[558,"Kevin Eaton","High Country Cricket"]
[559,"Craig Carey","Whistlen Major"]
[560,"Joan Grant","Nonstop Bay Boy"]
[561,"Makiah Sparks","Mr Cookie"]
[562,"Karen Hatcher","Going Postal"]
[563,"Kevin Bateman","Jess Chasin A Hobby"]
[564,"Bree Johnston","Lylebeta Zack"]
[565,"Kristen Beck","Poco Desert Rose"]
[566,"Pat McLean","Chisel Stone"]
[568,"Cathy Rankin","Heza Doc Twists"]
[569,"Kate Dew","Tiny Gay's Dasher"]
[570,"Bobby Stevens","Rico Mancini"]
[571,"Ken Jardine","Bullet"]
[572,"Maureen Murray","Down Home Lady"]
[573,"Lucy  Collier Gallant","Ben Bodacious"]
[574,"Emma Lee Taylor","SAQ Chiefs Two Bit"]
[575,"Robert Eaton","Den"]
[576,"Kevin Eaton","Hy Bred Inheritance"]
[577,"Lorie Angevine","Two Zan Par Silver"]
[578,"Robert Eaton","Impressive Ben"]
[579,"Joanne Scott","Lily"]
[580,"Candace Sakalauskas","LNTS Two Eyed Jackie"]
[581,"Jean DuGas"]
[582,"Roddie Benoit","Bug Bar Bandit"]
[583,"Travis Patterson","JT Rosie"]
[584,"Tammy Young","Sonny Dee Thunder"]
[585,"Brittany McIntyre","Cherry Can Do"]
[586,"Scott McLean","Presto Lee"]
[587,"Erin Groves","Over The Rainbow"]
[588,"Sarah LeBlanc","Down Home Empress"]
[589,"Kim Sellars","Hidden Assets"]
[590,"Charlotte McCarthy","Smokey B Kay"]
[591,"Wendy MacLean","White Sox N Flyin"]
[592,"Jessie Cummings","Jet Tares"]
[593,"Samantha Miller","Sheamos Promise"]
[594,"Hope Angevine","Sulanist Mist"]
[595,"Kyle Beaton","Diesel's Inferno"]
[596,"Lauren Daley","Myas Skippen Redford"]
[597,"Cecile Dykstra","Codys Zippin It Up"]
[598,"Roddie Benoit","Ruled By Bully"]
[599,"Adrienne Benoit","Grey Ghost"]
[600,"Stan Brown","A Perty Sure Thing"]
[601,"Marion MacDonald","Miss Guardian Angel"]
[602,"Laura Croft","Zippo Silver Pine"]
[603,"Stacy Murray","Express Mist"]
[604,"Gordon McCabe","Apache Blue Nugget"]
[605,"Cindy Wamboldt","Salty Bully Express"]
[606,"Tanya Naugler","Driftin Two Dixie"]
[607,"Laura Morrison","Chicks Painted Wagon"]
[608,"Kate Madsen","Slide on Bye"]
[609,"Stacy Murray","JD Grambler"]
[610,"Katherine Horsman","Shiloh"]
[611,"Rebecca Fraser","Granger Dee Doc"]
[612,"Kristen Beck","Diablo's Blue Step"]
[613,"Kelly LeBlanc","Starrs Double King"]
[614,"Georda MacInnis"]
[615,"Judy Bateman","Hollywood Elite"]
[616,"Judy Bateman","HM HollywoodRockstar"]
[617,"Elaine Mahaney","Sabes Lightnin Bug"]
[618,"Audrey MacLeod","Crown Royal JR"]
[619,"Cassie Daniels","Sugar Ray Light Foot"]
[620,"Stephanie Daniels","Fire Ball Max"]
[621,"Nichole Pothier","Born To Boogie"]
[622,"Courtney Parker","BW Rare Kinda Love"]
[623,"Connie Trider","Hollywood Ranson"]
[624,"Dixie Tuffs","Ima Frostee Bay B"]
[625,"Ryson Doucette","Keeper of The Perks"]
[626,"Jeremy Graham","Echo charged"]
[627,"Kaelyn Keddy","Sight to Behold"]
[628,"Amanda Matchett","Smoke M Pardner"]
[629,"Beth O'Leary","Toms Final Dash"]
[630,"Beth O'Leary","Kings Black"]
[631,"Nicole vanDyke","Ima Bully"]
[632,"Breighanne Finlayson","Dee Dun Smart"]
[633,"Ella Cowley","Oscar"]
[634,"Katlyn Benere","He's Got Class"]
[635,"Trudy Hemeon","RS Painted Pretty"]
[636,"Ceilidh Gosse","ELM Silver Crime"]
[637,"Caleb Buffett","JMF Flashdance"]
[638,"Bella Peters","Super Star"]
[639,"Sally King","Watch That Digger Go"]
[640,"April Jollimore/Megan MacDonald","Pilgrim"]
[641,"Ava Harb","Super Rockie"]
[642,"John Blair","Totally Kissed"]
[643,"Willow Brooks","Mr Betta B Ware"]
[644,"Pat Rodney"]
[645,"Tammy Young","Whoa Laredo"]
[646,"Taylor Blair"]
[647,"Courtney Parker","BW Rare Kinda Love"]
[648,"Norman Blanchard","Sheny Bugs"]
[649,"Cara Pettipas","Shezabonafiedbully"]
[650,"Cara Pettipas","Miss Wonder Bully"]
[651,"Olivia MacLean","A Boy Named Sue"]
[652,"Molly O'Grady","Teelano's Twister"]
[653,"Ryson Doucette","Pawnee Kid N Gold"]
[654,"Deavan Chapman","Enlighten"]
[655,"Julia Parker","Boons Feature Star"]
[656,"Willow Brooks","Free Spirit"]
[657,"Laura Morrison","Steal Ta Fame"]
[658,"Heather Morrison","Last Chance"]
[659,"Gloria Carey","True Blue Tivios"]
[660,"Charles Edwards","Rarer Than You Think"]
[661,"Clara Tooley","Chicado Rebel"]
[662,"Shelly Moore","Too Tough Cat"]
[663,"Dixie Tuffs","Running Squirrel"]
[664,"Christine Doane","Maromac Lexis"]
[665,"Robert Eaton","FF Chick"]
[666,"Summer Fraser","Sheza Smokin' Girl"]
[667,"Paige Angevine","Skip"]
[668,"Amanda Young","King Leo Buck"]
[669,"Roddie Benoit","True Blue Slew"]
[670,"Allie Fox","DNA Bold Bediuno"]
[671,"Paige Gray","What's Up Doc"]
[672,"Maureen Murray","Catch My Bones"]
[673,"Kristen Beck","Monster Bunny"]
[674,"Kyle Beaton","Jus For Kicks"]
[675,"Chris Philips","Deacon Eye Boo"]
[676,"Linda Bird","Moony's Black Magic"]
[677,"Jenna Paquet"]
[678,"Jocelyn d'Entremont","KT Ruby N Tin"]
[679,"Clara Tooley","All Hot N Easy"]
[680,"Kathleen Zwaneveld","Ben Bodacious"]
[681,"Kieston Moore","Hollywood Cresent Moon"]
[682,"Roddie Benoit","Vegas Baby"]
[683,"Wayne Strickland","Texas Wrangler"]
[684,"Shann Cox","Jags Cash Flow"]
[685,"Michaela Dove"]
[686,"Royden Naugler","Docs Bobby Jae"]
[687,"Peter Hope","Flashin Passum"]
[688,"Lenee Sampson","Six Dash Run"]
[689,"Samantha Pinkney","Docs Bar Stardust"]
[690,"Emma Wright-Smith","A Real Blonde Babe"]
[691,"Vincent Croft","Rockets Hollywood"]
[692,"Taylor Dickson","Smart Hicks"]
[693,"Adrienne Benoit","Texas Wrangler"]
[694,"Briana Dillman","Gonna Get Buckwild"]
[695,"Tessa Dicks","Charge's Dusty Luck"]
[696,"Kyle Sakalauskas","Doc Oscar"]
[697,"Sarah Marcus","Redico Dixie"]
[698,"Kaleigh Denton","Coleasaki"]
[699,"Laura Morrison","MDC Dark Revelation"]
[700,"Lindsay Baker","Boons Laughing Boy"]
[701,"Gracie Marinelle","Runnin Outta Moonlight"]
[702,"Jenna Proctor","Painted to Perfection"]
[703,"Chris Baker","Jamer All Fired Up"]
[704,"Amanda HickeyLeblance","Ultimate Lil Fox"]
[705,"Pat McLean","Quick on the Lead"]
[706,"Shelby Gatti","Maybull"]
[707,"Cory Mapplebeck","Maxs Final Affair"]
[708,"Nick Campbell","Playboys Fun"]
[709,"John Foley","Billy"]
[710,"Owen Baker","Tip It Back"]
["710b","Isla Baker","Tip It Back"]
[711,"Allie Fox","DNA Bold Bediuno"]
[712,"Cassidy Stevens","Lady"]
[713,"Sierra Thibault","Gunsmoke"]
[714,"Amanda HickeyLeblance","Luna"]
[715,"Alyssa Mills","River Renegade"]
[716,"Kayla Martin","Dash Ta Home"]
[717,"Sierra Thibault","Gold Digger"]
[718,"Samantha Pinkney","Smokin Okie"]
[719,"Molly/Emily O'Grady","Teelano's Twister"]
[720,"Tammy Beck","Call Me Flashy Zip"]
[721,"Jeremy Graham","Smooth Ike"]
[722,"Amanda Thurber","Painted Pretty Mercedes"]
[723,"Christine Carter/Belle","American Honey"]
[724,"Christine Carter","Ima Brimmerton Also"]
[725,"Belle Carter","Neon Mist"]
[726,"Shelby Antle"]
[727,"Sheldon Antle","Three Spots"]
[728,"Barb Taylor","Painted Escape"]
[729,"Kristen Pyke","High Maintenance Chick"]
[730,"Rhonda Chambers","Booms Pep See"]
[731,"Gail Williams","Sheza Jazzy Girl"]
[732,"Brenna Carrigan","Carlos"]
[733,"Bryanna Cole","Dash of Impluse"]
[734,"Daniel Webb","Heza Doc Twists"]
[735,"Zoey Manuel","Miss Top Notch Zip"]
[736,"Jasmine McLean","I'm A Super Starr"]
[737,"Tori-Anne Devine","Peptovilla"]
[738,"Brad Moore","Heza Holly Hobby"]
[739,"Alka Virick","Elm Texas Wrangler"]
[740,"Bart Lausanne","Bud"]
[741,"Breighanne Finlayson","Major Six Moons"]
[742,"Charlotte Robicheau","SV Twisted Scotch Lad"]
[743,"Shelby Antle","Cool Impulse Bunny"]
[744,"Briana Dillman","Woodmere Wee Annie"]
[745,"Josie Dean","DF Coke Olena"]
[746,"Cassie MacDonald","Sandy Dew"]
[747,"Gary Latimer","Edith Special Rare"]
[748,"Meredith Smith","Max's Formal Affair"]
[749,"Chrissy Linsdsay","Two Creeks Dandy Bar"]
[750,"Tanya Kennedy","Old Stations Pride"]
[751,"Breighanne Finlayson","Charismatic King"]
[752,"Felicia MacEachern","Ruger"]
[753,"Kayla Boudreau","Lady Jane"]
[754,"Megan McConnell","Cuda Ben Adiamond"]
[755,"Megan McConnell","Gotta Pretty Lady"]
[756,"Megan Simpson","Mr. Taco-tastic"]
[757,"Ryan MacLellan","Shadow"]
[758,"Makayla Dixon","Extreme Minnie"]
[759,"Brook Darragh","Leroy"]
[760,"Allison Moffatt","Miss Fancy Pants"]
[761,"Alissa Doucette","Need for Speed"]
[762,"Sandy Doucette","Sugar N Spice"]
[763,"Reese LeBlanc","Badger Bar Towinsome"]
[764,"Alissa Doucette","Need For Speed"]
[765,"Kyann Doucette","Fatal Attraction"]
[766,"Karen Hatcher","Six Dash Run"]
[767,"Judy McCormack","Budding Reality Star"]
[768,"Tracey Higgins","Iza Wicked Wind"]
[769,"Charlsea Fiske","Jailhouse Rockinic"]
[770,"Arielle Sherman","Lacey"]
[771,"Madison Doucette","Daddy's Money"]
[772,"Robyn McDonald","LDF Ratchett To Go"]
[773,"Hunter Lepper","Willow"]
[774,"Bobby Stevens","Sheza Fast Six"]
[775,"Belle Carter","Kickin Sunshine Party"]
[776,"Karli Slaunwhite","Pocos Candy Queen"]
[777,"Julia Parker","Doc's Spirit Prairie"]
[778,"Jillian Comeau","Pocos Flashy Thor"]
[779,"Tim Amero","Miss Flashy T"]
[780,"Bobby Stevens"]
[781,"Amanda Tweedy","Hero"]
[782,"Greg Hatt","Sabres Major Leo"]
[783,"Raeann Young","Black Beauty"]
[784,"Gordon McCabe","Bunchy Munchy"]
[785,"Natalie Schnare/Jenna","Made Pretty Fancy"]
[786,"Rileigh Conrod","Scotches Harley"]
[787,"Darlene Junkowski","Jade"]
[788,"Taylor Chase","The Firestorm"]
[789,"Sandy Gardiner","Carmaletta Dash"]
[790,"Allie Ferneyhough","Rockets Blaze Of Glory"]
[791,"Megan Graves","Kay Doe Nota Chance"]
[792,"Kristen Pyke","Playguns Quixote Cat"]
[793,"Chayann Doucette","Razmatazz"]
[794,"Ashton Rushton","Mon Amie"]
[795,"Taylor Pollock","Ropin The Winds"]
[796,"Katie MacIsaac","Identity First"]
[797,"Emma Sullivan","Lightning McQueen"]
[798,"Amanda Gillis","Miss America"]
[799,"Lisa Everett","B Kays Bonsai"]
[800,"Sabrina Bauer","Talk of The Town"]
[801,"Brittany Spears","Riskey At The Bar"]
[802,"Ava Reginato","Jacs Last Flash"]
[803,"Raeann Young","Little Orphan Annie"]
[804,"Shelby Beaton","Rosie   "]
[805,"Brenna Carrigan","Crime of Fire"]
[806,"Christina Marr","Jack "]
[807,"Joseph Upshaw","JTK Smoking Classic"]
[808,"Chantelle Oulton","Little Miss Sunshine"]
[809,"Dawn Schnare","Teah Salty Bars"]
[810,"Kevin Bateman","SV Twisted Scotch Lad"]
[811,"Mariah Hume","Ratchetts Wimpy Dude"]
[812,"Meghan Hume","Betsys Lemonade"]
[813,"Mariah Hume","Plan B"]
[814,"Megan Graves","Miss Otoes Fan"]
[815,"Brooke Kennedy","Tic Toc Teazer"]
[816,"Elaine MacLean","Moneys Cowboy Cash"]
[817,"Nicole Crowell","Playboy Dunit Again"]
[818,"Kayden Mosher","Cookie"]
[819,"Braydon Lockhart","True Blue Slew"]
[820,"Kim Sellars","Legacy"]
[821,"Nick Lockhart","Zan Freckles Cowboy"]
[822,"Cheryl Matheson","Diamonds Array"]
[823,"Gracie Yorke","Ima Flashy Queen"]
[824,"Ivy Cushing","Bitter Sweet Brandy"]
[825,"Brittany Atwood","Jac Up Hollywood"]
[826,"Raymond Hache","Callaway Jack"]
[827,"Josie Dean","Gray Check Lady"]
[828,"Victoria McNutt","Jazz It Up Jupiter"]
[829,"Jordon Fillmore","Montaego Bo Jet"]
[830,"Bart Lusanne","Little Miss Lightfoot"]
[831,"Mallory Maxwell","Colonel Gunslinger"]
[832,"Elizabeth Hogg","Willie Bee Kanata"]
[833,"Emily Sutherland"]
[834,"Tessa MacIsaac","Uptown Girl"]
[835,"Noah MacAskill"]
[836,"Sarah Justason","Hobo"]
[837,"Lisa Murray","Maws Grey Needles"]
[838,"Wanda Mitchelitis","Zoom Away Now"]
[839,"Shania Putnum","Zan Freckles Cowboy"]
[840,{"$f":"IF(A362=\"\",\"\",(VLOOKUP(A362,'[1]Membership #'!$A$1:$C$378,2,FALSE)))","v":"Kristen Ossinger"},{"$f":"IF(A362=\"\",\"\",(VLOOKUP(A362,'[1]Membership #'!$A$1:$C$378,3,FALSE)))","v":"Bailey's Irish Cream"}]
[841,"Isabelle McNutt","Budda"]
[842,"Deavan Chapman","Inlighten"]
[843,"Eric Lavoie","Roller Can Get It"]
[844,"Sarah Metcalf","Sabers True Aliby"]
[845,"Sheila Lechasseur","Roll Easy Cash"]
[846,"Morgan Smith","Hello Dolly Mac"]
[847,"Morgan Beaton","Kay Doe Doc Slick"]
[848,"Holly McSavaney","Doctor Frenchman"]
[849,"Chris MacLean","Lena`s Little Hayday"]
[850,"Charlsea Fiske","Master of the Moon"]
[851,"Daphne Hamm","Made By Design"]
[852,"Kennedy Meagher","Canadian Maple"]
[853,"Sarah Ross","Fames Little Star"]
[854,"Lily Sutherland","I'm A Sugar Crime"]
[855,"Jenelle Collier","Peppy Sans Surprise"]
[856,"Ava Foote","Willow"]
[857,"June Tattrie","Country Girl"]
[858,"Chloe Fagan","Heza Poco Champ"]
[859,"Jean DuGas"]
[860,"Gail Williams","LeeO"]
[861,"Maddy Smith ","Twisted Temptation"]
[862,"Jenna Burge","Shiners Hangover"]
[863,"Charlotte Mingo","Willy"]
[864,"Taylor Pollock","Ladys Tip One Back"]
[865,"Kaila Gosby","Powder Holly Pine"]
[866,"Terry Lynn McNutt","Cali"]
[867,"Layla MacEachem","Shes a gem"]
[868,"Brooke MacNeil","SLS Dash to Holland"]
[869,"Lisa Murray","Hickory's Smart and Mad"]
[870,"Rileigh O'Leary","Dolly "]
[871,"Serena Sears","Sierra"]
[872,"Drew Rushton","Mocho's Golden Ticket"]
[873,"Danielle Pike","Tinsel on The Pines"]
[874,"Samantha Francis","Frostee"]
[875,"April Jollimore","Cash Assurance"]
[876,"Brittany Spears","Lopin N My Blue Jeans"]
[877,"Gracie Yorke","Tip Top 'n' Flashy"]
[878,"Ella Rogers","Lightning     "]
[879]
[880,"Kiersten Moore","Hollywood Cresent Moon"]
[881,"Eric Lavoie","A Nuther Roll of Cash"]
[882,"Kevin Bateman","Serenas Hickory"]
[883,"Ella Cowley","Guss"]
[884,"Kayden Mosher","Zigby"]
[885,"Samantha Francis","Tank"]
[886,"Ben Peters/Graham Peters","High Hopes"]
[887,"Allie Fox","Shadow"]
[888,"Ariel Fraser","Kay's Last Kid"]
[889,"Adelaine Cowley","Frenchman's Promise"]
[890,"Karli Slaunwhite","Pocos Candy Queen"]
[891,"Krista MacGillivary","Hot Topic"]
[892,"Donnie MacNeil","Gifted Go Gold"]
[893,"Lisa Murray","Coosas Texas Tango"]
[894,"Drew Rushton","BonChance Dads Dream"]
[896,"Kati MacIsaac","Fish'n for Coronas"]
[897]
[898]
[899,"Miranda Cooke","Jig Time Two Largo"]
[900,"Olivia MacLean","Velvet"]
[901,"Monique Buffett"]
[904,"Ella Cowley","Blazin Boots"]
[905,"Adeline Cowley","Smokin Okie"]
[907]
[908,"Josie Higgins","Rocket Man"]
[909,"Rebecca Gillis","Martha's Tivio Moon"]
["909b","Bryden MacNeil","Martha's Tivio Moon"]
[910,"Cassidy Stevens","Lady"]
[911,"Brennan Crowe","Time to Dance"]
[912,"Ed Grant","Chasin The Ace"]
[913,"Morgan Beaton","All Shook Up"]
[914,"Shelby MacPherson","Shelbys Badger Bar"]
[915]
[916,"Rebecca Fraser","Legacy's Gold Lady"]
[917,"Travis Benoit","Whiisper"]
[918,"Keira Rose","LL Its All About Red"]
[919,"Kristie Bolivar","Pretty"]
[920,"Cara Pettipas","Shezabonafiedbully"]
[921,"Shelby Gatti","Just Roll The Dice"]
[922,"Stevi Jardine","Paytons Pretty Cool"]
[923,"Monica Buffett","Victory Dance"]
[924,"Caleb Buffett","JMF Flashdance"]
[925]
[926,"Sara Ivey","A Shot A Whiskey"]
[927]
[928,"Tessa Dicks","ELM Dash of Crime"]
[929]
[930]
[931]
[932,"James Whitman","This Bugs on Fire"]
[941,"Taylor Hurley","Nacho Business"]
[942,"Miles Joudrey","Royal Cash Ransom"]
[945,"Taylor Cameron","Monster Bunny"]
[947,"Leanna Horsnell","Bobs Ya Uncle"]
[950,"Tracey Higgins","Pocos Candy Queen"]
[954,"Scotia MacEachern","Hick-a-Licious"]
[958,"Peyton Lynds","Roxy"]
[961,"Jacie Burke","She's Just That Sassy"]
[962,"Hariin Burke","Olds Bold Impulse"]
[963,"Leighton Burke","Boot Scootin Boogie"]
[966,"Ava Anderson","Black Sass"]
[967,"Marissa Hillier","Notice Betty Boop"]
[968,"Madison Pelly","Westin"]
[971,"Arielle Burke","Elm Sally"]
["710a","Isla Baker","Tip It Back"]
["733b","Terry Cole","Dash of Impluse"]
[78,"Stephanie Rich","Texas Mickey"]
["78b","Julia O Connell","Poco Mui Twist"]
["958b","Shantel Hankey","Roxy"]
["97a","Christine Doane","Batmans Famous Bugs"]

{"sheet":"Stall List","index":1,"n_rows":116,"n_cols":6,"rows_kept":116,"cut":false,"hidden":false,"merged":[[0,0,0,3]]}
["Tom Burt & Mark McGuire Memorial Jackpot  2021"]
[null,"RING #      ","NAME","HORSE NAME",null,"Stall request info"]
[1,549,{"$f":"IF(B3=\"\",\"\",(VLOOKUP(B3,'Membership #'!$A$1:$C$1005,2,FALSE)))","v":"Chris MacLean"},{"$f":"IF(B3=\"\",\"\",(VLOOKUP(B3,'Membership #'!$A$1:$C$1005,3,FALSE)))","v":"Lena`s Little Hayday"}]
[2,591,{"$f":"IF(B4=\"\",\"\",(VLOOKUP(B4,'Membership #'!$A$1:$C$1005,2,FALSE)))","v":"Wendy MacLean"},{"$f":"IF(B4=\"\",\"\",(VLOOKUP(B4,'Membership #'!$A$1:$C$1005,3,FALSE)))","v":"White Sox N Flyin"}]
[3,532,{"$f":"IF(B5=\"\",\"\",(VLOOKUP(B5,'Membership #'!$A$1:$C$1005,2,FALSE)))","v":"Gracie MacLean"},{"$f":"IF(B5=\"\",\"\",(VLOOKUP(B5,'Membership #'!$A$1:$C$1005,3,FALSE)))","v":"Secret"}]
[4,563,{"$f":"IF(B6=\"\",\"\",(VLOOKUP(B6,'Membership #'!$A$1:$C$1005,2,FALSE)))","v":"Kevin Bateman"},{"$f":"IF(B6=\"\",\"\",(VLOOKUP(B6,'Membership #'!$A$1:$C$1005,3,FALSE)))","v":"Jess Chasin A Hobby"}]
[5,616,{"$f":"IF(B7=\"\",\"\",(VLOOKUP(B7,'Membership #'!$A$1:$C$1005,2,FALSE)))","v":"Judy Bateman"},{"$f":"IF(B7=\"\",\"\",(VLOOKUP(B7,'Membership #'!$A$1:$C$1005,3,FALSE)))","v":"HM HollywoodRockstar"}]
[6,530,{"$f":"IF(B8=\"\",\"\",(VLOOKUP(B8,'Membership #'!$A$1:$C$1005,2,FALSE)))","v":"Joan Grant"},{"$f":"IF(B8=\"\",\"\",(VLOOKUP(B8,'Membership #'!$A$1:$C$1005,3,FALSE)))","v":"SLS Dash to Holland"}]
[7,515,{"$f":"IF(B9=\"\",\"\",(VLOOKUP(B9,'Membership #'!$A$1:$C$1005,2,FALSE)))","v":"Ed Grant"},{"$f":"IF(B9=\"\",\"\",(VLOOKUP(B9,'Membership #'!$A$1:$C$1005,3,FALSE)))","v":"I Own A Corona"}]
[8,968,{"$f":"IF(B10=\"\",\"\",(VLOOKUP(B10,'Membership #'!$A$1:$C$1005,2,FALSE)))","v":"Madison Pelly"},{"$f":"IF(B10=\"\",\"\",(VLOOKUP(B10,'Membership #'!$A$1:$C$1005,3,FALSE)))","v":"Westin"}]
[9,768,{"$f":"IF(B11=\"\",\"\",(VLOOKUP(B11,'Membership #'!$A$1:$C$1005,2,FALSE)))","v":"Tracey Higgins"},{"$f":"IF(B11=\"\",\"\",(VLOOKUP(B11,'Membership #'!$A$1:$C$1005,3,FALSE)))","v":"Iza Wicked Wind"}]
[10,908,{"$f":"IF(B12=\"\",\"\",(VLOOKUP(B12,'Membership #'!$A$1:$C$1005,2,FALSE)))","v":"Josie Higgins"},{"$f":"IF(B12=\"\",\"\",(VLOOKUP(B12,'Membership #'!$A$1:$C$1005,3,FALSE)))","v":"Rocket Man"}]
[11,815,{"$f":"IF(B13=\"\",\"\",(VLOOKUP(B13,'Membership #'!$A$1:$C$1005,2,FALSE)))","v":"Brooke Kennedy"},{"$f":"IF(B13=\"\",\"\",(VLOOKUP(B13,'Membership #'!$A$1:$C$1005,3,FALSE)))","v":"Tic Toc Teazer"}]
[12,750,{"$f":"IF(B14=\"\",\"\",(VLOOKUP(B14,'Membership #'!$A$1:$C$1005,2,FALSE)))","v":"Tanya Kennedy"},{"$f":"IF(B14=\"\",\"\",(VLOOKUP(B14,'Membership #'!$A$1:$C$1005,3,FALSE)))","v":"Old Stations Pride"}]
[13,753,{"$f":"IF(B15=\"\",\"\",(VLOOKUP(B15,'Membership #'!$A$1:$C$1005,2,FALSE)))","v":"Kayla Boudreau"},{"$f":"IF(B15=\"\",\"\",(VLOOKUP(B15,'Membership #'!$A$1:$C$1005,3,FALSE)))","v":"Lady Jane"}]
[14,954,{"$f":"IF(B16=\"\",\"\",(VLOOKUP(B16,'Membership #'!$A$1:$C$1005,2,FALSE)))","v":"Scotia MacEachern"},{"$f":"IF(B16=\"\",\"\",(VLOOKUP(B16,'Membership #'!$A$1:$C$1005,3,FALSE)))","v":"Hick-a-Licious"}]
[15,684,{"$f":"IF(B17=\"\",\"\",(VLOOKUP(B17,'Membership #'!$A$1:$C$1005,2,FALSE)))","v":"Shann Cox"},{"$f":"IF(B17=\"\",\"\",(VLOOKUP(B17,'Membership #'!$A$1:$C$1005,3,FALSE)))","v":"Jags Cash Flow"}]
[16,688,{"$f":"IF(B18=\"\",\"\",(VLOOKUP(B18,'Membership #'!$A$1:$C$1005,2,FALSE)))","v":"Lenee Sampson"},{"$f":"IF(B18=\"\",\"\",(VLOOKUP(B18,'Membership #'!$A$1:$C$1005,3,FALSE)))","v":"Six Dash Run"}]
[17,80,{"$f":"IF(B19=\"\",\"\",(VLOOKUP(B19,'Membership #'!$A$1:$C$1005,2,FALSE)))","v":{"$error":"#N/A"}},{"$f":"IF(B19=\"\",\"\",(VLOOKUP(B19,'Membership #'!$A$1:$C$1005,3,FALSE)))","v":{"$error":"#N/A"}}]
[18,922,{"$f":"IF(B20=\"\",\"\",(VLOOKUP(B20,'Membership #'!$A$1:$C$1005,2,FALSE)))","v":"Stevi Jardine"},{"$f":"IF(B20=\"\",\"\",(VLOOKUP(B20,'Membership #'!$A$1:$C$1005,3,FALSE)))","v":"Paytons Pretty Cool"}]
[19,777,{"$f":"IF(B21=\"\",\"\",(VLOOKUP(B21,'Membership #'!$A$1:$C$1005,2,FALSE)))","v":"Julia Parker"},{"$f":"IF(B21=\"\",\"\",(VLOOKUP(B21,'Membership #'!$A$1:$C$1005,3,FALSE)))","v":"Doc's Spirit Prairie"}]
[20,655,{"$f":"IF(B22=\"\",\"\",(VLOOKUP(B22,'Membership #'!$A$1:$C$1005,2,FALSE)))","v":"Julia Parker"},{"$f":"IF(B22=\"\",\"\",(VLOOKUP(B22,'Membership #'!$A$1:$C$1005,3,FALSE)))","v":"Boons Feature Star"}]
[21,647,{"$f":"IF(B23=\"\",\"\",(VLOOKUP(B23,'Membership #'!$A$1:$C$1005,2,FALSE)))","v":"Courtney Parker"},{"$f":"IF(B23=\"\",\"\",(VLOOKUP(B23,'Membership #'!$A$1:$C$1005,3,FALSE)))","v":"BW Rare Kinda Love"}]
[22,652,{"$f":"IF(B24=\"\",\"\",(VLOOKUP(B24,'Membership #'!$A$1:$C$1005,2,FALSE)))","v":"Molly O'Grady"},{"$f":"IF(B24=\"\",\"\",(VLOOKUP(B24,'Membership #'!$A$1:$C$1005,3,FALSE)))","v":"Teelano's Twister"}]
[23,700,{"$f":"IF(B25=\"\",\"\",(VLOOKUP(B25,'Membership #'!$A$1:$C$1005,2,FALSE)))","v":"Lindsay Baker"},{"$f":"IF(B25=\"\",\"\",(VLOOKUP(B25,'Membership #'!$A$1:$C$1005,3,FALSE)))","v":"Boons Laughing Boy"}]
[24,703,{"$f":"IF(B26=\"\",\"\",(VLOOKUP(B26,'Membership #'!$A$1:$C$1005,2,FALSE)))","v":"Chris Baker"},{"$f":"IF(B26=\"\",\"\",(VLOOKUP(B26,'Membership #'!$A$1:$C$1005,3,FALSE)))","v":"Jamer All Fired Up"}]
[25,710,{"$f":"IF(B27=\"\",\"\",(VLOOKUP(B27,'Membership #'!$A$1:$C$1005,2,FALSE)))","v":"Owen Baker"},{"$f":"IF(B27=\"\",\"\",(VLOOKUP(B27,'Membership #'!$A$1:$C$1005,3,FALSE)))","v":"Tip It Back"}]
[26,702,{"$f":"IF(B28=\"\",\"\",(VLOOKUP(B28,'Membership #'!$A$1:$C$1005,2,FALSE)))","v":"Jenna Proctor"},{"$f":"IF(B28=\"\",\"\",(VLOOKUP(B28,'Membership #'!$A$1:$C$1005,3,FALSE)))","v":"Painted to Perfection"}]
[27,786,{"$f":"IF(B29=\"\",\"\",(VLOOKUP(B29,'Membership #'!$A$1:$C$1005,2,FALSE)))","v":"Rileigh Conrod"},{"$f":"IF(B29=\"\",\"\",(VLOOKUP(B29,'Membership #'!$A$1:$C$1005,3,FALSE)))","v":"Scotches Harley"}]
[28,91,{"$f":"IF(B30=\"\",\"\",(VLOOKUP(B30,'Membership #'!$A$1:$C$1005,2,FALSE)))","v":{"$error":"#N/A"}},{"$f":"IF(B30=\"\",\"\",(VLOOKUP(B30,'Membership #'!$A$1:$C$1005,3,FALSE)))","v":{"$error":"#N/A"}}]
[29,638,{"$f":"IF(B31=\"\",\"\",(VLOOKUP(B31,'Membership #'!$A$1:$C$1005,2,FALSE)))","v":"Bella Peters"},{"$f":"IF(B31=\"\",\"\",(VLOOKUP(B31,'Membership #'!$A$1:$C$1005,3,FALSE)))","v":"Super Star"}]
[30,516,{"$f":"IF(B32=\"\",\"\",(VLOOKUP(B32,'Membership #'!$A$1:$C$1005,2,FALSE)))","v":"Laurie Don Reginato"},{"$f":"IF(B32=\"\",\"\",(VLOOKUP(B32,'Membership #'!$A$1:$C$1005,3,FALSE)))","v":"TCR Gold Runny"}]
[31,531,{"$f":"IF(B33=\"\",\"\",(VLOOKUP(B33,'Membership #'!$A$1:$C$1005,2,FALSE)))","v":"Addison Peters"},{"$f":"IF(B33=\"\",\"\",(VLOOKUP(B33,'Membership #'!$A$1:$C$1005,3,FALSE)))","v":"He's A Little Wonder"}]
[32,746,{"$f":"IF(B34=\"\",\"\",(VLOOKUP(B34,'Membership #'!$A$1:$C$1005,2,FALSE)))","v":"Cassie MacDonald"},{"$f":"IF(B34=\"\",\"\",(VLOOKUP(B34,'Membership #'!$A$1:$C$1005,3,FALSE)))","v":"Sandy Dew"}]
[33,914,{"$f":"IF(B35=\"\",\"\",(VLOOKUP(B35,'Membership #'!$A$1:$C$1005,2,FALSE)))","v":"Shelby MacPherson"},{"$f":"IF(B35=\"\",\"\",(VLOOKUP(B35,'Membership #'!$A$1:$C$1005,3,FALSE)))","v":"Shelbys Badger Bar"}]
[34,600,{"$f":"IF(B36=\"\",\"\",(VLOOKUP(B36,'Membership #'!$A$1:$C$1005,2,FALSE)))","v":"Stan Brown"},{"$f":"IF(B36=\"\",\"\",(VLOOKUP(B36,'Membership #'!$A$1:$C$1005,3,FALSE)))","v":"A Perty Sure Thing"}]
[35,698,{"$f":"IF(B37=\"\",\"\",(VLOOKUP(B37,'Membership #'!$A$1:$C$1005,2,FALSE)))","v":"Kaleigh Denton"},{"$f":"IF(B37=\"\",\"\",(VLOOKUP(B37,'Membership #'!$A$1:$C$1005,3,FALSE)))","v":"Coleasaki"}]
[36,534,{"$f":"IF(B38=\"\",\"\",(VLOOKUP(B38,'Membership #'!$A$1:$C$1005,2,FALSE)))","v":"Mary Lou Rankin Dentin"},{"$f":"IF(B38=\"\",\"\",(VLOOKUP(B38,'Membership #'!$A$1:$C$1005,3,FALSE)))","v":"Brandy's Chocolena"}]
[37,918,{"$f":"IF(B39=\"\",\"\",(VLOOKUP(B39,'Membership #'!$A$1:$C$1005,2,FALSE)))","v":"Keira Rose"},{"$f":"IF(B39=\"\",\"\",(VLOOKUP(B39,'Membership #'!$A$1:$C$1005,3,FALSE)))","v":"LL Its All About Red"}]
[38,967,{"$f":"IF(B40=\"\",\"\",(VLOOKUP(B40,'Membership #'!$A$1:$C$1005,2,FALSE)))","v":"Marissa Hillier"},{"$f":"IF(B40=\"\",\"\",(VLOOKUP(B40,'Membership #'!$A$1:$C$1005,3,FALSE)))","v":"Notice Betty Boop"}]
[39,695,{"$f":"IF(B41=\"\",\"\",(VLOOKUP(B41,'Membership #'!$A$1:$C$1005,2,FALSE)))","v":"Tessa Dicks"},{"$f":"IF(B41=\"\",\"\",(VLOOKUP(B41,'Membership #'!$A$1:$C$1005,3,FALSE)))","v":"Charge's Dusty Luck"}]
[40,928,{"$f":"IF(B42=\"\",\"\",(VLOOKUP(B42,'Membership #'!$A$1:$C$1005,2,FALSE)))","v":"Tessa Dicks"},{"$f":"IF(B42=\"\",\"\",(VLOOKUP(B42,'Membership #'!$A$1:$C$1005,3,FALSE)))","v":"ELM Dash of Crime"}]
[41,971,{"$f":"IF(B43=\"\",\"\",(VLOOKUP(B43,'Membership #'!$A$1:$C$1005,2,FALSE)))","v":"Arielle Burke"},{"$f":"IF(B43=\"\",\"\",(VLOOKUP(B43,'Membership #'!$A$1:$C$1005,3,FALSE)))","v":"Elm Sally"}]
[42,732,{"$f":"IF(B44=\"\",\"\",(VLOOKUP(B44,'Membership #'!$A$1:$C$1005,2,FALSE)))","v":"Brenna Carrigan"},{"$f":"IF(B44=\"\",\"\",(VLOOKUP(B44,'Membership #'!$A$1:$C$1005,3,FALSE)))","v":"Carlos"}]
[43,855,{"$f":"IF(B45=\"\",\"\",(VLOOKUP(B45,'Membership #'!$A$1:$C$1005,2,FALSE)))","v":"Jenelle Collier"},{"$f":"IF(B45=\"\",\"\",(VLOOKUP(B45,'Membership #'!$A$1:$C$1005,3,FALSE)))","v":"Peppy Sans Surprise"}]
[44,518,{"$f":"IF(B46=\"\",\"\",(VLOOKUP(B46,'Membership #'!$A$1:$C$1005,2,FALSE)))","v":"Sylvester Weatherbie"},{"$f":"IF(B46=\"\",\"\",(VLOOKUP(B46,'Membership #'!$A$1:$C$1005,3,FALSE)))","v":"J.R."}]
[45,657,{"$f":"IF(B47=\"\",\"\",(VLOOKUP(B47,'Membership #'!$A$1:$C$1005,2,FALSE)))","v":"Laura Morrison"},{"$f":"IF(B47=\"\",\"\",(VLOOKUP(B47,'Membership #'!$A$1:$C$1005,3,FALSE)))","v":"Steal Ta Fame"}]
[46,699,{"$f":"IF(B48=\"\",\"\",(VLOOKUP(B48,'Membership #'!$A$1:$C$1005,2,FALSE)))","v":"Laura Morrison"},{"$f":"IF(B48=\"\",\"\",(VLOOKUP(B48,'Membership #'!$A$1:$C$1005,3,FALSE)))","v":"MDC Dark Revelation"}]
[47,514,{"$f":"IF(B49=\"\",\"\",(VLOOKUP(B49,'Membership #'!$A$1:$C$1005,2,FALSE)))","v":"Heather Morrison"},{"$f":"IF(B49=\"\",\"\",(VLOOKUP(B49,'Membership #'!$A$1:$C$1005,3,FALSE)))","v":"Black Fire Dash"}]
[48,636,{"$f":"IF(B50=\"\",\"\",(VLOOKUP(B50,'Membership #'!$A$1:$C$1005,2,FALSE)))","v":"Ceilidh Gosse"},{"$f":"IF(B50=\"\",\"\",(VLOOKUP(B50,'Membership #'!$A$1:$C$1005,3,FALSE)))","v":"ELM Silver Crime"}]
[49,867,{"$f":"IF(B51=\"\",\"\",(VLOOKUP(B51,'Membership #'!$A$1:$C$1005,2,FALSE)))","v":"Layla MacEachem"},{"$f":"IF(B51=\"\",\"\",(VLOOKUP(B51,'Membership #'!$A$1:$C$1005,3,FALSE)))","v":"Shes a gem"}]
[50,539,{"$f":"IF(B52=\"\",\"\",(VLOOKUP(B52,'Membership #'!$A$1:$C$1005,2,FALSE)))","v":"Alex Singer"},{"$f":"IF(B52=\"\",\"\",(VLOOKUP(B52,'Membership #'!$A$1:$C$1005,3,FALSE)))","v":"Plain White Trash"}]
[51,892,{"$f":"IF(B53=\"\",\"\",(VLOOKUP(B53,'Membership #'!$A$1:$C$1005,2,FALSE)))","v":"Donnie MacNeil"},{"$f":"IF(B53=\"\",\"\",(VLOOKUP(B53,'Membership #'!$A$1:$C$1005,3,FALSE)))","v":"Gifted Go Gold"}]
[52,556,{"$f":"IF(B54=\"\",\"\",(VLOOKUP(B54,'Membership #'!$A$1:$C$1005,2,FALSE)))","v":"Stephaine Clark"},{"$f":"IF(B54=\"\",\"\",(VLOOKUP(B54,'Membership #'!$A$1:$C$1005,3,FALSE)))","v":"Perks A Flyin"}]
[53,666,{"$f":"IF(B55=\"\",\"\",(VLOOKUP(B55,'Membership #'!$A$1:$C$1005,2,FALSE)))","v":"Summer Fraser"},{"$f":"IF(B55=\"\",\"\",(VLOOKUP(B55,'Membership #'!$A$1:$C$1005,3,FALSE)))","v":"Sheza Smokin' Girl"}]
[54,961,{"$f":"IF(B56=\"\",\"\",(VLOOKUP(B56,'Membership #'!$A$1:$C$1005,2,FALSE)))","v":"Jacie Burke"},{"$f":"IF(B56=\"\",\"\",(VLOOKUP(B56,'Membership #'!$A$1:$C$1005,3,FALSE)))","v":"She's Just That Sassy"}]
[55,962,{"$f":"IF(B57=\"\",\"\",(VLOOKUP(B57,'Membership #'!$A$1:$C$1005,2,FALSE)))","v":"Hariin Burke"},{"$f":"IF(B57=\"\",\"\",(VLOOKUP(B57,'Membership #'!$A$1:$C$1005,3,FALSE)))","v":"Olds Bold Impulse"}]
[56,963,{"$f":"IF(B58=\"\",\"\",(VLOOKUP(B58,'Membership #'!$A$1:$C$1005,2,FALSE)))","v":"Leighton Burke"},{"$f":"IF(B58=\"\",\"\",(VLOOKUP(B58,'Membership #'!$A$1:$C$1005,3,FALSE)))","v":"Boot Scootin Boogie"}]
[57,909,{"$f":"IF(B59=\"\",\"\",(VLOOKUP(B59,'Membership #'!$A$1:$C$1005,2,FALSE)))","v":"Rebecca Gillis"},{"$f":"IF(B59=\"\",\"\",(VLOOKUP(B59,'Membership #'!$A$1:$C$1005,3,FALSE)))","v":"Martha's Tivio Moon"}]
[58,583,{"$f":"IF(B60=\"\",\"\",(VLOOKUP(B60,'Membership #'!$A$1:$C$1005,2,FALSE)))","v":"Travis Patterson"},{"$f":"IF(B60=\"\",\"\",(VLOOKUP(B60,'Membership #'!$A$1:$C$1005,3,FALSE)))","v":"JT Rosie"}]
[59,523,{"$f":"IF(B61=\"\",\"\",(VLOOKUP(B61,'Membership #'!$A$1:$C$1005,2,FALSE)))","v":"Nicole Dobson"},{"$f":"IF(B61=\"\",\"\",(VLOOKUP(B61,'Membership #'!$A$1:$C$1005,3,FALSE)))","v":"Barbeesimpossibleinprint"}]
[60,null,{"$f":"IF(B62=\"\",\"\",(VLOOKUP(B62,'Membership #'!$A$1:$C$1005,2,FALSE)))","v":""},{"$f":"IF(B62=\"\",\"\",(VLOOKUP(B62,'Membership #'!$A$1:$C$1005,3,FALSE)))","v":""}]
[61,null,{"$f":"IF(B63=\"\",\"\",(VLOOKUP(B63,'Membership #'!$A$1:$C$1005,2,FALSE)))","v":""},{"$f":"IF(B63=\"\",\"\",(VLOOKUP(B63,'Membership #'!$A$1:$C$1005,3,FALSE)))","v":""}]
[62,null,{"$f":"IF(B64=\"\",\"\",(VLOOKUP(B64,'Membership #'!$A$1:$C$1005,2,FALSE)))","v":""},{"$f":"IF(B64=\"\",\"\",(VLOOKUP(B64,'Membership #'!$A$1:$C$1005,3,FALSE)))","v":""}]
[63,null,{"$f":"IF(B65=\"\",\"\",(VLOOKUP(B65,'Membership #'!$A$1:$C$1005,2,FALSE)))","v":""},{"$f":"IF(B65=\"\",\"\",(VLOOKUP(B65,'Membership #'!$A$1:$C$1005,3,FALSE)))","v":""}]
[64,null,{"$f":"IF(B66=\"\",\"\",(VLOOKUP(B66,'Membership #'!$A$1:$C$1005,2,FALSE)))","v":""},{"$f":"IF(B66=\"\",\"\",(VLOOKUP(B66,'Membership #'!$A$1:$C$1005,3,FALSE)))","v":""}]
[65,null,{"$f":"IF(B67=\"\",\"\",(VLOOKUP(B67,'Membership #'!$A$1:$C$1005,2,FALSE)))","v":""},{"$f":"IF(B67=\"\",\"\",(VLOOKUP(B67,'Membership #'!$A$1:$C$1005,3,FALSE)))","v":""}]
[66,null,{"$f":"IF(B68=\"\",\"\",(VLOOKUP(B68,'Membership #'!$A$1:$C$1005,2,FALSE)))","v":""},{"$f":"IF(B68=\"\",\"\",(VLOOKUP(B68,'Membership #'!$A$1:$C$1005,3,FALSE)))","v":""}]
[67,null,{"$f":"IF(B69=\"\",\"\",(VLOOKUP(B69,'Membership #'!$A$1:$C$1005,2,FALSE)))","v":""},{"$f":"IF(B69=\"\",\"\",(VLOOKUP(B69,'Membership #'!$A$1:$C$1005,3,FALSE)))","v":""}]
[68,null,{"$f":"IF(B70=\"\",\"\",(VLOOKUP(B70,'Membership #'!$A$1:$C$1005,2,FALSE)))","v":""},{"$f":"IF(B70=\"\",\"\",(VLOOKUP(B70,'Membership #'!$A$1:$C$1005,3,FALSE)))","v":""}]
[69,null,{"$f":"IF(B71=\"\",\"\",(VLOOKUP(B71,'Membership #'!$A$1:$C$1005,2,FALSE)))","v":""},{"$f":"IF(B71=\"\",\"\",(VLOOKUP(B71,'Membership #'!$A$1:$C$1005,3,FALSE)))","v":""}]
[70,null,null,{"$f":"IF(B72=\"\",\"\",(VLOOKUP(B72,'Membership #'!$A$1:$C$1005,3,FALSE)))","v":""}]
[71,null,null,{"$f":"IF(B73=\"\",\"\",(VLOOKUP(B73,'Membership #'!$A$1:$C$1005,3,FALSE)))","v":""}]
[72,null,null,{"$f":"IF(B74=\"\",\"\",(VLOOKUP(B74,'Membership #'!$A$1:$C$1005,3,FALSE)))","v":""}]
[73,null,null,{"$f":"IF(B75=\"\",\"\",(VLOOKUP(B75,'Membership #'!$A$1:$C$1005,3,FALSE)))","v":""}]
[74,null,null,{"$f":"IF(B76=\"\",\"\",(VLOOKUP(B76,'Membership #'!$A$1:$C$1005,3,FALSE)))","v":""}]
[75,null,null,{"$f":"IF(B77=\"\",\"\",(VLOOKUP(B77,'Membership #'!$A$1:$C$1005,3,FALSE)))","v":""}]
[76,null,null,{"$f":"IF(B78=\"\",\"\",(VLOOKUP(B78,'Membership #'!$A$1:$C$1005,3,FALSE)))","v":""}]
[77,null,null,{"$f":"IF(B79=\"\",\"\",(VLOOKUP(B79,'Membership #'!$A$1:$C$1005,3,FALSE)))","v":""}]
[78,null,null,{"$f":"IF(B80=\"\",\"\",(VLOOKUP(B80,'Membership #'!$A$1:$C$1005,3,FALSE)))","v":""}]
[79,null,null,{"$f":"IF(B81=\"\",\"\",(VLOOKUP(B81,'Membership #'!$A$1:$C$1005,3,FALSE)))","v":""}]
[80,null,null,{"$f":"IF(B82=\"\",\"\",(VLOOKUP(B82,'Membership #'!$A$1:$C$1005,3,FALSE)))","v":""}]
[81,null,null,{"$f":"IF(B83=\"\",\"\",(VLOOKUP(B83,'Membership #'!$A$1:$C$1005,3,FALSE)))","v":""}]
[82,null,null,{"$f":"IF(B84=\"\",\"\",(VLOOKUP(B84,'Membership #'!$A$1:$C$1005,3,FALSE)))","v":""}]
[83,null,null,{"$f":"IF(B85=\"\",\"\",(VLOOKUP(B85,'Membership #'!$A$1:$C$1005,3,FALSE)))","v":""}]
[84,null,null,{"$f":"IF(B86=\"\",\"\",(VLOOKUP(B86,'Membership #'!$A$1:$C$1005,3,FALSE)))","v":""}]
[85,null,null,{"$f":"IF(B87=\"\",\"\",(VLOOKUP(B87,'Membership #'!$A$1:$C$1005,3,FALSE)))","v":""}]
[86,null,null,{"$f":"IF(B88=\"\",\"\",(VLOOKUP(B88,'Membership #'!$A$1:$C$1005,3,FALSE)))","v":""}]
[87,null,null,{"$f":"IF(B89=\"\",\"\",(VLOOKUP(B89,'Membership #'!$A$1:$C$1005,3,FALSE)))","v":""}]
[88,null,null,{"$f":"IF(B90=\"\",\"\",(VLOOKUP(B90,'Membership #'!$A$1:$C$1005,3,FALSE)))","v":""}]
[89,null,null,{"$f":"IF(B91=\"\",\"\",(VLOOKUP(B91,'Membership #'!$A$1:$C$1005,3,FALSE)))","v":""}]
[90,null,null,{"$f":"IF(B92=\"\",\"\",(VLOOKUP(B92,'Membership #'!$A$1:$C$1005,3,FALSE)))","v":""}]
[91,null,null,{"$f":"IF(B93=\"\",\"\",(VLOOKUP(B93,'Membership #'!$A$1:$C$1005,3,FALSE)))","v":""}]
[92,null,null,{"$f":"IF(B94=\"\",\"\",(VLOOKUP(B94,'Membership #'!$A$1:$C$1005,3,FALSE)))","v":""}]
[93,null,null,{"$f":"IF(B95=\"\",\"\",(VLOOKUP(B95,'Membership #'!$A$1:$C$1005,3,FALSE)))","v":""}]
[94,null,null,{"$f":"IF(B96=\"\",\"\",(VLOOKUP(B96,'Membership #'!$A$1:$C$1005,3,FALSE)))","v":""}]
[95,null,null,{"$f":"IF(B97=\"\",\"\",(VLOOKUP(B97,'Membership #'!$A$1:$C$1005,3,FALSE)))","v":""}]
[96,null,null,{"$f":"IF(B98=\"\",\"\",(VLOOKUP(B98,'Membership #'!$A$1:$C$1005,3,FALSE)))","v":""}]
[97,null,null,{"$f":"IF(B99=\"\",\"\",(VLOOKUP(B99,'Membership #'!$A$1:$C$1005,3,FALSE)))","v":""}]
[98,null,null,{"$f":"IF(B100=\"\",\"\",(VLOOKUP(B100,'Membership #'!$A$1:$C$1005,3,FALSE)))","v":""}]
[99,null,null,{"$f":"IF(B101=\"\",\"\",(VLOOKUP(B101,'Membership #'!$A$1:$C$1005,3,FALSE)))","v":""}]
[100,null,null,{"$f":"IF(B102=\"\",\"\",(VLOOKUP(B102,'Membership #'!$A$1:$C$1005,3,FALSE)))","v":""}]
[101,null,null,{"$f":"IF(B103=\"\",\"\",(VLOOKUP(B103,'Membership #'!$A$1:$C$1005,3,FALSE)))","v":""}]
[102,null,null,{"$f":"IF(B104=\"\",\"\",(VLOOKUP(B104,'Membership #'!$A$1:$C$1005,3,FALSE)))","v":""}]
[103,null,null,{"$f":"IF(B105=\"\",\"\",(VLOOKUP(B105,'Membership #'!$A$1:$C$1005,3,FALSE)))","v":""}]
[104,null,null,{"$f":"IF(B106=\"\",\"\",(VLOOKUP(B106,'Membership #'!$A$1:$C$1005,3,FALSE)))","v":""}]
[105,null,null,{"$f":"IF(B107=\"\",\"\",(VLOOKUP(B107,'Membership #'!$A$1:$C$1005,3,FALSE)))","v":""}]
[106,null,null,{"$f":"IF(B108=\"\",\"\",(VLOOKUP(B108,'Membership #'!$A$1:$C$1005,3,FALSE)))","v":""}]
[107,null,null,{"$f":"IF(B109=\"\",\"\",(VLOOKUP(B109,'Membership #'!$A$1:$C$1005,3,FALSE)))","v":""}]
[108,null,null,{"$f":"IF(B110=\"\",\"\",(VLOOKUP(B110,'Membership #'!$A$1:$C$1005,3,FALSE)))","v":""}]
[109,null,null,{"$f":"IF(B111=\"\",\"\",(VLOOKUP(B111,'Membership #'!$A$1:$C$1005,3,FALSE)))","v":""}]
[110,null,null,{"$f":"IF(B112=\"\",\"\",(VLOOKUP(B112,'Membership #'!$A$1:$C$1005,3,FALSE)))","v":""}]
[111,null,null,{"$f":"IF(B113=\"\",\"\",(VLOOKUP(B113,'Membership #'!$A$1:$C$1005,3,FALSE)))","v":""}]
[null,null,null,{"$f":"IF(B114=\"\",\"\",(VLOOKUP(B114,'Membership #'!$A$1:$C$1005,3,FALSE)))","v":""}]
[null,null,{"$f":"IF(B115=\"\",\"\",(VLOOKUP(B115,'Membership #'!$A$1:$C$377,2,FALSE)))","v":""},{"$f":"IF(B115=\"\",\"\",(VLOOKUP(B115,'Membership #'!$A$1:$C$377,3,FALSE)))","v":""}]
[null,null,{"$f":"IF(B116=\"\",\"\",(VLOOKUP(B116,'Membership #'!$A$1:$C$377,2,FALSE)))","v":""},{"$f":"IF(B116=\"\",\"\",(VLOOKUP(B116,'Membership #'!$A$1:$C$377,3,FALSE)))","v":""}]

{"sheet":"MBRA ","index":2,"n_rows":114,"n_cols":24,"rows_kept":114,"cut":false,"hidden":false,"merged":[[0,0,0,12]]}
["Tom Burt & Mark McGuire Memorial JACKPOT Aug 21 & 22, 2021"]
[null,"RING #      ","NAME","HORSE NAME","Exhibition ",null," Day #1 Fee","3-D Barrels","Day /2 Fee","Admin Fee","Drug Fee","Trailer Fee","Total","Etransfrer"]
[1,549,{"$f":"IF(B3=\"\",\"\",(VLOOKUP(B3,'Membership #'!$A$1:$C$1005,2,FALSE)))","v":"Chris MacLean"},{"$f":"IF(B3=\"\",\"\",(VLOOKUP(B3,'Membership #'!$A$1:$C$1005,3,FALSE)))","v":"Lena`s Little Hayday"},null,null,20,15,40,50,5,40,{"$f":"SUM(G3:L3)","v":170},null,null,null,{"$f":"SUM(M3:P3)","v":170}]
[2,591,{"$f":"IF(B4=\"\",\"\",(VLOOKUP(B4,'Membership #'!$A$1:$C$1005,2,FALSE)))","v":"Wendy MacLean"},{"$f":"IF(B4=\"\",\"\",(VLOOKUP(B4,'Membership #'!$A$1:$C$1005,3,FALSE)))","v":"White Sox N Flyin"},null,null,10,15,10,50,5,null,{"$f":"SUM(G4:K4)","v":90},null,null,null,{"$f":"SUM(M4:P4)","v":90}]
[3,532,{"$f":"IF(B5=\"\",\"\",(VLOOKUP(B5,'Membership #'!$A$1:$C$1005,2,FALSE)))","v":"Gracie MacLean"},{"$f":"IF(B5=\"\",\"\",(VLOOKUP(B5,'Membership #'!$A$1:$C$1005,3,FALSE)))","v":"Secret"},null,null,5,null,15,50,5,null,75,null,null,null,75]
[4,563,{"$f":"IF(B6=\"\",\"\",(VLOOKUP(B6,'Membership #'!$A$1:$C$1005,2,FALSE)))","v":"Kevin Bateman"},{"$f":"IF(B6=\"\",\"\",(VLOOKUP(B6,'Membership #'!$A$1:$C$1005,3,FALSE)))","v":"Jess Chasin A Hobby"},null,null,10,15,10,50,5,null,90,null,null,null,90]
[5,616,{"$f":"IF(B7=\"\",\"\",(VLOOKUP(B7,'Membership #'!$A$1:$C$1005,2,FALSE)))","v":"Judy Bateman"},{"$f":"IF(B7=\"\",\"\",(VLOOKUP(B7,'Membership #'!$A$1:$C$1005,3,FALSE)))","v":"HM HollywoodRockstar"},null,null,40,15,40,50,5,40,{"$f":"SUM(G7:L7)","v":190},null,null,null,190]
[6,530,{"$f":"IF(B8=\"\",\"\",(VLOOKUP(B8,'Membership #'!$A$1:$C$1005,2,FALSE)))","v":"Joan Grant"},{"$f":"IF(B8=\"\",\"\",(VLOOKUP(B8,'Membership #'!$A$1:$C$1005,3,FALSE)))","v":"SLS Dash to Holland"},null,null,20,15,20,50,5,40,{"$f":"SUM(G8:L8)","v":150},null,null,null,150]
[7,515,{"$f":"IF(B9=\"\",\"\",(VLOOKUP(B9,'Membership #'!$A$1:$C$1005,2,FALSE)))","v":"Ed Grant"},{"$f":"IF(B9=\"\",\"\",(VLOOKUP(B9,'Membership #'!$A$1:$C$1005,3,FALSE)))","v":"I Own A Corona"},null,null,10,null,10,50,5,null,75,null,null,null,75]
[8,968,{"$f":"IF(B10=\"\",\"\",(VLOOKUP(B10,'Membership #'!$A$1:$C$1005,2,FALSE)))","v":"Madison Pelly"},{"$f":"IF(B10=\"\",\"\",(VLOOKUP(B10,'Membership #'!$A$1:$C$1005,3,FALSE)))","v":"Westin"},null,null,10,15,10,50,5,null,90,null,null,null,90]
[9,768,{"$f":"IF(B11=\"\",\"\",(VLOOKUP(B11,'Membership #'!$A$1:$C$1005,2,FALSE)))","v":"Tracey Higgins"},{"$f":"IF(B11=\"\",\"\",(VLOOKUP(B11,'Membership #'!$A$1:$C$1005,3,FALSE)))","v":"Iza Wicked Wind"},null,null,10,15,10,50,5,40,{"$f":"SUM(G11:L11)","v":130},null,null,null,130]
[10,608,{"$f":"IF(B12=\"\",\"\",(VLOOKUP(B12,'Membership #'!$A$1:$C$1005,2,FALSE)))","v":"Kate Madsen"},{"$f":"IF(B12=\"\",\"\",(VLOOKUP(B12,'Membership #'!$A$1:$C$1005,3,FALSE)))","v":"Slide on Bye"},null,null,null,null,null,50,5,null,55,null,null,null,55]
[11,815,{"$f":"IF(B13=\"\",\"\",(VLOOKUP(B13,'Membership #'!$A$1:$C$1005,2,FALSE)))","v":"Brooke Kennedy"},{"$f":"IF(B13=\"\",\"\",(VLOOKUP(B13,'Membership #'!$A$1:$C$1005,3,FALSE)))","v":"Tic Toc Teazer"},null,null,10,15,10,50,5,null,90,null,null,null,90]
[12,750,{"$f":"IF(B14=\"\",\"\",(VLOOKUP(B14,'Membership #'!$A$1:$C$1005,2,FALSE)))","v":"Tanya Kennedy"},{"$f":"IF(B14=\"\",\"\",(VLOOKUP(B14,'Membership #'!$A$1:$C$1005,3,FALSE)))","v":"Old Stations Pride"},null,null,30,15,30,50,5,40,{"$f":"SUM(G14:L14)","v":170},null,null,null,170]
[13,684,{"$f":"IF(B15=\"\",\"\",(VLOOKUP(B15,'Membership #'!$A$1:$C$1005,2,FALSE)))","v":"Shann Cox"},{"$f":"IF(B15=\"\",\"\",(VLOOKUP(B15,'Membership #'!$A$1:$C$1005,3,FALSE)))","v":"Jags Cash Flow"},null,null,40,15,40,50,5,null,150,null,null,null,150]
[14,688,{"$f":"IF(B16=\"\",\"\",(VLOOKUP(B16,'Membership #'!$A$1:$C$1005,2,FALSE)))","v":"Lenee Sampson"},{"$f":"IF(B16=\"\",\"\",(VLOOKUP(B16,'Membership #'!$A$1:$C$1005,3,FALSE)))","v":"Six Dash Run"},null,null,40,15,25,50,5,null,135,null,null,null,135]
[15,80,{"$f":"IF(B17=\"\",\"\",(VLOOKUP(B17,'Membership #'!$A$1:$C$1005,2,FALSE)))","v":{"$error":"#N/A"}},{"$f":"IF(B17=\"\",\"\",(VLOOKUP(B17,'Membership #'!$A$1:$C$1005,3,FALSE)))","v":{"$error":"#N/A"}},null,null,50,15,70,50,5,null,190,null,null,null,190]
[16,922,{"$f":"IF(B18=\"\",\"\",(VLOOKUP(B18,'Membership #'!$A$1:$C$1005,2,FALSE)))","v":"Stevi Jardine"},{"$f":"IF(B18=\"\",\"\",(VLOOKUP(B18,'Membership #'!$A$1:$C$1005,3,FALSE)))","v":"Paytons Pretty Cool"},null,null,40,15,40,50,5,40,{"$f":"SUM(G18:L18)","v":190},null,null,null,190]
[17,777,{"$f":"IF(B19=\"\",\"\",(VLOOKUP(B19,'Membership #'!$A$1:$C$1005,2,FALSE)))","v":"Julia Parker"},{"$f":"IF(B19=\"\",\"\",(VLOOKUP(B19,'Membership #'!$A$1:$C$1005,3,FALSE)))","v":"Doc's Spirit Prairie"},null,null,40,15,40,50,5,40,{"$f":"SUM(G19:L19)","v":190},null,null,null,190]
[18,655,{"$f":"IF(B20=\"\",\"\",(VLOOKUP(B20,'Membership #'!$A$1:$C$1005,2,FALSE)))","v":"Julia Parker"},{"$f":"IF(B20=\"\",\"\",(VLOOKUP(B20,'Membership #'!$A$1:$C$1005,3,FALSE)))","v":"Boons Feature Star"},null,null,30,15,30,50,5,null,130,null,null,null,130]
[19,647,{"$f":"IF(B21=\"\",\"\",(VLOOKUP(B21,'Membership #'!$A$1:$C$1005,2,FALSE)))","v":"Courtney Parker"},{"$f":"IF(B21=\"\",\"\",(VLOOKUP(B21,'Membership #'!$A$1:$C$1005,3,FALSE)))","v":"BW Rare Kinda Love"},null,null,20,15,20,50,5,null,110,null,null,null,110]
[20,652,{"$f":"IF(B22=\"\",\"\",(VLOOKUP(B22,'Membership #'!$A$1:$C$1005,2,FALSE)))","v":"Molly O'Grady"},{"$f":"IF(B22=\"\",\"\",(VLOOKUP(B22,'Membership #'!$A$1:$C$1005,3,FALSE)))","v":"Teelano's Twister"},null,null,30,null,30,50,5,null,115,null,null,null,115]
[21,700,{"$f":"IF(B23=\"\",\"\",(VLOOKUP(B23,'Membership #'!$A$1:$C$1005,2,FALSE)))","v":"Lindsay Baker"},{"$f":"IF(B23=\"\",\"\",(VLOOKUP(B23,'Membership #'!$A$1:$C$1005,3,FALSE)))","v":"Boons Laughing Boy"},null,null,40,15,40,50,5,null,150,null,null,null,150]
[22,703,{"$f":"IF(B24=\"\",\"\",(VLOOKUP(B24,'Membership #'!$A$1:$C$1005,2,FALSE)))","v":"Chris Baker"},{"$f":"IF(B24=\"\",\"\",(VLOOKUP(B24,'Membership #'!$A$1:$C$1005,3,FALSE)))","v":"Jamer All Fired Up"},null,null,40,15,40,50,5,40,{"$f":"SUM(G24:L24)","v":190},null,null,null,190]
[23,710,{"$f":"IF(B25=\"\",\"\",(VLOOKUP(B25,'Membership #'!$A$1:$C$1005,2,FALSE)))","v":"Owen Baker"},{"$f":"IF(B25=\"\",\"\",(VLOOKUP(B25,'Membership #'!$A$1:$C$1005,3,FALSE)))","v":"Tip It Back"},null,null,null,null,null,50,5,null,55,null,null,null,55]
[24,753,{"$f":"IF(B26=\"\",\"\",(VLOOKUP(B26,'Membership #'!$A$1:$C$1005,2,FALSE)))","v":"Kayla Boudreau"},{"$f":"IF(B26=\"\",\"\",(VLOOKUP(B26,'Membership #'!$A$1:$C$1005,3,FALSE)))","v":"Lady Jane"},null,null,20,15,20,50,5,null,110,null,null,null,110]
[25,702,{"$f":"IF(B27=\"\",\"\",(VLOOKUP(B27,'Membership #'!$A$1:$C$1005,2,FALSE)))","v":"Jenna Proctor"},{"$f":"IF(B27=\"\",\"\",(VLOOKUP(B27,'Membership #'!$A$1:$C$1005,3,FALSE)))","v":"Painted to Perfection"},null,null,null,15,null,50,5,null,70,null,null,null,70]
[26,786,{"$f":"IF(B28=\"\",\"\",(VLOOKUP(B28,'Membership #'!$A$1:$C$1005,2,FALSE)))","v":"Rileigh Conrod"},{"$f":"IF(B28=\"\",\"\",(VLOOKUP(B28,'Membership #'!$A$1:$C$1005,3,FALSE)))","v":"Scotches Harley"},null,null,10,15,10,50,5,null,90,null,null,null,90]
[27,91,{"$f":"IF(B29=\"\",\"\",(VLOOKUP(B29,'Membership #'!$A$1:$C$1005,2,FALSE)))","v":{"$error":"#N/A"}},{"$f":"IF(B29=\"\",\"\",(VLOOKUP(B29,'Membership #'!$A$1:$C$1005,3,FALSE)))","v":{"$error":"#N/A"}},null,null,null,null,null,50,5,40,{"$f":"SUM(J29:L29)","v":95},null,null,null,95]
[28,638,{"$f":"IF(B30=\"\",\"\",(VLOOKUP(B30,'Membership #'!$A$1:$C$1005,2,FALSE)))","v":"Bella Peters"},{"$f":"IF(B30=\"\",\"\",(VLOOKUP(B30,'Membership #'!$A$1:$C$1005,3,FALSE)))","v":"Super Star"},null,null,10,15,10,50,5,null,90,null,null,null,90]
[29,516,{"$f":"IF(B31=\"\",\"\",(VLOOKUP(B31,'Membership #'!$A$1:$C$1005,2,FALSE)))","v":"Laurie Don Reginato"},{"$f":"IF(B31=\"\",\"\",(VLOOKUP(B31,'Membership #'!$A$1:$C$1005,3,FALSE)))","v":"TCR Gold Runny"},null,null,40,15,40,50,5,null,150,null,null,null,150]
[30,531,{"$f":"IF(B32=\"\",\"\",(VLOOKUP(B32,'Membership #'!$A$1:$C$1005,2,FALSE)))","v":"Addison Peters"},{"$f":"IF(B32=\"\",\"\",(VLOOKUP(B32,'Membership #'!$A$1:$C$1005,3,FALSE)))","v":"He's A Little Wonder"},null,null,null,null,null,50,5,null,55,null,null,null,55]
[31,746,{"$f":"IF(B33=\"\",\"\",(VLOOKUP(B33,'Membership #'!$A$1:$C$1005,2,FALSE)))","v":"Cassie MacDonald"},{"$f":"IF(B33=\"\",\"\",(VLOOKUP(B33,'Membership #'!$A$1:$C$1005,3,FALSE)))","v":"Sandy Dew"},null,null,20,null,20,50,5,null,95,null,null,null,95]
[32,914,{"$f":"IF(B34=\"\",\"\",(VLOOKUP(B34,'Membership #'!$A$1:$C$1005,2,FALSE)))","v":"Shelby MacPherson"},{"$f":"IF(B34=\"\",\"\",(VLOOKUP(B34,'Membership #'!$A$1:$C$1005,3,FALSE)))","v":"Shelbys Badger Bar"},null,null,50,15,50,50,5,null,170,null,null,null,170]
[33,600,{"$f":"IF(B35=\"\",\"\",(VLOOKUP(B35,'Membership #'!$A$1:$C$1005,2,FALSE)))","v":"Stan Brown"},{"$f":"IF(B35=\"\",\"\",(VLOOKUP(B35,'Membership #'!$A$1:$C$1005,3,FALSE)))","v":"A Perty Sure Thing"},null,null,20,15,20,50,5,null,110,null,null,null,110]
[34,698,{"$f":"IF(B36=\"\",\"\",(VLOOKUP(B36,'Membership #'!$A$1:$C$1005,2,FALSE)))","v":"Kaleigh Denton"},{"$f":"IF(B36=\"\",\"\",(VLOOKUP(B36,'Membership #'!$A$1:$C$1005,3,FALSE)))","v":"Coleasaki"},null,null,40,15,40,50,5,null,{"$f":"SUM(G36:K36)","v":150},null,null,null,150]
[35,534,{"$f":"IF(B37=\"\",\"\",(VLOOKUP(B37,'Membership #'!$A$1:$C$1005,2,FALSE)))","v":"Mary Lou Rankin Dentin"},{"$f":"IF(B37=\"\",\"\",(VLOOKUP(B37,'Membership #'!$A$1:$C$1005,3,FALSE)))","v":"Brandy's Chocolena"},null,null,20,15,20,50,5,null,110,null,null,null,110]
[36,918,{"$f":"IF(B38=\"\",\"\",(VLOOKUP(B38,'Membership #'!$A$1:$C$1005,2,FALSE)))","v":"Keira Rose"},{"$f":"IF(B38=\"\",\"\",(VLOOKUP(B38,'Membership #'!$A$1:$C$1005,3,FALSE)))","v":"LL Its All About Red"},null,null,40,15,40,50,5,null,150,null,null,null,150]
[37,967,{"$f":"IF(B39=\"\",\"\",(VLOOKUP(B39,'Membership #'!$A$1:$C$1005,2,FALSE)))","v":"Marissa Hillier"},{"$f":"IF(B39=\"\",\"\",(VLOOKUP(B39,'Membership #'!$A$1:$C$1005,3,FALSE)))","v":"Notice Betty Boop"},null,null,10,15,10,50,5,null,90,null,null,null,90]
[38,954,{"$f":"IF(B40=\"\",\"\",(VLOOKUP(B40,'Membership #'!$A$1:$C$1005,2,FALSE)))","v":"Scotia MacEachern"},{"$f":"IF(B40=\"\",\"\",(VLOOKUP(B40,'Membership #'!$A$1:$C$1005,3,FALSE)))","v":"Hick-a-Licious"},null,null,30,15,30,50,5,null,130,null,null,null,130]
[39,855,{"$f":"IF(B41=\"\",\"\",(VLOOKUP(B41,'Membership #'!$A$1:$C$1005,2,FALSE)))","v":"Jenelle Collier"},{"$f":"IF(B41=\"\",\"\",(VLOOKUP(B41,'Membership #'!$A$1:$C$1005,3,FALSE)))","v":"Peppy Sans Surprise"},null,null,40,15,40,50,5,null,150,null,null,null,150]
[40,518,{"$f":"IF(B42=\"\",\"\",(VLOOKUP(B42,'Membership #'!$A$1:$C$1005,2,FALSE)))","v":"Sylvester Weatherbie"},{"$f":"IF(B42=\"\",\"\",(VLOOKUP(B42,'Membership #'!$A$1:$C$1005,3,FALSE)))","v":"J.R."},null,null,20,15,20,50,5,40,{"$f":"SUM(G42:L42)","v":150},null,null,null,150]
[41,657,{"$f":"IF(B43=\"\",\"\",(VLOOKUP(B43,'Membership #'!$A$1:$C$1005,2,FALSE)))","v":"Laura Morrison"},{"$f":"IF(B43=\"\",\"\",(VLOOKUP(B43,'Membership #'!$A$1:$C$1005,3,FALSE)))","v":"Steal Ta Fame"},null,null,20,15,20,50,5,null,110,null,null,null,110]
[42,699,{"$f":"IF(B44=\"\",\"\",(VLOOKUP(B44,'Membership #'!$A$1:$C$1005,2,FALSE)))","v":"Laura Morrison"},{"$f":"IF(B44=\"\",\"\",(VLOOKUP(B44,'Membership #'!$A$1:$C$1005,3,FALSE)))","v":"MDC Dark Revelation"},null,null,10,15,10,50,5,null,90,null,null,null,90]
[43,636,{"$f":"IF(B45=\"\",\"\",(VLOOKUP(B45,'Membership #'!$A$1:$C$1005,2,FALSE)))","v":"Ceilidh Gosse"},{"$f":"IF(B45=\"\",\"\",(VLOOKUP(B45,'Membership #'!$A$1:$C$1005,3,FALSE)))","v":"ELM Silver Crime"},null,null,10,15,10,50,5,null,90,null,null,null,90]
[44,695,{"$f":"IF(B46=\"\",\"\",(VLOOKUP(B46,'Membership #'!$A$1:$C$1005,2,FALSE)))","v":"Tessa Dicks"},{"$f":"IF(B46=\"\",\"\",(VLOOKUP(B46,'Membership #'!$A$1:$C$1005,3,FALSE)))","v":"Charge's Dusty Luck"},null,null,40,15,40,50,5,null,150,null,null,null,150]
[45,928,{"$f":"IF(B47=\"\",\"\",(VLOOKUP(B47,'Membership #'!$A$1:$C$1005,2,FALSE)))","v":"Tessa Dicks"},{"$f":"IF(B47=\"\",\"\",(VLOOKUP(B47,'Membership #'!$A$1:$C$1005,3,FALSE)))","v":"ELM Dash of Crime"},null,null,40,15,40,50,5,null,150,null,null,null,150]
[46,971,{"$f":"IF(B48=\"\",\"\",(VLOOKUP(B48,'Membership #'!$A$1:$C$1005,2,FALSE)))","v":"Arielle Burke"},{"$f":"IF(B48=\"\",\"\",(VLOOKUP(B48,'Membership #'!$A$1:$C$1005,3,FALSE)))","v":"Elm Sally"},null,null,60,15,60,50,5,null,190,null,null,null,190]
[47,867,{"$f":"IF(B49=\"\",\"\",(VLOOKUP(B49,'Membership #'!$A$1:$C$1005,2,FALSE)))","v":"Layla MacEachem"},{"$f":"IF(B49=\"\",\"\",(VLOOKUP(B49,'Membership #'!$A$1:$C$1005,3,FALSE)))","v":"Shes a gem"},null,null,10,15,10,50,5,40,{"$f":"SUM(G49:L49)","v":130},null,null,null,130]
[48,539,{"$f":"IF(B50=\"\",\"\",(VLOOKUP(B50,'Membership #'!$A$1:$C$1005,2,FALSE)))","v":"Alex Singer"},{"$f":"IF(B50=\"\",\"\",(VLOOKUP(B50,'Membership #'!$A$1:$C$1005,3,FALSE)))","v":"Plain White Trash"},null,null,40,15,40,50,5,null,150,null,null,null,150]
[49,892,{"$f":"IF(B51=\"\",\"\",(VLOOKUP(B51,'Membership #'!$A$1:$C$1005,2,FALSE)))","v":"Donnie MacNeil"},{"$f":"IF(B51=\"\",\"\",(VLOOKUP(B51,'Membership #'!$A$1:$C$1005,3,FALSE)))","v":"Gifted Go Gold"},null,null,50,15,50,50,5,40,{"$f":"SUM(G51:L51)","v":210},null,null,null,210]
[50,556,{"$f":"IF(B52=\"\",\"\",(VLOOKUP(B52,'Membership #'!$A$1:$C$1005,2,FALSE)))","v":"Stephaine Clark"},{"$f":"IF(B52=\"\",\"\",(VLOOKUP(B52,'Membership #'!$A$1:$C$1005,3,FALSE)))","v":"Perks A Flyin"},null,null,30,15,30,50,5,40,{"$f":"SUM(G52:L52)","v":170},null,null,null,170]
[51,666,{"$f":"IF(B53=\"\",\"\",(VLOOKUP(B53,'Membership #'!$A$1:$C$1005,2,FALSE)))","v":"Summer Fraser"},{"$f":"IF(B53=\"\",\"\",(VLOOKUP(B53,'Membership #'!$A$1:$C$1005,3,FALSE)))","v":"Sheza Smokin' Girl"},null,null,10,null,10,50,5,null,75,null,null,null,75]
[52,732,{"$f":"IF(B54=\"\",\"\",(VLOOKUP(B54,'Membership #'!$A$1:$C$1005,2,FALSE)))","v":"Brenna Carrigan"},{"$f":"IF(B54=\"\",\"\",(VLOOKUP(B54,'Membership #'!$A$1:$C$1005,3,FALSE)))","v":"Carlos"},null,null,60,15,60,50,5,null,190,null,null,null,190]
[53,514,{"$f":"IF(B55=\"\",\"\",(VLOOKUP(B55,'Membership #'!$A$1:$C$1005,2,FALSE)))","v":"Heather Morrison"},{"$f":"IF(B55=\"\",\"\",(VLOOKUP(B55,'Membership #'!$A$1:$C$1005,3,FALSE)))","v":"Black Fire Dash"},null,null,10,15,10,50,5,40,{"$f":"SUM(G55:L55)","v":130},null,null,null,130]
[54,961,{"$f":"IF(B56=\"\",\"\",(VLOOKUP(B56,'Membership #'!$A$1:$C$1005,2,FALSE)))","v":"Jacie Burke"},{"$f":"IF(B56=\"\",\"\",(VLOOKUP(B56,'Membership #'!$A$1:$C$1005,3,FALSE)))","v":"She's Just That Sassy"},null,null,10,null,10,50,5,null,75,null,null,null,75]
[55,962,{"$f":"IF(B57=\"\",\"\",(VLOOKUP(B57,'Membership #'!$A$1:$C$1005,2,FALSE)))","v":"Hariin Burke"},{"$f":"IF(B57=\"\",\"\",(VLOOKUP(B57,'Membership #'!$A$1:$C$1005,3,FALSE)))","v":"Olds Bold Impulse"},null,null,null,null,null,50,5,40,55,null,null,null,{"$f":"SUM(L57:P57)","v":95}]
[56,963,{"$f":"IF(B58=\"\",\"\",(VLOOKUP(B58,'Membership #'!$A$1:$C$1005,2,FALSE)))","v":"Leighton Burke"},{"$f":"IF(B58=\"\",\"\",(VLOOKUP(B58,'Membership #'!$A$1:$C$1005,3,FALSE)))","v":"Boot Scootin Boogie"},null,null,null,null,null,50,5,null,55,null,null,null,55]
[57,909,{"$f":"IF(B59=\"\",\"\",(VLOOKUP(B59,'Membership #'!$A$1:$C$1005,2,FALSE)))","v":"Rebecca Gillis"},{"$f":"IF(B59=\"\",\"\",(VLOOKUP(B59,'Membership #'!$A$1:$C$1005,3,FALSE)))","v":"Martha's Tivio Moon"},null,null,40,15,40,50,5,null,150,null,null,null,150]
[58,583,{"$f":"IF(B60=\"\",\"\",(VLOOKUP(B60,'Membership #'!$A$1:$C$1005,2,FALSE)))","v":"Travis Patterson"},{"$f":"IF(B60=\"\",\"\",(VLOOKUP(B60,'Membership #'!$A$1:$C$1005,3,FALSE)))","v":"JT Rosie"},null,null,10,15,10,50,5,null,90,null,null,null,90]
[59,523,{"$f":"IF(B61=\"\",\"\",(VLOOKUP(B61,'Membership #'!$A$1:$C$1005,2,FALSE)))","v":"Nicole Dobson"},{"$f":"IF(B61=\"\",\"\",(VLOOKUP(B61,'Membership #'!$A$1:$C$1005,3,FALSE)))","v":"Barbeesimpossibleinprint"},null,null,20,15,20,50,5,20,{"$f":"SUM(G61:L61)","v":130},null,null,null,130]
[60,null,{"$f":"IF(B62=\"\",\"\",(VLOOKUP(B62,'Membership #'!$A$1:$C$1005,2,FALSE)))","v":""},{"$f":"IF(B62=\"\",\"\",(VLOOKUP(B62,'Membership #'!$A$1:$C$1005,3,FALSE)))","v":""},null,null,null,null,null,50,5,null,55,null,null,null,55]
[61,null,{"$f":"IF(B63=\"\",\"\",(VLOOKUP(B63,'Membership #'!$A$1:$C$1005,2,FALSE)))","v":""},{"$f":"IF(B63=\"\",\"\",(VLOOKUP(B63,'Membership #'!$A$1:$C$1005,3,FALSE)))","v":""},null,null,null,null,null,50,5,null,55,null,null,null,55]
[62,null,{"$f":"IF(B64=\"\",\"\",(VLOOKUP(B64,'Membership #'!$A$1:$C$1005,2,FALSE)))","v":""},{"$f":"IF(B64=\"\",\"\",(VLOOKUP(B64,'Membership #'!$A$1:$C$1005,3,FALSE)))","v":""},null,null,null,null,null,50,5,null,55,null,null,null,55]
[63,null,{"$f":"IF(B65=\"\",\"\",(VLOOKUP(B65,'Membership #'!$A$1:$C$1005,2,FALSE)))","v":""},{"$f":"IF(B65=\"\",\"\",(VLOOKUP(B65,'Membership #'!$A$1:$C$1005,3,FALSE)))","v":""},null,null,null,null,null,50,5,null,55,null,null,null,55]
[64,null,{"$f":"IF(B66=\"\",\"\",(VLOOKUP(B66,'Membership #'!$A$1:$C$1005,2,FALSE)))","v":""},{"$f":"IF(B66=\"\",\"\",(VLOOKUP(B66,'Membership #'!$A$1:$C$1005,3,FALSE)))","v":""},null,null,null,null,null,50,5,null,55,null,null,null,55]
[65,null,{"$f":"IF(B67=\"\",\"\",(VLOOKUP(B67,'Membership #'!$A$1:$C$1005,2,FALSE)))","v":""},{"$f":"IF(B67=\"\",\"\",(VLOOKUP(B67,'Membership #'!$A$1:$C$1005,3,FALSE)))","v":""},null,null,null,null,null,50,5,null,{"$f":"SUM(G67:K67)","v":55},null,null,null,55]
[66,null,{"$f":"IF(B68=\"\",\"\",(VLOOKUP(B68,'Membership #'!$A$1:$C$1005,2,FALSE)))","v":""},{"$f":"IF(B68=\"\",\"\",(VLOOKUP(B68,'Membership #'!$A$1:$C$1005,3,FALSE)))","v":""},null,null,null,null,null,50,5,null,55,null,null,null,55]
[67,null,null,null,null,null,null,null,null,50,5,null,55,null,null,null,55]
[68,null,{"$f":"IF(B70=\"\",\"\",(VLOOKUP(B70,'Membership #'!$A$1:$C$1005,2,FALSE)))","v":""},{"$f":"IF(B70=\"\",\"\",(VLOOKUP(B70,'Membership #'!$A$1:$C$1005,3,FALSE)))","v":""},null,null,null,null,null,50,5,null,{"$f":"SUM(G70:K70)","v":55},null,null,null,{"$f":"SUM(M70:P70)","v":55}]
[69,null,{"$f":"IF(B71=\"\",\"\",(VLOOKUP(B71,'Membership #'!$A$1:$C$1005,2,FALSE)))","v":""},{"$f":"IF(B71=\"\",\"\",(VLOOKUP(B71,'Membership #'!$A$1:$C$1005,3,FALSE)))","v":""},null,null,null,null,null,50,5,null,55,null,null,null,55]
[70,null,{"$f":"IF(B72=\"\",\"\",(VLOOKUP(B72,'Membership #'!$A$1:$C$1005,2,FALSE)))","v":""},{"$f":"IF(B72=\"\",\"\",(VLOOKUP(B72,'Membership #'!$A$1:$C$1005,3,FALSE)))","v":""},null,null,null,null,null,50,5,null,55,null,null,null,55]
[null,null,{"$f":"IF(B73=\"\",\"\",(VLOOKUP(B73,'Membership #'!$A$1:$C$1005,2,FALSE)))","v":""},{"$f":"IF(B73=\"\",\"\",(VLOOKUP(B73,'Membership #'!$A$1:$C$1005,3,FALSE)))","v":""},null,null,null,null,null,50,5,null,55,null,null,null,55]
[null,null,{"$f":"IF(B74=\"\",\"\",(VLOOKUP(B74,'Membership #'!$A$1:$C$1005,2,FALSE)))","v":""},{"$f":"IF(B74=\"\",\"\",(VLOOKUP(B74,'Membership #'!$A$1:$C$1005,3,FALSE)))","v":""}]
[null,null,{"$f":"IF(B75=\"\",\"\",(VLOOKUP(B75,'Membership #'!$A$1:$C$1005,2,FALSE)))","v":""},{"$f":"IF(B75=\"\",\"\",(VLOOKUP(B75,'Membership #'!$A$1:$C$1005,3,FALSE)))","v":""},null,null,{"$f":"SUM(G3:G74)","v":1385},705,1420,3550,355,null,7995,null,null,null,null,null,{"$f":"SUM(S3:S62)","v":0},0,0,0,0,0]
[null,null,{"$f":"IF(B76=\"\",\"\",(VLOOKUP(B76,'Membership #'!$A$1:$C$1005,2,FALSE)))","v":""},{"$f":"IF(B76=\"\",\"\",(VLOOKUP(B76,'Membership #'!$A$1:$C$1005,3,FALSE)))","v":""}]
[null,null,{"$f":"IF(B77=\"\",\"\",(VLOOKUP(B77,'Membership #'!$A$1:$C$1005,2,FALSE)))","v":""},{"$f":"IF(B77=\"\",\"\",(VLOOKUP(B77,'Membership #'!$A$1:$C$1005,3,FALSE)))","v":""}]
[null,null,{"$f":"IF(B78=\"\",\"\",(VLOOKUP(B78,'Membership #'!$A$1:$C$1005,2,FALSE)))","v":""},{"$f":"IF(B78=\"\",\"\",(VLOOKUP(B78,'Membership #'!$A$1:$C$1005,3,FALSE)))","v":""}]
[null,null,{"$f":"IF(B79=\"\",\"\",(VLOOKUP(B79,'Membership #'!$A$1:$C$1005,2,FALSE)))","v":""},{"$f":"IF(B79=\"\",\"\",(VLOOKUP(B79,'Membership #'!$A$1:$C$1005,3,FALSE)))","v":""}]
[null,null,{"$f":"IF(B80=\"\",\"\",(VLOOKUP(B80,'Membership #'!$A$1:$C$1005,2,FALSE)))","v":""},{"$f":"IF(B80=\"\",\"\",(VLOOKUP(B80,'Membership #'!$A$1:$C$1005,3,FALSE)))","v":""}]
[null,null,{"$f":"IF(B81=\"\",\"\",(VLOOKUP(B81,'Membership #'!$A$1:$C$1005,2,FALSE)))","v":""},{"$f":"IF(B81=\"\",\"\",(VLOOKUP(B81,'Membership #'!$A$1:$C$1005,3,FALSE)))","v":""}]
[null,null,{"$f":"IF(B82=\"\",\"\",(VLOOKUP(B82,'Membership #'!$A$1:$C$1005,2,FALSE)))","v":""},{"$f":"IF(B82=\"\",\"\",(VLOOKUP(B82,'Membership #'!$A$1:$C$1005,3,FALSE)))","v":""}]
[null,null,{"$f":"IF(B83=\"\",\"\",(VLOOKUP(B83,'Membership #'!$A$1:$C$1005,2,FALSE)))","v":""},{"$f":"IF(B83=\"\",\"\",(VLOOKUP(B83,'Membership #'!$A$1:$C$1005,3,FALSE)))","v":""}]
[null,null,{"$f":"IF(B84=\"\",\"\",(VLOOKUP(B84,'Membership #'!$A$1:$C$1005,2,FALSE)))","v":""},{"$f":"IF(B84=\"\",\"\",(VLOOKUP(B84,'Membership #'!$A$1:$C$1005,3,FALSE)))","v":""}]
[null,null,{"$f":"IF(B85=\"\",\"\",(VLOOKUP(B85,'Membership #'!$A$1:$C$1005,2,FALSE)))","v":""},{"$f":"IF(B85=\"\",\"\",(VLOOKUP(B85,'Membership #'!$A$1:$C$1005,3,FALSE)))","v":""}]
[null,null,{"$f":"IF(B86=\"\",\"\",(VLOOKUP(B86,'Membership #'!$A$1:$C$1005,2,FALSE)))","v":""},{"$f":"IF(B86=\"\",\"\",(VLOOKUP(B86,'Membership #'!$A$1:$C$1005,3,FALSE)))","v":""}]
[null,null,{"$f":"IF(B87=\"\",\"\",(VLOOKUP(B87,'Membership #'!$A$1:$C$1005,2,FALSE)))","v":""},{"$f":"IF(B87=\"\",\"\",(VLOOKUP(B87,'Membership #'!$A$1:$C$1005,3,FALSE)))","v":""}]
[null,null,{"$f":"IF(B88=\"\",\"\",(VLOOKUP(B88,'Membership #'!$A$1:$C$1005,2,FALSE)))","v":""},{"$f":"IF(B88=\"\",\"\",(VLOOKUP(B88,'Membership #'!$A$1:$C$1005,3,FALSE)))","v":""}]
[null,null,{"$f":"IF(B89=\"\",\"\",(VLOOKUP(B89,'Membership #'!$A$1:$C$1005,2,FALSE)))","v":""},{"$f":"IF(B89=\"\",\"\",(VLOOKUP(B89,'Membership #'!$A$1:$C$1005,3,FALSE)))","v":""}]
[null,null,{"$f":"IF(B90=\"\",\"\",(VLOOKUP(B90,'Membership #'!$A$1:$C$1005,2,FALSE)))","v":""},{"$f":"IF(B90=\"\",\"\",(VLOOKUP(B90,'Membership #'!$A$1:$C$1005,3,FALSE)))","v":""}]
[null,null,{"$f":"IF(B91=\"\",\"\",(VLOOKUP(B91,'Membership #'!$A$1:$C$1005,2,FALSE)))","v":""},{"$f":"IF(B91=\"\",\"\",(VLOOKUP(B91,'Membership #'!$A$1:$C$1005,3,FALSE)))","v":""}]
[null,null,{"$f":"IF(B92=\"\",\"\",(VLOOKUP(B92,'Membership #'!$A$1:$C$1005,2,FALSE)))","v":""},{"$f":"IF(B92=\"\",\"\",(VLOOKUP(B92,'Membership #'!$A$1:$C$1005,3,FALSE)))","v":""}]
[null,null,{"$f":"IF(B93=\"\",\"\",(VLOOKUP(B93,'Membership #'!$A$1:$C$1005,2,FALSE)))","v":""},{"$f":"IF(B93=\"\",\"\",(VLOOKUP(B93,'Membership #'!$A$1:$C$1005,3,FALSE)))","v":""}]
[null,null,{"$f":"IF(B94=\"\",\"\",(VLOOKUP(B94,'Membership #'!$A$1:$C$1005,2,FALSE)))","v":""},{"$f":"IF(B94=\"\",\"\",(VLOOKUP(B94,'Membership #'!$A$1:$C$1005,3,FALSE)))","v":""}]
[null,null,{"$f":"IF(B95=\"\",\"\",(VLOOKUP(B95,'Membership #'!$A$1:$C$1005,2,FALSE)))","v":""},{"$f":"IF(B95=\"\",\"\",(VLOOKUP(B95,'Membership #'!$A$1:$C$1005,3,FALSE)))","v":""}]
[null,null,{"$f":"IF(B96=\"\",\"\",(VLOOKUP(B96,'Membership #'!$A$1:$C$1005,2,FALSE)))","v":""},{"$f":"IF(B96=\"\",\"\",(VLOOKUP(B96,'Membership #'!$A$1:$C$1005,3,FALSE)))","v":""}]
[null,null,{"$f":"IF(B97=\"\",\"\",(VLOOKUP(B97,'Membership #'!$A$1:$C$1005,2,FALSE)))","v":""},{"$f":"IF(B97=\"\",\"\",(VLOOKUP(B97,'Membership #'!$A$1:$C$1005,3,FALSE)))","v":""}]
[null,null,{"$f":"IF(B98=\"\",\"\",(VLOOKUP(B98,'Membership #'!$A$1:$C$1005,2,FALSE)))","v":""},{"$f":"IF(B98=\"\",\"\",(VLOOKUP(B98,'Membership #'!$A$1:$C$1005,3,FALSE)))","v":""}]
[null,null,{"$f":"IF(B99=\"\",\"\",(VLOOKUP(B99,'Membership #'!$A$1:$C$1005,2,FALSE)))","v":""},{"$f":"IF(B99=\"\",\"\",(VLOOKUP(B99,'Membership #'!$A$1:$C$1005,3,FALSE)))","v":""}]
[null,null,{"$f":"IF(B100=\"\",\"\",(VLOOKUP(B100,'Membership #'!$A$1:$C$1005,2,FALSE)))","v":""},{"$f":"IF(B100=\"\",\"\",(VLOOKUP(B100,'Membership #'!$A$1:$C$1005,3,FALSE)))","v":""}]
[null,null,{"$f":"IF(B101=\"\",\"\",(VLOOKUP(B101,'Membership #'!$A$1:$C$1005,2,FALSE)))","v":""},{"$f":"IF(B101=\"\",\"\",(VLOOKUP(B101,'Membership #'!$A$1:$C$1005,3,FALSE)))","v":""}]
[null,null,{"$f":"IF(B102=\"\",\"\",(VLOOKUP(B102,'Membership #'!$A$1:$C$1005,2,FALSE)))","v":""},{"$f":"IF(B102=\"\",\"\",(VLOOKUP(B102,'Membership #'!$A$1:$C$1005,3,FALSE)))","v":""}]
[null,null,{"$f":"IF(B103=\"\",\"\",(VLOOKUP(B103,'Membership #'!$A$1:$C$1005,2,FALSE)))","v":""},{"$f":"IF(B103=\"\",\"\",(VLOOKUP(B103,'Membership #'!$A$1:$C$1005,3,FALSE)))","v":""}]
[null,null,{"$f":"IF(B104=\"\",\"\",(VLOOKUP(B104,'Membership #'!$A$1:$C$1005,2,FALSE)))","v":""},{"$f":"IF(B104=\"\",\"\",(VLOOKUP(B104,'Membership #'!$A$1:$C$1005,3,FALSE)))","v":""}]
[null,null,{"$f":"IF(B105=\"\",\"\",(VLOOKUP(B105,'Membership #'!$A$1:$C$1005,2,FALSE)))","v":""},{"$f":"IF(B105=\"\",\"\",(VLOOKUP(B105,'Membership #'!$A$1:$C$1005,3,FALSE)))","v":""}]
[null,null,{"$f":"IF(B106=\"\",\"\",(VLOOKUP(B106,'Membership #'!$A$1:$C$1005,2,FALSE)))","v":""},{"$f":"IF(B106=\"\",\"\",(VLOOKUP(B106,'Membership #'!$A$1:$C$1005,3,FALSE)))","v":""}]
[null,null,{"$f":"IF(B107=\"\",\"\",(VLOOKUP(B107,'Membership #'!$A$1:$C$1005,2,FALSE)))","v":""},{"$f":"IF(B107=\"\",\"\",(VLOOKUP(B107,'Membership #'!$A$1:$C$1005,3,FALSE)))","v":""}]
[null,null,{"$f":"IF(B108=\"\",\"\",(VLOOKUP(B108,'Membership #'!$A$1:$C$1005,2,FALSE)))","v":""},{"$f":"IF(B108=\"\",\"\",(VLOOKUP(B108,'Membership #'!$A$1:$C$1005,3,FALSE)))","v":""}]
[null,null,{"$f":"IF(B109=\"\",\"\",(VLOOKUP(B109,'Membership #'!$A$1:$C$1005,2,FALSE)))","v":""},{"$f":"IF(B109=\"\",\"\",(VLOOKUP(B109,'Membership #'!$A$1:$C$1005,3,FALSE)))","v":""}]
[null,null,{"$f":"IF(B110=\"\",\"\",(VLOOKUP(B110,'Membership #'!$A$1:$C$1005,2,FALSE)))","v":""},{"$f":"IF(B110=\"\",\"\",(VLOOKUP(B110,'Membership #'!$A$1:$C$1005,3,FALSE)))","v":""}]
[null,null,{"$f":"IF(B111=\"\",\"\",(VLOOKUP(B111,'Membership #'!$A$1:$C$1005,2,FALSE)))","v":""},{"$f":"IF(B111=\"\",\"\",(VLOOKUP(B111,'Membership #'!$A$1:$C$1005,3,FALSE)))","v":""}]
[null,null,{"$f":"IF(B112=\"\",\"\",(VLOOKUP(B112,'Membership #'!$A$1:$C$1005,2,FALSE)))","v":""},{"$f":"IF(B112=\"\",\"\",(VLOOKUP(B112,'Membership #'!$A$1:$C$1005,3,FALSE)))","v":""}]
[null,null,{"$f":"IF(B113=\"\",\"\",(VLOOKUP(B113,'Membership #'!$A$1:$C$1005,2,FALSE)))","v":""},{"$f":"IF(B113=\"\",\"\",(VLOOKUP(B113,'Membership #'!$A$1:$C$1005,3,FALSE)))","v":""}]
[null,null,{"$f":"IF(B114=\"\",\"\",(VLOOKUP(B114,'Membership #'!$A$1:$C$1005,2,FALSE)))","v":""},{"$f":"IF(B114=\"\",\"\",(VLOOKUP(B114,'Membership #'!$A$1:$C$1005,3,FALSE)))","v":""}]

{"sheet":"Sheet1","index":3,"n_rows":0,"n_cols":0,"rows_kept":0,"cut":false,"hidden":false,"merged":[]}

{"sheet":"SMALLFRY","index":4,"n_rows":51,"n_cols":21,"rows_kept":51,"cut":false,"hidden":false,"merged":[[37,1,40,1],[37,7,40,7],[21,0,24,0],[21,2,24,2],[21,3,24,3],[21,4,24,4],[35,1,35,9],[21,1,24,1],[37,8,40,8],[37,9,40,9],[21,5,24,5],[37,0,40,0],[37,2,40,2],[37,3,40,3],[37,4,40,4],[37,5,40,5],[1,20,4,20],[1,11,4,11],[1,12,4,12],[1,13,4,13],[1,14,4,14],[1,15,4,15],[1,16,4,16],[1,19,4,19],[36,1,36,9],[37,6,40,6],[2,0,5,0],[1,17,4,17],[1,18,4,18],[2,3,5,3],[2,4,5,4],[2,5,5,5],[2,7,5,7],[2,8,5,8],[2,2,5,2],[21,6,24,6],[21,7,24,7],[21,8,24,8],[21,9,24,9],[20,1,20,9],[0,1,0,9],[1,1,1,9],[2,1,5,1],[19,1,19,9],[2,6,5,6],[2,9,5,9]]}
[null,"Tom Burt & Mark McGuire Memorial Jackpot Aug 22, 2021",null,null,null,null,null,null,null,null,null,"High Point Smallfry"]
[null,"SMALLFRY  BARRELS",null,null,null,null,null,null,null,null,null,"RING #      ","NAME","HORSE NAME","Barrels","Poles","Dash","Barrels","Poles","Dash","Total"]
["Rand Draw","Running Order","RING #      ","NAME","HORSE NAME","TIME","PENALTY ","TOTAL","PLACINGS","POINTS"]
[]
[]
[null,null,null,null,null,null,null,null,null,null,null,908,{"$f":"IF(L6=\"\",0,(VLOOKUP(L6,'Membership #'!$A$1:$C$1005,2,0)))","v":"Josie Higgins"},{"$f":"IF(L6=\"\",0,(VLOOKUP(L6,'Membership #'!$A$1:$C$1005,3,0)))","v":"Rocket Man"},10,10,10,null,null,null,{"$f":"SUM(O6:T6)","v":30}]
[{"$f":"RAND()","v":0.31551649796317338},1,908,{"$f":"IF(C7=\"\",0,(VLOOKUP(C7,'Membership #'!$A$1:$C$1005,2,0)))","v":"Josie Higgins"},{"$f":"IF(C7=\"\",0,(VLOOKUP(C7,'Membership #'!$A$1:$C$1005,3,0)))","v":"Rocket Man"},19.728999999999999,null,{"$f":"SUM(F7+G7)","v":19.728999999999999},1,10,null,531,{"$f":"IF(L7=\"\",0,(VLOOKUP(L7,'Membership #'!$A$1:$C$1005,2,0)))","v":"Addison Peters"},{"$f":"IF(L7=\"\",0,(VLOOKUP(L7,'Membership #'!$A$1:$C$1005,3,0)))","v":"He's A Little Wonder"},9,9,8,null,null,null,26]
[0.51525699432238026,2,531,{"$f":"IF(C8=\"\",0,(VLOOKUP(C8,'Membership #'!$A$1:$C$1005,2,0)))","v":"Addison Peters"},{"$f":"IF(C8=\"\",0,(VLOOKUP(C8,'Membership #'!$A$1:$C$1005,3,0)))","v":"He's A Little Wonder"},21.452000000000002,null,21.452000000000002,2,9,null,627,{"$f":"IF(L8=\"\",0,(VLOOKUP(L8,'Membership #'!$A$1:$C$1005,2,0)))","v":"Kaelyn Keddy"},{"$f":"IF(L8=\"\",0,(VLOOKUP(L8,'Membership #'!$A$1:$C$1005,3,0)))","v":"Sight to Behold"},8,7,7,null,null,null,22]
[0.47807193176987983,3,627,{"$f":"IF(C9=\"\",0,(VLOOKUP(C9,'Membership #'!$A$1:$C$1005,2,0)))","v":"Kaelyn Keddy"},{"$f":"IF(C9=\"\",0,(VLOOKUP(C9,'Membership #'!$A$1:$C$1005,3,0)))","v":"Sight to Behold"},22.550999999999998,null,22.550999999999998,3,8,null,802,{"$f":"IF(L9=\"\",0,(VLOOKUP(L9,'Membership #'!$A$1:$C$1005,2,0)))","v":"Ava Reginato"},{"$f":"IF(L9=\"\",0,(VLOOKUP(L9,'Membership #'!$A$1:$C$1005,3,0)))","v":"Jacs Last Flash"},7,6,5,null,null,null,18]
[0.6001151331039295,4,802,{"$f":"IF(C10=\"\",0,(VLOOKUP(C10,'Membership #'!$A$1:$C$1005,2,0)))","v":"Ava Reginato"},{"$f":"IF(C10=\"\",0,(VLOOKUP(C10,'Membership #'!$A$1:$C$1005,3,0)))","v":"Jacs Last Flash"},25.434000000000001,null,25.434000000000001,4,7,null,974,{"$f":"IF(L10=\"\",0,(VLOOKUP(L10,'Membership #'!$A$1:$C$1005,2,0)))","v":"Kerissa Martin"},{"$f":"IF(L10=\"\",0,(VLOOKUP(L10,'Membership #'!$A$1:$C$1005,3,0)))","v":"Wild Steppin Phoenix"},6,8,9,null,null,null,23]
[0.88076667997549563,5,974,{"$f":"IF(C11=\"\",0,(VLOOKUP(C11,'Membership #'!$A$1:$C$1005,2,0)))","v":"Kerissa Martin"},{"$f":"IF(C11=\"\",0,(VLOOKUP(C11,'Membership #'!$A$1:$C$1005,3,0)))","v":"Wild Steppin Phoenix"},22.114999999999998,5,27.114999999999998,5,6,null,963,{"$f":"IF(L11=\"\",0,(VLOOKUP(L11,'Membership #'!$A$1:$C$1005,2,0)))","v":"Leighton Burke"},{"$f":"IF(L11=\"\",0,(VLOOKUP(L11,'Membership #'!$A$1:$C$1005,3,0)))","v":"Boot Scootin Boogie"},5,3,null,null,null,null,8]
[0.29982407123044608,6,963,{"$f":"IF(C12=\"\",0,(VLOOKUP(C12,'Membership #'!$A$1:$C$1005,2,0)))","v":"Leighton Burke"},{"$f":"IF(C12=\"\",0,(VLOOKUP(C12,'Membership #'!$A$1:$C$1005,3,0)))","v":"Boot Scootin Boogie"},27.998999999999999,null,27.998999999999999,6,5,null,710,{"$f":"IF(L12=\"\",0,(VLOOKUP(L12,'Membership #'!$A$1:$C$1005,2,0)))","v":"Owen Baker"},{"$f":"IF(L12=\"\",0,(VLOOKUP(L12,'Membership #'!$A$1:$C$1005,3,0)))","v":"Tip It Back"},4,5,null,null,null,null,9]
[{"$f":"RAND()","v":0.78751058403153529},7,710,{"$f":"IF(C13=\"\",0,(VLOOKUP(C13,'Membership #'!$A$1:$C$1005,2,0)))","v":"Owen Baker"},{"$f":"IF(C13=\"\",0,(VLOOKUP(C13,'Membership #'!$A$1:$C$1005,3,0)))","v":"Tip It Back"},29.93,null,29.93,7,4,null,"710b",{"$f":"IF(L13=\"\",0,(VLOOKUP(L13,'Membership #'!$A$1:$C$1005,2,0)))","v":"Isla Baker"},{"$f":"IF(L13=\"\",0,(VLOOKUP(L13,'Membership #'!$A$1:$C$1005,3,0)))","v":"Tip It Back"},3,4,null,null,null,null,7]
[0.15611570335091629,8,"710b",{"$f":"IF(C14=\"\",0,(VLOOKUP(C14,'Membership #'!$A$1:$C$1005,2,0)))","v":"Isla Baker"},{"$f":"IF(C14=\"\",0,(VLOOKUP(C14,'Membership #'!$A$1:$C$1005,3,0)))","v":"Tip It Back"},35.271000000000001,null,35.271000000000001,8,3,null,31,"Nora Lewis ","Oreo Blizzard ",2,2,null,null,null,null,4]
[0.42808209697179689,9,31,"Nora Lewis ","Oreo Blizzard ",35.563000000000002,null,35.563000000000002,9,2,null,962,{"$f":"IF(L15=\"\",0,(VLOOKUP(L15,'Membership #'!$A$1:$C$1005,2,0)))","v":"Hariin Burke"},{"$f":"IF(L15=\"\",0,(VLOOKUP(L15,'Membership #'!$A$1:$C$1005,3,0)))","v":"Olds Bold Impulse"},1,1,null,null,null,null,2]
[0.91199627902762159,10,962,{"$f":"IF(C16=\"\",0,(VLOOKUP(C16,'Membership #'!$A$1:$C$1005,2,0)))","v":"Hariin Burke"},{"$f":"IF(C16=\"\",0,(VLOOKUP(C16,'Membership #'!$A$1:$C$1005,3,0)))","v":"Olds Bold Impulse"},"n",null,{"$error":"#VALUE!"}]
[0.56399362163050593,11,null,{"$f":"IF(C17=\"\",0,(VLOOKUP(C17,'Membership #'!$A$1:$C$1005,2,0)))","v":0},{"$f":"IF(C17=\"\",0,(VLOOKUP(C17,'Membership #'!$A$1:$C$1005,3,0)))","v":0},null,null,{"$f":"SUM(F17+G17)","v":0}]
[0.56965808042917454,12,null,{"$f":"IF(C18=\"\",0,(VLOOKUP(C18,'Membership #'!$A$1:$C$1005,2,0)))","v":0},{"$f":"IF(C18=\"\",0,(VLOOKUP(C18,'Membership #'!$A$1:$C$1005,3,0)))","v":0},null,null,0,null,null,null,null,{"$f":"IF(L18=\"\",0,(VLOOKUP(L18,'Membership #'!$A$1:$C$1005,2,0)))","v":0},{"$f":"IF(L18=\"\",0,(VLOOKUP(L18,'Membership #'!$A$1:$C$1005,3,0)))","v":0},null,null,null,null,null,null,{"$f":"SUM(O18:T18)","v":0}]
[1.3442136358078782E-2,13,null,{"$f":"IF(C19=\"\",0,(VLOOKUP(C19,'Membership #'!$A$1:$C$1005,2,0)))","v":0},{"$f":"IF(C19=\"\",0,(VLOOKUP(C19,'Membership #'!$A$1:$C$1005,3,0)))","v":0},null,null,0,null,null,null,null,null,null,null,null,null,null,null,null,0]
[null,"Tom Burt & Mark McGuire Memorial Jackpot Aug 22, 2021",null,null,null,null,null,null,null,null,null,null,{"$f":"IF(L20=\"\",0,(VLOOKUP(L20,'Membership #'!$A$1:$C$1005,2,0)))","v":0},{"$f":"IF(L20=\"\",0,(VLOOKUP(L20,'Membership #'!$A$1:$C$1005,3,0)))","v":0},null,null,null,null,null,null,0]
[null,"SMALLFRY  POLES",null,null,null,null,null,null,null,null,null,null,null,null,null,null,null,null,null,null,0]
["Rand Draw","Running Order","RING #      ","NAME","HORSE NAME","TIME","PENALTY ","  ","PLACINGS","POINTS",null,null,{"$f":"IF(L22=\"\",0,(VLOOKUP(L22,'Membership #'!$A$1:$C$1005,2,0)))","v":0},{"$f":"IF(L22=\"\",0,(VLOOKUP(L22,'Membership #'!$A$1:$C$1005,3,0)))","v":0},null,null,null,null,null,null,0]
[null,null,null,null,null,null,null,null,null,null,null,null,{"$f":"IF(L23=\"\",0,(VLOOKUP(L23,'Membership #'!$A$1:$C$1005,2,0)))","v":0},{"$f":"IF(L23=\"\",0,(VLOOKUP(L23,'Membership #'!$A$1:$C$1005,3,0)))","v":0},null,null,null,null,null,null,0]
[]
[]
[{"$f":"RAND()","v":0.8217305840197453},1,908,{"$f":"IF(C26=\"\",0,(VLOOKUP(C26,'Membership #'!$A$1:$C$1005,2,0)))","v":"Josie Higgins"},{"$f":"IF(C26=\"\",0,(VLOOKUP(C26,'Membership #'!$A$1:$C$1005,3,0)))","v":"Rocket Man"},29.864999999999998,null,{"$f":"SUM(F26+G26)","v":29.864999999999998},1,10]
[0.97128681959947949,2,531,{"$f":"IF(C27=\"\",0,(VLOOKUP(C27,'Membership #'!$A$1:$C$1005,2,0)))","v":"Addison Peters"},{"$f":"IF(C27=\"\",0,(VLOOKUP(C27,'Membership #'!$A$1:$C$1005,3,0)))","v":"He's A Little Wonder"},30.222999999999999,null,30.222999999999999,2,9]
[0.53318597156823766,3,974,{"$f":"IF(C28=\"\",0,(VLOOKUP(C28,'Membership #'!$A$1:$C$1005,2,0)))","v":"Kerissa Martin"},{"$f":"IF(C28=\"\",0,(VLOOKUP(C28,'Membership #'!$A$1:$C$1005,3,0)))","v":"Wild Steppin Phoenix"},31.786999999999999,null,31.786999999999999,3,8]
[0.29613030078947877,4,627,{"$f":"IF(C29=\"\",0,(VLOOKUP(C29,'Membership #'!$A$1:$C$1005,2,0)))","v":"Kaelyn Keddy"},{"$f":"IF(C29=\"\",0,(VLOOKUP(C29,'Membership #'!$A$1:$C$1005,3,0)))","v":"Sight to Behold"},32.713999999999999,null,32.713999999999999,4,7]
[0.50270868302649074,5,802,{"$f":"IF(C30=\"\",0,(VLOOKUP(C30,'Membership #'!$A$1:$C$1005,2,0)))","v":"Ava Reginato"},{"$f":"IF(C30=\"\",0,(VLOOKUP(C30,'Membership #'!$A$1:$C$1005,3,0)))","v":"Jacs Last Flash"},39.398000000000003,null,39.398000000000003,5,6]
[0.1728798781524169,6,710,{"$f":"IF(C31=\"\",0,(VLOOKUP(C31,'Membership #'!$A$1:$C$1005,2,0)))","v":"Owen Baker"},{"$f":"IF(C31=\"\",0,(VLOOKUP(C31,'Membership #'!$A$1:$C$1005,3,0)))","v":"Tip It Back"},40.576000000000001,null,40.576000000000001,6,5]
[{"$f":"RAND()","v":3.0188568428076379E-2},7,"710b",{"$f":"IF(C32=\"\",0,(VLOOKUP(C32,'Membership #'!$A$1:$C$1005,2,0)))","v":"Isla Baker"},{"$f":"IF(C32=\"\",0,(VLOOKUP(C32,'Membership #'!$A$1:$C$1005,3,0)))","v":"Tip It Back"},49.57,null,49.57,7,4]
[0.41671404716676097,8,963,{"$f":"IF(C33=\"\",0,(VLOOKUP(C33,'Membership #'!$A$1:$C$1005,2,0)))","v":"Leighton Burke"},{"$f":"IF(C33=\"\",0,(VLOOKUP(C33,'Membership #'!$A$1:$C$1005,3,0)))","v":"Boot Scootin Boogie"},44.643999999999998,5,49.643999999999998,8,3]
[4.5616039030616284E-2,9,31,"Nora Lewis ","Oreo Blizzard ",50.289000000000001,null,50.289000000000001,9,2]
[null,10,962,{"$f":"IF(C35=\"\",0,(VLOOKUP(C35,'Membership #'!$A$1:$C$1005,2,0)))","v":"Hariin Burke"},{"$f":"IF(C35=\"\",0,(VLOOKUP(C35,'Membership #'!$A$1:$C$1005,3,0)))","v":"Olds Bold Impulse"},"n",null,{"$f":"SUM(F35+G35)","v":{"$error":"#VALUE!"}},10,1]
[null,"Tom Burt & Mark McGuire Memorial Jackpot Aug 22, 2021"]
[null,"SMALLFRY  Dash"]
["Rand Draw","Running Order","RING #      ","NAME","HORSE NAME","TIME","PENALTY ","TOTAL","PLACINGS","POINTS"]
[]
[]
[]
[{"$f":"RAND()","v":2.0705731427476226E-2},4,908,{"$f":"IF(C42=\"\",0,(VLOOKUP(C42,'Membership #'!$A$1:$C$1005,2,0)))","v":"Josie Higgins"},{"$f":"IF(C42=\"\",0,(VLOOKUP(C42,'Membership #'!$A$1:$C$1005,3,0)))","v":"Rocket Man"},9.7319999999999993,null,{"$f":"SUM(F42+G42)","v":9.7319999999999993},1,10]
[{"$f":"RAND()","v":0.94702510559253861},1,974,{"$f":"IF(C43=\"\",0,(VLOOKUP(C43,'Membership #'!$A$1:$C$1005,2,0)))","v":"Kerissa Martin"},{"$f":"IF(C43=\"\",0,(VLOOKUP(C43,'Membership #'!$A$1:$C$1005,3,0)))","v":"Wild Steppin Phoenix"},10.986000000000001,null,{"$f":"SUM(F43+G43)","v":10.986000000000001},2,9]
[{"$f":"RAND()","v":0.58479109612488933},7,531,{"$f":"IF(C44=\"\",0,(VLOOKUP(C44,'Membership #'!$A$1:$C$1005,2,0)))","v":"Addison Peters"},{"$f":"IF(C44=\"\",0,(VLOOKUP(C44,'Membership #'!$A$1:$C$1005,3,0)))","v":"He's A Little Wonder"},11.015000000000001,null,{"$f":"SUM(F44+G44)","v":11.015000000000001},3,8]
[{"$f":"RAND()","v":0.598522999022289},6,627,{"$f":"IF(C45=\"\",0,(VLOOKUP(C45,'Membership #'!$A$1:$C$1005,2,0)))","v":"Kaelyn Keddy"},{"$f":"IF(C45=\"\",0,(VLOOKUP(C45,'Membership #'!$A$1:$C$1005,3,0)))","v":"Sight to Behold"},11.609,null,{"$f":"SUM(F45+G45)","v":11.609},4,7]
[{"$f":"RAND()","v":0.38675526472566601},5,962,{"$f":"IF(C46=\"\",0,(VLOOKUP(C46,'Membership #'!$A$1:$C$1005,2,0)))","v":"Hariin Burke"},{"$f":"IF(C46=\"\",0,(VLOOKUP(C46,'Membership #'!$A$1:$C$1005,3,0)))","v":"Olds Bold Impulse"},12.391999999999999,null,{"$f":"SUM(F46+G46)","v":12.391999999999999},5,6]
[{"$f":"RAND()","v":0.2691681735496072},9,802,"Ava Reginato","Jacs Last Flash",12.959,null,12.959,6,5]
[{"$f":"RAND()","v":0.25445474394946554},3,963,{"$f":"IF(C48=\"\",0,(VLOOKUP(C48,'Membership #'!$A$1:$C$1005,2,0)))","v":"Leighton Burke"},{"$f":"IF(C48=\"\",0,(VLOOKUP(C48,'Membership #'!$A$1:$C$1005,3,0)))","v":"Boot Scootin Boogie"},15.066000000000001,null,{"$f":"SUM(F48+G48)","v":15.066000000000001}]
[{"$f":"RAND()","v":0.51023302474896004},2,710,{"$f":"IF(C49=\"\",0,(VLOOKUP(C49,'Membership #'!$A$1:$C$1005,2,0)))","v":"Owen Baker"},{"$f":"IF(C49=\"\",0,(VLOOKUP(C49,'Membership #'!$A$1:$C$1005,3,0)))","v":"Tip It Back"},15.103,null,{"$f":"SUM(F49+G49)","v":15.103}]
[null,10,31,"Nora Lewis ","Oero Blizzard ",20.192,null,{"$f":"SUM(F50+G50)","v":20.192}]
[0.88303168728670944,8,"710b",{"$f":"IF(C51=\"\",0,(VLOOKUP(C51,'Membership #'!$A$1:$C$1005,2,0)))","v":"Isla Baker"},{"$f":"IF(C51=\"\",0,(VLOOKUP(C51,'Membership #'!$A$1:$C$1005,3,0)))","v":"Tip It Back"},23.518000000000001,null,{"$f":"SUM(F51+G51)","v":23.518000000000001}]

{"sheet":"PONY","index":5,"n_rows":52,"n_cols":21,"rows_kept":52,"cut":false,"hidden":false,"merged":[[37,0,40,0],[37,2,40,2],[37,3,40,3],[37,4,40,4],[20,0,23,0],[20,2,23,2],[20,3,23,3],[20,4,23,4],[20,1,23,1],[2,0,5,0],[2,3,5,3],[2,4,5,4],[1,20,4,20],[1,11,4,11],[1,12,4,12],[1,13,4,13],[1,14,4,14],[1,15,4,15],[1,16,4,16],[2,1,5,1],[0,1,0,9],[1,1,1,9],[18,1,18,9],[19,1,19,9],[2,9,5,9],[2,5,5,5],[2,7,5,7],[2,8,5,8],[2,6,5,6],[2,2,5,2],[24,12,24,20],[26,12,26,20],[1,17,4,17],[1,18,4,18],[1,19,4,19],[37,6,40,6],[37,7,40,7],[37,8,40,8],[37,1,40,1],[20,7,23,7],[20,8,23,8],[20,6,23,6],[20,5,23,5],[37,5,40,5],[35,1,35,9],[37,9,40,9],[20,9,23,9],[36,1,36,9]]}
[null,"Tom Burt & Mark McGuire Memorial Jackpot Aug 22, 2021",null,null,null,null,null,null,null,null,null,"High Point Pony"]
[null,"PONY  BARRELS",null,null,null,null,null,null,null,null,null,"RING #      ","NAME","HORSE NAME","Barrels","Poles","Dash","Barrels","Poles","Dash","Total"]
["Rand Draw","Running Order","RING #      ","NAME","HORSE NAME","TIME","PENALTY ","TOTAL","PLACINGS","POINTS"]
[]
[]
[null,null,null,null,null,null,null,null,null,null,null,815,{"$f":"IF(L6=\"\",0,(VLOOKUP(L6,'Membership #'!$A$1:$C$1005,2,0)))","v":"Brooke Kennedy"},{"$f":"IF(L6=\"\",0,(VLOOKUP(L6,'Membership #'!$A$1:$C$1005,3,0)))","v":"Tic Toc Teazer"},10,8,5,null,null,null,{"$f":"SUM(O6:T6)","v":23}]
[{"$f":"RAND()","v":0.29763945367194211},1,815,{"$f":"IF(C7=\"\",0,(VLOOKUP(C7,'Membership #'!$A$1:$C$1005,2,0)))","v":"Brooke Kennedy"},{"$f":"IF(C7=\"\",0,(VLOOKUP(C7,'Membership #'!$A$1:$C$1005,3,0)))","v":"Tic Toc Teazer"},15.878,null,{"$f":"SUM(F7+G7)","v":15.878},1,null,null,961,{"$f":"IF(L7=\"\",0,(VLOOKUP(L7,'Membership #'!$A$1:$C$1005,2,0)))","v":"Jacie Burke"},{"$f":"IF(L7=\"\",0,(VLOOKUP(L7,'Membership #'!$A$1:$C$1005,3,0)))","v":"She's Just That Sassy"},9,10,null,null,null,null,{"$f":"SUM(O7:T7)","v":19}]
[0.19993659938496899,2,961,{"$f":"IF(C8=\"\",0,(VLOOKUP(C8,'Membership #'!$A$1:$C$1005,2,0)))","v":"Jacie Burke"},{"$f":"IF(C8=\"\",0,(VLOOKUP(C8,'Membership #'!$A$1:$C$1005,3,0)))","v":"She's Just That Sassy"},16.440999999999999,null,16.440999999999999,2,null,null,941,{"$f":"IF(L8=\"\",0,(VLOOKUP(L8,'Membership #'!$A$1:$C$1005,2,0)))","v":"Taylor Hurley"},{"$f":"IF(L8=\"\",0,(VLOOKUP(L8,'Membership #'!$A$1:$C$1005,3,0)))","v":"Nacho Business"},8,null,9,null,null,null,{"$f":"SUM(O8:T8)","v":17}]
[0.77137464997933491,3,941,{"$f":"IF(C9=\"\",0,(VLOOKUP(C9,'Membership #'!$A$1:$C$1005,2,0)))","v":"Taylor Hurley"},{"$f":"IF(C9=\"\",0,(VLOOKUP(C9,'Membership #'!$A$1:$C$1005,3,0)))","v":"Nacho Business"},17.593,null,17.593,3,null,null,636,{"$f":"IF(L9=\"\",0,(VLOOKUP(L9,'Membership #'!$A$1:$C$1005,2,0)))","v":"Ceilidh Gosse"},{"$f":"IF(L9=\"\",0,(VLOOKUP(L9,'Membership #'!$A$1:$C$1005,3,0)))","v":"ELM Silver Crime"},7,7,null,null,null,null,{"$f":"SUM(O9:T9)","v":14}]
[0.83516266933848404,4,636,{"$f":"IF(C10=\"\",0,(VLOOKUP(C10,'Membership #'!$A$1:$C$1005,2,0)))","v":"Ceilidh Gosse"},{"$f":"IF(C10=\"\",0,(VLOOKUP(C10,'Membership #'!$A$1:$C$1005,3,0)))","v":"ELM Silver Crime"},17.850999999999999,null,17.850999999999999,4,null,null,867,{"$f":"IF(L10=\"\",0,(VLOOKUP(L10,'Membership #'!$A$1:$C$1005,2,0)))","v":"Layla MacEachem"},{"$f":"IF(L10=\"\",0,(VLOOKUP(L10,'Membership #'!$A$1:$C$1005,3,0)))","v":"Shes a gem"},6,9,8,null,null,null,23]
[0.45525741932737818,5,867,{"$f":"IF(C11=\"\",0,(VLOOKUP(C11,'Membership #'!$A$1:$C$1005,2,0)))","v":"Layla MacEachem"},{"$f":"IF(C11=\"\",0,(VLOOKUP(C11,'Membership #'!$A$1:$C$1005,3,0)))","v":"Shes a gem"},18.033999999999999,null,18.033999999999999,5,null,null,702,{"$f":"IF(L11=\"\",0,(VLOOKUP(L11,'Membership #'!$A$1:$C$1005,2,0)))","v":"Jenna Proctor"},{"$f":"IF(L11=\"\",0,(VLOOKUP(L11,'Membership #'!$A$1:$C$1005,3,0)))","v":"Painted to Perfection"},5,6,7,null,null,null,18]
[0.36985292776469536,6,702,{"$f":"IF(C12=\"\",0,(VLOOKUP(C12,'Membership #'!$A$1:$C$1005,2,0)))","v":"Jenna Proctor"},{"$f":"IF(C12=\"\",0,(VLOOKUP(C12,'Membership #'!$A$1:$C$1005,3,0)))","v":"Painted to Perfection"},20.187000000000001,null,20.187000000000001,6,null,null,967,{"$f":"IF(L12=\"\",0,(VLOOKUP(L12,'Membership #'!$A$1:$C$1005,2,0)))","v":"Marissa Hillier"},{"$f":"IF(L12=\"\",0,(VLOOKUP(L12,'Membership #'!$A$1:$C$1005,3,0)))","v":"Notice Betty Boop"},4,5,6,null,null,null,{"$f":"SUM(O12:T12)","v":15}]
[0.11938335874178529,7,967,{"$f":"IF(C13=\"\",0,(VLOOKUP(C13,'Membership #'!$A$1:$C$1005,2,0)))","v":"Marissa Hillier"},{"$f":"IF(C13=\"\",0,(VLOOKUP(C13,'Membership #'!$A$1:$C$1005,3,0)))","v":"Notice Betty Boop"},20.48,null,20.48,7,null,null,532,{"$f":"IF(L13=\"\",0,(VLOOKUP(L13,'Membership #'!$A$1:$C$1005,2,0)))","v":"Gracie MacLean"},{"$f":"IF(L13=\"\",0,(VLOOKUP(L13,'Membership #'!$A$1:$C$1005,3,0)))","v":"Secret"},3,null,null,null,null,null,3]
[0.19742616886948372,8,532,{"$f":"IF(C14=\"\",0,(VLOOKUP(C14,'Membership #'!$A$1:$C$1005,2,0)))","v":"Gracie MacLean"},{"$f":"IF(C14=\"\",0,(VLOOKUP(C14,'Membership #'!$A$1:$C$1005,3,0)))","v":"Secret"},"x",null,{"$error":"#VALUE!"}]
[4.474089583770946E-2,9,666,{"$f":"IF(C15=\"\",0,(VLOOKUP(C15,'Membership #'!$A$1:$C$1005,2,0)))","v":"Summer Fraser"},{"$f":"IF(C15=\"\",0,(VLOOKUP(C15,'Membership #'!$A$1:$C$1005,3,0)))","v":"Sheza Smokin' Girl"},"x",null,{"$error":"#VALUE!"}]
[0.69061623116506443,10,889,{"$f":"IF(C16=\"\",0,(VLOOKUP(C16,'Membership #'!$A$1:$C$1005,2,0)))","v":"Adelaine Cowley"},{"$f":"IF(C16=\"\",0,(VLOOKUP(C16,'Membership #'!$A$1:$C$1005,3,0)))","v":"Frenchman's Promise"},"x",null,{"$error":"#VALUE!"}]
[{"$f":"RAND()","v":0.32619324015180262},null,null,{"$f":"IF(C17=\"\",0,(VLOOKUP(C17,'Membership #'!$A$1:$C$1005,2,0)))","v":0},{"$f":"IF(C17=\"\",0,(VLOOKUP(C17,'Membership #'!$A$1:$C$1005,3,0)))","v":0},null,null,{"$f":"SUM(F17+G17)","v":0}]
[]
[null,"Tom Burt & Mark McGuire Memorial Jackpot Aug 22, 2021",null,null,null,null,null,null,null,null,null,null,{"$f":"IF(L19=\"\",0,(VLOOKUP(L19,'Membership #'!$A$1:$C$1005,2,0)))","v":0},{"$f":"IF(L19=\"\",0,(VLOOKUP(L19,'Membership #'!$A$1:$C$1005,3,0)))","v":0},null,null,null,null,null,null,{"$f":"SUM(O19:T19)","v":0}]
[null,"PONY  POLES",null,null,null,null,null,null,null,null,null,null,{"$f":"IF(L20=\"\",0,(VLOOKUP(L20,'Membership #'!$A$1:$C$1005,2,0)))","v":0},{"$f":"IF(L20=\"\",0,(VLOOKUP(L20,'Membership #'!$A$1:$C$1005,3,0)))","v":0},null,null,null,null,null,null,{"$f":"SUM(O20:T20)","v":0}]
["Rand Draw","Running Order","RING #      ","NAME","HORSE NAME","TIME","PENALTY ","TOTAL","PLACINGS","POINTS",null,null,{"$f":"IF(L21=\"\",0,(VLOOKUP(L21,'Membership #'!$A$1:$C$1005,2,0)))","v":0},{"$f":"IF(L21=\"\",0,(VLOOKUP(L21,'Membership #'!$A$1:$C$1005,3,0)))","v":0},null,null,null,null,null,null,{"$f":"SUM(O21:T21)","v":0}]
[null,null,null,null,null,null,null,null,null,null,null,null,{"$f":"IF(L22=\"\",0,(VLOOKUP(L22,'Membership #'!$A$1:$C$1005,2,0)))","v":0},{"$f":"IF(L22=\"\",0,(VLOOKUP(L22,'Membership #'!$A$1:$C$1005,3,0)))","v":0},null,null,null,null,null,null,{"$f":"SUM(O22:T22)","v":0}]
[null,null,null,null,null,null,null,null,null,null,null,null,null,null,null,null,null,null,null,null,{"$f":"SUM(O23:T23)","v":0}]
[]
[{"$f":"RAND()","v":0.93953709403900287},1,961,{"$f":"IF(C25=\"\",\"\",(VLOOKUP(C25,'Membership #'!$A$1:$C$1005,2,FALSE)))","v":"Jacie Burke"},{"$f":"IF(C25=\"\",\"\",(VLOOKUP(C25,'Membership #'!$A$1:$C$1005,3,FALSE)))","v":"She's Just That Sassy"},25.565999999999999,null,{"$f":"SUM(F25+G25)","v":25.565999999999999},1,10]
[0.53382061893904087,2,867,{"$f":"IF(C26=\"\",\"\",(VLOOKUP(C26,'Membership #'!$A$1:$C$1005,2,FALSE)))","v":"Layla MacEachem"},{"$f":"IF(C26=\"\",\"\",(VLOOKUP(C26,'Membership #'!$A$1:$C$1005,3,FALSE)))","v":"Shes a gem"},27.939,null,27.939,2,9]
[0.9687420328156584,3,815,{"$f":"IF(C27=\"\",\"\",(VLOOKUP(C27,'Membership #'!$A$1:$C$1005,2,FALSE)))","v":"Brooke Kennedy"},{"$f":"IF(C27=\"\",\"\",(VLOOKUP(C27,'Membership #'!$A$1:$C$1005,3,FALSE)))","v":"Tic Toc Teazer"},23.312000000000001,5,28.312000000000001,3,8]
[0.42156090517571199,4,636,{"$f":"IF(C28=\"\",\"\",(VLOOKUP(C28,'Membership #'!$A$1:$C$1005,2,FALSE)))","v":"Ceilidh Gosse"},{"$f":"IF(C28=\"\",\"\",(VLOOKUP(C28,'Membership #'!$A$1:$C$1005,3,FALSE)))","v":"ELM Silver Crime"},29.486999999999998,null,29.486999999999998,4,7]
[0.62025915381558305,5,702,{"$f":"IF(C29=\"\",\"\",(VLOOKUP(C29,'Membership #'!$A$1:$C$1005,2,FALSE)))","v":"Jenna Proctor"},{"$f":"IF(C29=\"\",\"\",(VLOOKUP(C29,'Membership #'!$A$1:$C$1005,3,FALSE)))","v":"Painted to Perfection"},29.9,null,29.9,5,6]
[0.14717551982749533,6,967,{"$f":"IF(C30=\"\",\"\",(VLOOKUP(C30,'Membership #'!$A$1:$C$1005,2,FALSE)))","v":"Marissa Hillier"},{"$f":"IF(C30=\"\",\"\",(VLOOKUP(C30,'Membership #'!$A$1:$C$1005,3,FALSE)))","v":"Notice Betty Boop"},30.529,5,35.528999999999996,6,5]
[0.99409704236329455,7,941,{"$f":"IF(C31=\"\",\"\",(VLOOKUP(C31,'Membership #'!$A$1:$C$1005,2,FALSE)))","v":"Taylor Hurley"},{"$f":"IF(C31=\"\",\"\",(VLOOKUP(C31,'Membership #'!$A$1:$C$1005,3,FALSE)))","v":"Nacho Business"},"n",null,{"$error":"#VALUE!"}]
[0.15727049315461994,8,889,{"$f":"IF(C32=\"\",\"\",(VLOOKUP(C32,'Membership #'!$A$1:$C$1005,2,FALSE)))","v":"Adelaine Cowley"},{"$f":"IF(C32=\"\",\"\",(VLOOKUP(C32,'Membership #'!$A$1:$C$1005,3,FALSE)))","v":"Frenchman's Promise"},"x",null,{"$error":"#VALUE!"}]
[0.70521814504406166,9,532,{"$f":"IF(C33=\"\",\"\",(VLOOKUP(C33,'Membership #'!$A$1:$C$1005,2,FALSE)))","v":"Gracie MacLean"},{"$f":"IF(C33=\"\",\"\",(VLOOKUP(C33,'Membership #'!$A$1:$C$1005,3,FALSE)))","v":"Secret"},"x",null,{"$error":"#VALUE!"}]
[8.212983495688897E-2,10,666,{"$f":"IF(C34=\"\",\"\",(VLOOKUP(C34,'Membership #'!$A$1:$C$1005,2,FALSE)))","v":"Summer Fraser"},{"$f":"IF(C34=\"\",\"\",(VLOOKUP(C34,'Membership #'!$A$1:$C$1005,3,FALSE)))","v":"Sheza Smokin' Girl"},"x",null,{"$error":"#VALUE!"}]
[{"$f":"RAND()","v":0.7028734767780036},null,null,{"$f":"IF(C35=\"\",\"\",(VLOOKUP(C35,'Membership #'!$A$1:$C$1005,2,FALSE)))","v":""},{"$f":"IF(C35=\"\",\"\",(VLOOKUP(C35,'Membership #'!$A$1:$C$1005,3,FALSE)))","v":""},null,null,{"$f":"SUM(F35+G35)","v":0}]
[null,"Tom Burt & Mark McGuire Memorial Jackpot Aug 22, 2021"]
[null,"PONY DASH"]
["Rand Draw","Running Order","RING #      ","NAME","HORSE NAME","TIME","PENALTY ",null,"PLACINGS","POINTS"]
[]
[]
[]
[{"$f":"RAND()","v":0.77325823505481606},1,638,{"$f":"IF(C42=\"\",0,(VLOOKUP(C42,'Membership #'!$A$1:$C$1005,2,0)))","v":"Bella Peters"},{"$f":"IF(C42=\"\",0,(VLOOKUP(C42,'Membership #'!$A$1:$C$1005,3,0)))","v":"Super Star"},8.0939999999999994,null,{"$f":"SUM(F42+G42)","v":8.0939999999999994},1,10]
[0.9804418154828799,2,941,{"$f":"IF(C43=\"\",0,(VLOOKUP(C43,'Membership #'!$A$1:$C$1005,2,0)))","v":"Taylor Hurley"},{"$f":"IF(C43=\"\",0,(VLOOKUP(C43,'Membership #'!$A$1:$C$1005,3,0)))","v":"Nacho Business"},9.0030000000000001,null,9.0030000000000001,2,9]
[0.49673559406217516,3,867,{"$f":"IF(C44=\"\",0,(VLOOKUP(C44,'Membership #'!$A$1:$C$1005,2,0)))","v":"Layla MacEachem"},{"$f":"IF(C44=\"\",0,(VLOOKUP(C44,'Membership #'!$A$1:$C$1005,3,0)))","v":"Shes a gem"},9.2210000000000001,null,9.2210000000000001,3,8]
[0.6935418739724496,4,702,{"$f":"IF(C45=\"\",0,(VLOOKUP(C45,'Membership #'!$A$1:$C$1005,2,0)))","v":"Jenna Proctor"},{"$f":"IF(C45=\"\",0,(VLOOKUP(C45,'Membership #'!$A$1:$C$1005,3,0)))","v":"Painted to Perfection"},10.212,null,10.212,4,7]
[0.72355920396097106,5,967,{"$f":"IF(C46=\"\",0,(VLOOKUP(C46,'Membership #'!$A$1:$C$1005,2,0)))","v":"Marissa Hillier"},{"$f":"IF(C46=\"\",0,(VLOOKUP(C46,'Membership #'!$A$1:$C$1005,3,0)))","v":"Notice Betty Boop"},12.976000000000001,null,12.976000000000001,5,6]
[0.51562999059057801,6,815,{"$f":"IF(C47=\"\",0,(VLOOKUP(C47,'Membership #'!$A$1:$C$1005,2,0)))","v":"Brooke Kennedy"},{"$f":"IF(C47=\"\",0,(VLOOKUP(C47,'Membership #'!$A$1:$C$1005,3,0)))","v":"Tic Toc Teazer"},8.6940000000000008,5,13.694000000000001,6,5]
[0.17019756172900602,7,532,{"$f":"IF(C48=\"\",0,(VLOOKUP(C48,'Membership #'!$A$1:$C$1005,2,0)))","v":"Gracie MacLean"},{"$f":"IF(C48=\"\",0,(VLOOKUP(C48,'Membership #'!$A$1:$C$1005,3,0)))","v":"Secret"},"x",null,{"$error":"#VALUE!"}]
[0.1100198048065445,8,666,{"$f":"IF(C49=\"\",0,(VLOOKUP(C49,'Membership #'!$A$1:$C$1005,2,0)))","v":"Summer Fraser"},{"$f":"IF(C49=\"\",0,(VLOOKUP(C49,'Membership #'!$A$1:$C$1005,3,0)))","v":"Sheza Smokin' Girl"},"x",null,{"$error":"#VALUE!"}]
[0.53959334876822818,9,889,{"$f":"IF(C50=\"\",0,(VLOOKUP(C50,'Membership #'!$A$1:$C$1005,2,0)))","v":"Adelaine Cowley"},{"$f":"IF(C50=\"\",0,(VLOOKUP(C50,'Membership #'!$A$1:$C$1005,3,0)))","v":"Frenchman's Promise"},"x",null,{"$error":"#VALUE!"}]
[null,null,null,{"$f":"IF(C51=\"\",0,(VLOOKUP(C51,'Membership #'!$A$1:$C$1005,2,0)))","v":0},{"$f":"IF(C51=\"\",0,(VLOOKUP(C51,'Membership #'!$A$1:$C$1005,3,0)))","v":0},null,null,{"$f":"SUM(F51+G51)","v":0}]
[null,null,null,{"$f":"IF(C52=\"\",0,(VLOOKUP(C52,'Membership #'!$A$1:$C$1005,2,0)))","v":0},{"$f":"IF(C52=\"\",0,(VLOOKUP(C52,'Membership #'!$A$1:$C$1005,3,0)))","v":0},null,null,0]

{"sheet":"EXHIBITION Barrels","index":6,"n_rows":73,"n_cols":13,"rows_kept":73,"cut":false,"hidden":false,"merged":[[5,12,5,15],[0,0,0,10],[1,0,1,10],[2,0,2,3],[2,6,2,10],[3,0,6,0],[3,1,6,1],[3,2,6,2],[3,3,6,3],[3,4,6,4],[3,9,6,9],[3,10,6,10],[3,5,6,5],[3,6,6,6],[3,7,6,7],[3,8,6,8]]}
[2021,null,null,null,null,null,null,null,null,null,null,null,"x=Scratch"]
["EXHIBITION BARREL RACE",null,null,null,null,null,null,null,null,null,null,null,"n=No Time"]
["# Entries:",null,null,null,{"$f":"COUNTIF($D$8:$D$72,\">0\")","v":0}]
["Rand Draw","Seed",null,"RING #      ","NAME","HORSE NAME","TIME","PENALTY ","TOTAL","PLACINGS","POINTS"]
[]
[]
[]
[{"$f":"IF(D8<>\"\",RAND(),\"\")","v":""},{"$f":"IF(D8<>\"\",RANK(A8,A$8:A$73),\"\")","v":""},null,null,null,null,null,null,{"$f":"SUM(G8+H8)","v":0}]
["","",null,null,null,null,null,null,0]
["","",null,null,null,null,null,null,0]
["","",null,null,null,null,null,null,0]
["","","",null,{"$f":"IF(D12=\"\",\"\",(VLOOKUP(D12,'Membership #'!$A$1:$C$1005,2,0)))","v":""},{"$f":"IF(D12=\"\",\"\",(VLOOKUP(D12,'Membership #'!$A$1:$C$1005,3,0)))","v":""},null,null,0]
["","","",null,{"$f":"IF(D13=\"\",\"\",(VLOOKUP(D13,'Membership #'!$A$1:$C$1005,2,0)))","v":""},{"$f":"IF(D13=\"\",\"\",(VLOOKUP(D13,'Membership #'!$A$1:$C$1005,3,0)))","v":""},null,null,0]
["","","",null,{"$f":"IF(D14=\"\",\"\",(VLOOKUP(D14,'Membership #'!$A$1:$C$1005,2,0)))","v":""},{"$f":"IF(D14=\"\",\"\",(VLOOKUP(D14,'Membership #'!$A$1:$C$1005,3,0)))","v":""},null,null,0]
["","","",null,{"$f":"IF(D15=\"\",\"\",(VLOOKUP(D15,'Membership #'!$A$1:$C$1005,2,0)))","v":""},{"$f":"IF(D15=\"\",\"\",(VLOOKUP(D15,'Membership #'!$A$1:$C$1005,3,0)))","v":""},null,null,0]
["","","",null,{"$f":"IF(D16=\"\",\"\",(VLOOKUP(D16,'Membership #'!$A$1:$C$1005,2,0)))","v":""},{"$f":"IF(D16=\"\",\"\",(VLOOKUP(D16,'Membership #'!$A$1:$C$1005,3,0)))","v":""},null,null,0]
["","","",null,{"$f":"IF(D17=\"\",\"\",(VLOOKUP(D17,'Membership #'!$A$1:$C$1005,2,0)))","v":""},{"$f":"IF(D17=\"\",\"\",(VLOOKUP(D17,'Membership #'!$A$1:$C$1005,3,0)))","v":""},null,null,0]
["","","",null,{"$f":"IF(D18=\"\",\"\",(VLOOKUP(D18,'Membership #'!$A$1:$C$1005,2,0)))","v":""},{"$f":"IF(D18=\"\",\"\",(VLOOKUP(D18,'Membership #'!$A$1:$C$1005,3,0)))","v":""},null,null,0]
["","","",null,{"$f":"IF(D19=\"\",\"\",(VLOOKUP(D19,'Membership #'!$A$1:$C$1005,2,0)))","v":""},{"$f":"IF(D19=\"\",\"\",(VLOOKUP(D19,'Membership #'!$A$1:$C$1005,3,0)))","v":""},null,null,0]
["","","",null,{"$f":"IF(D20=\"\",\"\",(VLOOKUP(D20,'Membership #'!$A$1:$C$1005,2,0)))","v":""},{"$f":"IF(D20=\"\",\"\",(VLOOKUP(D20,'Membership #'!$A$1:$C$1005,3,0)))","v":""},null,null,0]
["","","",null,{"$f":"IF(D21=\"\",\"\",(VLOOKUP(D21,'Membership #'!$A$1:$C$1005,2,0)))","v":""},{"$f":"IF(D21=\"\",\"\",(VLOOKUP(D21,'Membership #'!$A$1:$C$1005,3,0)))","v":""},null,null,0]
["","","",null,{"$f":"IF(D22=\"\",\"\",(VLOOKUP(D22,'Membership #'!$A$1:$C$1005,2,0)))","v":""},{"$f":"IF(D22=\"\",\"\",(VLOOKUP(D22,'Membership #'!$A$1:$C$1005,3,0)))","v":""},null,null,0]
["","","",null,{"$f":"IF(D23=\"\",\"\",(VLOOKUP(D23,'Membership #'!$A$1:$C$1005,2,0)))","v":""},{"$f":"IF(D23=\"\",\"\",(VLOOKUP(D23,'Membership #'!$A$1:$C$1005,3,0)))","v":""},null,null,0]
["","","",null,{"$f":"IF(D24=\"\",\"\",(VLOOKUP(D24,'Membership #'!$A$1:$C$1005,2,0)))","v":""},{"$f":"IF(D24=\"\",\"\",(VLOOKUP(D24,'Membership #'!$A$1:$C$1005,3,0)))","v":""},null,null,0]
["","","",null,{"$f":"IF(D25=\"\",\"\",(VLOOKUP(D25,'Membership #'!$A$1:$C$1005,2,0)))","v":""},{"$f":"IF(D25=\"\",\"\",(VLOOKUP(D25,'Membership #'!$A$1:$C$1005,3,0)))","v":""},null,null,0]
["","","",null,{"$f":"IF(D26=\"\",\"\",(VLOOKUP(D26,'Membership #'!$A$1:$C$1005,2,0)))","v":""},{"$f":"IF(D26=\"\",\"\",(VLOOKUP(D26,'Membership #'!$A$1:$C$1005,3,0)))","v":""},null,null,0]
["","","",null,{"$f":"IF(D27=\"\",\"\",(VLOOKUP(D27,'Membership #'!$A$1:$C$1005,2,0)))","v":""},{"$f":"IF(D27=\"\",\"\",(VLOOKUP(D27,'Membership #'!$A$1:$C$1005,3,0)))","v":""},null,null,0]
["","","",null,{"$f":"IF(D28=\"\",\"\",(VLOOKUP(D28,'Membership #'!$A$1:$C$1005,2,0)))","v":""},{"$f":"IF(D28=\"\",\"\",(VLOOKUP(D28,'Membership #'!$A$1:$C$1005,3,0)))","v":""},null,null,0]
["","","",null,{"$f":"IF(D29=\"\",\"\",(VLOOKUP(D29,'Membership #'!$A$1:$C$1005,2,0)))","v":""},{"$f":"IF(D29=\"\",\"\",(VLOOKUP(D29,'Membership #'!$A$1:$C$1005,3,0)))","v":""},null,null,0]
["","","",null,{"$f":"IF(D30=\"\",\"\",(VLOOKUP(D30,'Membership #'!$A$1:$C$1005,2,0)))","v":""},{"$f":"IF(D30=\"\",\"\",(VLOOKUP(D30,'Membership #'!$A$1:$C$1005,3,0)))","v":""},null,null,0]
["","","",null,{"$f":"IF(D31=\"\",\"\",(VLOOKUP(D31,'Membership #'!$A$1:$C$1005,2,0)))","v":""},{"$f":"IF(D31=\"\",\"\",(VLOOKUP(D31,'Membership #'!$A$1:$C$1005,3,0)))","v":""},null,null,0]
["","","",null,{"$f":"IF(D32=\"\",\"\",(VLOOKUP(D32,'Membership #'!$A$1:$C$1005,2,0)))","v":""},{"$f":"IF(D32=\"\",\"\",(VLOOKUP(D32,'Membership #'!$A$1:$C$1005,3,0)))","v":""},null,null,0]
["","","",null,{"$f":"IF(D33=\"\",\"\",(VLOOKUP(D33,'Membership #'!$A$1:$C$1005,2,0)))","v":""},{"$f":"IF(D33=\"\",\"\",(VLOOKUP(D33,'Membership #'!$A$1:$C$1005,3,0)))","v":""},null,null,0]
["","","",null,{"$f":"IF(D34=\"\",\"\",(VLOOKUP(D34,'Membership #'!$A$1:$C$1005,2,0)))","v":""},{"$f":"IF(D34=\"\",\"\",(VLOOKUP(D34,'Membership #'!$A$1:$C$1005,3,0)))","v":""},null,null,0]
["","","",null,{"$f":"IF(D35=\"\",\"\",(VLOOKUP(D35,'Membership #'!$A$1:$C$1005,2,0)))","v":""},{"$f":"IF(D35=\"\",\"\",(VLOOKUP(D35,'Membership #'!$A$1:$C$1005,3,0)))","v":""},null,null,{"$f":"IF(G35=\"n\",\"No Time\",IF(G35=\"x\",\"Scratch\",IF(G35<>\"\",SUM(G35+H35),\"\")))","v":""}]
["","","",null,{"$f":"IF(D36=\"\",\"\",(VLOOKUP(D36,'Membership #'!$A$1:$C$1005,2,0)))","v":""},{"$f":"IF(D36=\"\",\"\",(VLOOKUP(D36,'Membership #'!$A$1:$C$1005,3,0)))","v":""},null,null,""]
["","","",null,{"$f":"IF(D37=\"\",\"\",(VLOOKUP(D37,'Membership #'!$A$1:$C$1005,2,0)))","v":""},{"$f":"IF(D37=\"\",\"\",(VLOOKUP(D37,'Membership #'!$A$1:$C$1005,3,0)))","v":""},null,null,""]
["","","",null,{"$f":"IF(D38=\"\",\"\",(VLOOKUP(D38,'Membership #'!$A$1:$C$1005,2,0)))","v":""},{"$f":"IF(D38=\"\",\"\",(VLOOKUP(D38,'Membership #'!$A$1:$C$1005,3,0)))","v":""},null,null,""]
["","","",null,{"$f":"IF(D39=\"\",\"\",(VLOOKUP(D39,'Membership #'!$A$1:$C$1005,2,0)))","v":""},{"$f":"IF(D39=\"\",\"\",(VLOOKUP(D39,'Membership #'!$A$1:$C$1005,3,0)))","v":""},null,null,""]
["",{"$f":"IF(D40<>\"\",RANK(A40,A$8:A$73),\"\")","v":""},"",null,{"$f":"IF(D40=\"\",\"\",(VLOOKUP(D40,'Membership #'!$A$1:$C$1005,2,0)))","v":""},{"$f":"IF(D40=\"\",\"\",(VLOOKUP(D40,'Membership #'!$A$1:$C$1005,3,0)))","v":""},null,null,""]
["","","",null,{"$f":"IF(D41=\"\",\"\",(VLOOKUP(D41,'Membership #'!$A$1:$C$1005,2,0)))","v":""},{"$f":"IF(D41=\"\",\"\",(VLOOKUP(D41,'Membership #'!$A$1:$C$1005,3,0)))","v":""},null,null,""]
["","","",null,{"$f":"IF(D42=\"\",\"\",(VLOOKUP(D42,'Membership #'!$A$1:$C$1005,2,0)))","v":""},{"$f":"IF(D42=\"\",\"\",(VLOOKUP(D42,'Membership #'!$A$1:$C$1005,3,0)))","v":""},null,null,""]
["","","",null,{"$f":"IF(D43=\"\",\"\",(VLOOKUP(D43,'Membership #'!$A$1:$C$1005,2,0)))","v":""},{"$f":"IF(D43=\"\",\"\",(VLOOKUP(D43,'Membership #'!$A$1:$C$1005,3,0)))","v":""},null,null,""]
[{"$f":"IF(D44<>\"\",RAND(),\"\")","v":""},"","",null,{"$f":"IF(D44=\"\",\"\",(VLOOKUP(D44,'Membership #'!$A$1:$C$1005,2,0)))","v":""},{"$f":"IF(D44=\"\",\"\",(VLOOKUP(D44,'Membership #'!$A$1:$C$1005,3,0)))","v":""},null,null,""]
["","","",null,{"$f":"IF(D45=\"\",\"\",(VLOOKUP(D45,'Membership #'!$A$1:$C$1005,2,0)))","v":""},{"$f":"IF(D45=\"\",\"\",(VLOOKUP(D45,'Membership #'!$A$1:$C$1005,3,0)))","v":""},null,null,{"$f":"IF(G45=\"n\",\"No Time\",IF(G45=\"x\",\"Scratch\",IF(G45<>\"\",SUM(G45+H45),\"\")))","v":""}]
["","","",null,{"$f":"IF(D46=\"\",\"\",(VLOOKUP(D46,'Membership #'!$A$1:$C$1005,2,0)))","v":""},{"$f":"IF(D46=\"\",\"\",(VLOOKUP(D46,'Membership #'!$A$1:$C$1005,3,0)))","v":""},null,null,""]
["","","",null,{"$f":"IF(D47=\"\",\"\",(VLOOKUP(D47,'Membership #'!$A$1:$C$1005,2,0)))","v":""},{"$f":"IF(D47=\"\",\"\",(VLOOKUP(D47,'Membership #'!$A$1:$C$1005,3,0)))","v":""},null,null,""]
["","","",null,{"$f":"IF(D48=\"\",\"\",(VLOOKUP(D48,'Membership #'!$A$1:$C$1005,2,0)))","v":""},{"$f":"IF(D48=\"\",\"\",(VLOOKUP(D48,'Membership #'!$A$1:$C$1005,3,0)))","v":""},null,null,""]
["","","",null,{"$f":"IF(D49=\"\",\"\",(VLOOKUP(D49,'Membership #'!$A$1:$C$1005,2,0)))","v":""},{"$f":"IF(D49=\"\",\"\",(VLOOKUP(D49,'Membership #'!$A$1:$C$1005,3,0)))","v":""},null,null,""]
["","","",null,{"$f":"IF(D50=\"\",\"\",(VLOOKUP(D50,'Membership #'!$A$1:$C$1005,2,0)))","v":""},{"$f":"IF(D50=\"\",\"\",(VLOOKUP(D50,'Membership #'!$A$1:$C$1005,3,0)))","v":""},null,null,""]
["","","",null,{"$f":"IF(D51=\"\",\"\",(VLOOKUP(D51,'Membership #'!$A$1:$C$1005,2,0)))","v":""},{"$f":"IF(D51=\"\",\"\",(VLOOKUP(D51,'Membership #'!$A$1:$C$1005,3,0)))","v":""},null,null,""]
["","","",null,{"$f":"IF(D52=\"\",\"\",(VLOOKUP(D52,'Membership #'!$A$1:$C$1005,2,0)))","v":""},{"$f":"IF(D52=\"\",\"\",(VLOOKUP(D52,'Membership #'!$A$1:$C$1005,3,0)))","v":""},null,null,""]
["","","",null,{"$f":"IF(D53=\"\",\"\",(VLOOKUP(D53,'Membership #'!$A$1:$C$1005,2,0)))","v":""},{"$f":"IF(D53=\"\",\"\",(VLOOKUP(D53,'Membership #'!$A$1:$C$1005,3,0)))","v":""},null,null,""]
["","","",null,{"$f":"IF(D54=\"\",\"\",(VLOOKUP(D54,'Membership #'!$A$1:$C$1005,2,0)))","v":""},{"$f":"IF(D54=\"\",\"\",(VLOOKUP(D54,'Membership #'!$A$1:$C$1005,3,0)))","v":""},null,null,""]
["","","",null,{"$f":"IF(D55=\"\",\"\",(VLOOKUP(D55,'Membership #'!$A$1:$C$1005,2,0)))","v":""},{"$f":"IF(D55=\"\",\"\",(VLOOKUP(D55,'Membership #'!$A$1:$C$1005,3,0)))","v":""},null,null,""]
["","","",null,{"$f":"IF(D56=\"\",\"\",(VLOOKUP(D56,'Membership #'!$A$1:$C$1005,2,0)))","v":""},{"$f":"IF(D56=\"\",\"\",(VLOOKUP(D56,'Membership #'!$A$1:$C$1005,3,0)))","v":""},null,null,""]
["","","",null,{"$f":"IF(D57=\"\",\"\",(VLOOKUP(D57,'Membership #'!$A$1:$C$1005,2,0)))","v":""},{"$f":"IF(D57=\"\",\"\",(VLOOKUP(D57,'Membership #'!$A$1:$C$1005,3,0)))","v":""},null,null,""]
["","","",null,{"$f":"IF(D58=\"\",\"\",(VLOOKUP(D58,'Membership #'!$A$1:$C$1005,2,0)))","v":""},{"$f":"IF(D58=\"\",\"\",(VLOOKUP(D58,'Membership #'!$A$1:$C$1005,3,0)))","v":""},null,null,""]
["","","",null,{"$f":"IF(D59=\"\",\"\",(VLOOKUP(D59,'Membership #'!$A$1:$C$1005,2,0)))","v":""},{"$f":"IF(D59=\"\",\"\",(VLOOKUP(D59,'Membership #'!$A$1:$C$1005,3,0)))","v":""},null,null,""]
["","","",null,{"$f":"IF(D60=\"\",\"\",(VLOOKUP(D60,'Membership #'!$A$1:$C$1005,2,0)))","v":""},{"$f":"IF(D60=\"\",\"\",(VLOOKUP(D60,'Membership #'!$A$1:$C$1005,3,0)))","v":""},null,null,""]
["","","",null,{"$f":"IF(D61=\"\",\"\",(VLOOKUP(D61,'Membership #'!$A$1:$C$1005,2,0)))","v":""},{"$f":"IF(D61=\"\",\"\",(VLOOKUP(D61,'Membership #'!$A$1:$C$1005,3,0)))","v":""},null,null,""]
["","","",null,{"$f":"IF(D62=\"\",\"\",(VLOOKUP(D62,'Membership #'!$A$1:$C$1005,2,0)))","v":""},{"$f":"IF(D62=\"\",\"\",(VLOOKUP(D62,'Membership #'!$A$1:$C$1005,3,0)))","v":""},null,null,""]
["","","",null,{"$f":"IF(D63=\"\",\"\",(VLOOKUP(D63,'Membership #'!$A$1:$C$1005,2,0)))","v":""},{"$f":"IF(D63=\"\",\"\",(VLOOKUP(D63,'Membership #'!$A$1:$C$1005,3,0)))","v":""},null,null,""]
["","","",null,{"$f":"IF(D64=\"\",\"\",(VLOOKUP(D64,'Membership #'!$A$1:$C$1005,2,0)))","v":""},{"$f":"IF(D64=\"\",\"\",(VLOOKUP(D64,'Membership #'!$A$1:$C$1005,3,0)))","v":""},null,null,""]
["","","",null,{"$f":"IF(D65=\"\",\"\",(VLOOKUP(D65,'Membership #'!$A$1:$C$1005,2,0)))","v":""},{"$f":"IF(D65=\"\",\"\",(VLOOKUP(D65,'Membership #'!$A$1:$C$1005,3,0)))","v":""},null,null,""]
["","","",null,{"$f":"IF(D66=\"\",\"\",(VLOOKUP(D66,'Membership #'!$A$1:$C$1005,2,0)))","v":""},{"$f":"IF(D66=\"\",\"\",(VLOOKUP(D66,'Membership #'!$A$1:$C$1005,3,0)))","v":""},null,null,""]
["","","",null,{"$f":"IF(D67=\"\",\"\",(VLOOKUP(D67,'Membership #'!$A$1:$C$1005,2,0)))","v":""},{"$f":"IF(D67=\"\",\"\",(VLOOKUP(D67,'Membership #'!$A$1:$C$1005,3,0)))","v":""},null,null,""]
["","","",null,{"$f":"IF(D68=\"\",\"\",(VLOOKUP(D68,'Membership #'!$A$1:$C$1005,2,0)))","v":""},{"$f":"IF(D68=\"\",\"\",(VLOOKUP(D68,'Membership #'!$A$1:$C$1005,3,0)))","v":""},null,null,""]
["","","",null,{"$f":"IF(D69=\"\",\"\",(VLOOKUP(D69,'Membership #'!$A$1:$C$1005,2,0)))","v":""},{"$f":"IF(D69=\"\",\"\",(VLOOKUP(D69,'Membership #'!$A$1:$C$1005,3,0)))","v":""},null,null,""]
["","","",null,{"$f":"IF(D70=\"\",\"\",(VLOOKUP(D70,'Membership #'!$A$1:$C$1005,2,0)))","v":""},{"$f":"IF(D70=\"\",\"\",(VLOOKUP(D70,'Membership #'!$A$1:$C$1005,3,0)))","v":""},null,null,""]
["","","",null,{"$f":"IF(D71=\"\",\"\",(VLOOKUP(D71,'Membership #'!$A$1:$C$1005,2,0)))","v":""},{"$f":"IF(D71=\"\",\"\",(VLOOKUP(D71,'Membership #'!$A$1:$C$1005,3,0)))","v":""},null,null,""]
["",{"$f":"IF(D72<>\"\",RANK(A72,A$8:A$73),\"\")","v":""},"",null,{"$f":"IF(D72=\"\",\"\",(VLOOKUP(D72,'Membership #'!$A$1:$C$1005,2,0)))","v":""},{"$f":"IF(D72=\"\",\"\",(VLOOKUP(D72,'Membership #'!$A$1:$C$1005,3,0)))","v":""},null,null,""]
["",{"$f":"IF(D73<>\"\",RANK(A73,A$8:A$73),\"\")","v":""},"",null,{"$f":"IF(D73=\"\",\"\",(VLOOKUP(D73,'Membership #'!$A$1:$C$1005,2,0)))","v":""},{"$f":"IF(D73=\"\",\"\",(VLOOKUP(D73,'Membership #'!$A$1:$C$1005,3,0)))","v":""},null,null,""]

{"sheet":"JUNIOR HORSE BARRELS","index":7,"n_rows":101,"n_cols":26,"rows_kept":101,"cut":false,"hidden":false,"merged":[[5,12,5,15],[0,0,0,10],[1,0,1,10],[2,0,2,3],[2,6,2,10],[3,0,6,0],[3,1,6,1],[3,2,6,2],[3,3,6,3],[3,4,6,4],[3,9,6,9],[3,10,6,10],[3,5,6,5],[3,6,6,6],[3,7,6,7],[3,8,6,8]]}
["Tom Burt & Mark McGuire Memorial Jackpot Aug 22, 2021",null,null,null,null,null,null,null,null,null,null,null,"x=Scratch"]
["JUNIOR HORSE BARRELS",null,null,null,null,null,null,null,null,null,null,null,"n=No Time"]
["# Enteries:",null,null,null,{"$f":"COUNTIF($D$8:$D$100,\">0\")","v":3},null,null,null,null,null,null,null,null,null,null,null,null,"Don't Erase these numbers below!!"]
["Rand Draw","Seed",null,"RING #      ","NAME","HORSE NAME","TIME","PENALTY ","TOTAL","PLACINGS","POINTS",null,null,null,null,null,null,{"$f":"IF(N9=2,7,IF(N9=3,6,IF(N9=4,5,IF(N9=5,4,IF(AND(N9>5,N11>600),3,IF(AND(N9>5,N11<600,N11>299.99),2,IF(AND(N9>5,N11<300),1,8)))))))","v":6},1,2,3,4,5,6,7,8]
[null,null,null,null,null,null,null,null,null,null,null,null,null,null,null,null,null,null,299,"$300-","$600 -"]
[null,null,null,null,null,null,null,null,null,null,null,null,"JUNIOR HORSE BARRELS",null,null,null,null,null,"or less",599,"More","5 Entries","4 Entries","3 Entries","2 Entries"]
[null,null,null,null,null,null,null,null,null,null,null,null,null,null,null,null,null,"1st",0.32,0.27,0.24,0.35,0.4,0.46,0.6]
[{"$f":"IF(D8<>\"\",RAND(),\"\")","v":0.37644944648866729},{"$f":"IF(D8<>\"\",RANK(A8,A$8:A$101),\"\")","v":3},1,518,{"$f":"IF(D8=\"\",\"\",(VLOOKUP(D8,'Membership #'!$A$1:$C$1005,2,0)))","v":"Sylvester Weatherbie"},{"$f":"IF(D8=\"\",\"\",(VLOOKUP(D8,'Membership #'!$A$1:$C$1005,3,0)))","v":"J.R."},16.062000000000001,null,{"$f":"IF(G8=\"n\",\"No Time\",IF(G8=\"x\",\"Scratch\",IF(G8<>\"\",SUM(G8+H8),\"\")))","v":16.062000000000001},null,null,null,"Added",50,null,null,null,"2nd",0.23,0.22,0.19,0.25,0.28000000000000003,0.34,0.4]
[0.38302648175660059,2,2,563,{"$f":"IF(D9=\"\",\"\",(VLOOKUP(D9,'Membership #'!$A$1:$C$1005,2,0)))","v":"Kevin Bateman"},{"$f":"IF(D9=\"\",\"\",(VLOOKUP(D9,'Membership #'!$A$1:$C$1005,3,0)))","v":"Jess Chasin A Hobby"},16.917999999999999,null,{"$f":"IF(G9=\"n\",\"No Time\",IF(G9=\"x\",\"Scratch\",IF(G9<>\"\",SUM(G9+H9),\"\")))","v":16.917999999999999},null,null,null,"Entries",3,null,10,"per head","3rd",0.15,0.18,0.16,0.17,0.18,0.2]
[0.46716986740337729,1,3,786,{"$f":"IF(D10=\"\",\"\",(VLOOKUP(D10,'Membership #'!$A$1:$C$1005,2,0)))","v":"Rileigh Conrod"},{"$f":"IF(D10=\"\",\"\",(VLOOKUP(D10,'Membership #'!$A$1:$C$1005,3,0)))","v":"Scotches Harley"},21.22,null,{"$f":"IF(G10=\"n\",\"No Time\",IF(G10=\"x\",\"Scratch\",IF(G10<>\"\",SUM(G10+H10),\"\")))","v":21.22},null,null,null,"Jackpot",{"$f":"P9*N9","v":30},null,0.85,"payback","4th",0.12,0.13,0.13,0.13,0.14000000000000001]
["","","",null,{"$f":"IF(D11=\"\",\"\",(VLOOKUP(D11,'Membership #'!$A$1:$C$1005,2,0)))","v":""},{"$f":"IF(D11=\"\",\"\",(VLOOKUP(D11,'Membership #'!$A$1:$C$1005,3,0)))","v":""},null,null,{"$f":"IF(G11=\"n\",\"No Time\",IF(G11=\"x\",\"Scratch\",IF(G11<>\"\",SUM(G11+H11),\"\")))","v":""},null,null,null,"Total Money",{"$f":"N8+(N10*P10)","v":75.5},null,{"$f":"N10*P10","v":25.5},"Jackpot","5th",0.1,0.09,0.08,0.1]
["","","",null,{"$f":"IF(D12=\"\",\"\",(VLOOKUP(D12,'Membership #'!$A$1:$C$1005,2,0)))","v":""},{"$f":"IF(D12=\"\",\"\",(VLOOKUP(D12,'Membership #'!$A$1:$C$1005,3,0)))","v":""},null,null,{"$f":"IF(G12=\"n\",\"No Time\",IF(G12=\"x\",\"Scratch\",IF(G12<>\"\",SUM(G12+H12),\"\")))","v":""},null,null,null,null,"Percentage","Money","Ring #",null,"6th",0.08,0.06,0.06]
["","","",null,{"$f":"IF(D13=\"\",\"\",(VLOOKUP(D13,'Membership #'!$A$1:$C$1005,2,0)))","v":""},{"$f":"IF(D13=\"\",\"\",(VLOOKUP(D13,'Membership #'!$A$1:$C$1005,3,0)))","v":""},null,null,{"$f":"IF(G13=\"n\",\"No Time\",IF(G13=\"x\",\"Scratch\",IF(G13<>\"\",SUM(G13+H13),\"\")))","v":""},null,null,null,"1st",0.46,{"$f":"IF(N13<>0,N$11*N13,\"\")","v":34.730000000000004},null,{"$f":"IF(P13=\"\",\"\",(VLOOKUP(P13,'Membership #'!$A$1:$C$1005,2,0)))","v":""},"7th",null,0.03,0.05]
["","","",null,{"$f":"IF(D14=\"\",\"\",(VLOOKUP(D14,'Membership #'!$A$1:$C$1005,2,0)))","v":""},{"$f":"IF(D14=\"\",\"\",(VLOOKUP(D14,'Membership #'!$A$1:$C$1005,3,0)))","v":""},null,null,{"$f":"IF(G14=\"n\",\"No Time\",IF(G14=\"x\",\"Scratch\",IF(G14<>\"\",SUM(G14+H14),\"\")))","v":""},null,null,null,"2nd",0.34,25.67,null,{"$f":"IF(P14=\"\",\"\",(VLOOKUP(P14,'Membership #'!$A$1:$C$1005,2,0)))","v":""},"8th",null,0.02,0.04]
["","","",null,{"$f":"IF(D15=\"\",\"\",(VLOOKUP(D15,'Membership #'!$A$1:$C$1005,2,0)))","v":""},{"$f":"IF(D15=\"\",\"\",(VLOOKUP(D15,'Membership #'!$A$1:$C$1005,3,0)))","v":""},null,null,"",null,null,null,"3rd",0.2,15.100000000000001,null,{"$f":"IF(P15=\"\",\"\",(VLOOKUP(P15,'Membership #'!$A$1:$C$1005,2,0)))","v":""},"9th",null,null,0.03]
["","","",null,{"$f":"IF(D16=\"\",\"\",(VLOOKUP(D16,'Membership #'!$A$1:$C$1005,2,0)))","v":""},{"$f":"IF(D16=\"\",\"\",(VLOOKUP(D16,'Membership #'!$A$1:$C$1005,3,0)))","v":""},null,null,"",null,null,null,"4th",null,"",null,{"$f":"IF(P16=\"\",\"\",(VLOOKUP(P16,'Membership #'!$A$1:$C$1005,2,0)))","v":""},"10th",null,null,0.02]
["","","",null,{"$f":"IF(D17=\"\",\"\",(VLOOKUP(D17,'Membership #'!$A$1:$C$1005,2,0)))","v":""},{"$f":"IF(D17=\"\",\"\",(VLOOKUP(D17,'Membership #'!$A$1:$C$1005,3,0)))","v":""},null,null,"",null,null,null,"5th",null,"",null,{"$f":"IF(P17=\"\",\"\",(VLOOKUP(P17,'Membership #'!$A$1:$C$1005,2,0)))","v":""}]
["","","",null,{"$f":"IF(D18=\"\",\"\",(VLOOKUP(D18,'Membership #'!$A$1:$C$1005,2,0)))","v":""},{"$f":"IF(D18=\"\",\"\",(VLOOKUP(D18,'Membership #'!$A$1:$C$1005,3,0)))","v":""},null,null,"",null,null,null,"6th",null,"",null,{"$f":"IF(P18=\"\",\"\",(VLOOKUP(P18,'Membership #'!$A$1:$C$1005,2,0)))","v":""}]
["","","",null,{"$f":"IF(D19=\"\",\"\",(VLOOKUP(D19,'Membership #'!$A$1:$C$1005,2,0)))","v":""},{"$f":"IF(D19=\"\",\"\",(VLOOKUP(D19,'Membership #'!$A$1:$C$1005,3,0)))","v":""},null,null,"",null,null,null,"7th",null,""]
["","","",null,{"$f":"IF(D20=\"\",\"\",(VLOOKUP(D20,'Membership #'!$A$1:$C$1005,2,0)))","v":""},{"$f":"IF(D20=\"\",\"\",(VLOOKUP(D20,'Membership #'!$A$1:$C$1005,3,0)))","v":""},null,null,{"$f":"IF(G20=\"n\",\"No Time\",IF(G20=\"x\",\"Scratch\",IF(G20<>\"\",SUM(G20+H20),\"\")))","v":""},null,null,null,"8th",null,""]
["","","",null,{"$f":"IF(D21=\"\",\"\",(VLOOKUP(D21,'Membership #'!$A$1:$C$1005,2,0)))","v":""},{"$f":"IF(D21=\"\",\"\",(VLOOKUP(D21,'Membership #'!$A$1:$C$1005,3,0)))","v":""},null,null,"",null,null,null,"9th",null,""]
["","","",null,{"$f":"IF(D22=\"\",\"\",(VLOOKUP(D22,'Membership #'!$A$1:$C$1005,2,0)))","v":""},{"$f":"IF(D22=\"\",\"\",(VLOOKUP(D22,'Membership #'!$A$1:$C$1005,3,0)))","v":""},null,null,{"$f":"IF(G22=\"n\",\"No Time\",IF(G22=\"x\",\"Scratch\",IF(G22<>\"\",SUM(G22+H22),\"\")))","v":""},null,null,null,"10th",null,""]
["","","",null,{"$f":"IF(D23=\"\",\"\",(VLOOKUP(D23,'Membership #'!$A$1:$C$1005,2,0)))","v":""},{"$f":"IF(D23=\"\",\"\",(VLOOKUP(D23,'Membership #'!$A$1:$C$1005,3,0)))","v":""},null,null,"",null,null,null,"Total Money",null,{"$f":"SUM(O13:O22)","v":75.5}]
["","","",null,{"$f":"IF(D24=\"\",\"\",(VLOOKUP(D24,'Membership #'!$A$1:$C$1005,2,0)))","v":""},{"$f":"IF(D24=\"\",\"\",(VLOOKUP(D24,'Membership #'!$A$1:$C$1005,3,0)))","v":""},null,null,""]
["","","",null,{"$f":"IF(D25=\"\",\"\",(VLOOKUP(D25,'Membership #'!$A$1:$C$1005,2,0)))","v":""},{"$f":"IF(D25=\"\",\"\",(VLOOKUP(D25,'Membership #'!$A$1:$C$1005,3,0)))","v":""},null,null,""]
["","","",null,{"$f":"IF(D26=\"\",\"\",(VLOOKUP(D26,'Membership #'!$A$1:$C$1005,2,0)))","v":""},{"$f":"IF(D26=\"\",\"\",(VLOOKUP(D26,'Membership #'!$A$1:$C$1005,3,0)))","v":""},null,null,"",null,null,null,{"$f":"IF(L26=\"\",\"\",(VLOOKUP(L26,'Membership #'!$A$1:$C$1005,2,0)))","v":""}]
["","","",null,{"$f":"IF(D27=\"\",\"\",(VLOOKUP(D27,'Membership #'!$A$1:$C$1005,2,0)))","v":""},{"$f":"IF(D27=\"\",\"\",(VLOOKUP(D27,'Membership #'!$A$1:$C$1005,3,0)))","v":""},null,null,""]
["","","",null,{"$f":"IF(D28=\"\",\"\",(VLOOKUP(D28,'Membership #'!$A$1:$C$1005,2,0)))","v":""},{"$f":"IF(D28=\"\",\"\",(VLOOKUP(D28,'Membership #'!$A$1:$C$1005,3,0)))","v":""},null,null,""]
["","","",null,{"$f":"IF(D29=\"\",\"\",(VLOOKUP(D29,'Membership #'!$A$1:$C$1005,2,0)))","v":""},{"$f":"IF(D29=\"\",\"\",(VLOOKUP(D29,'Membership #'!$A$1:$C$1005,3,0)))","v":""},null,null,""]
["","","",null,{"$f":"IF(D30=\"\",\"\",(VLOOKUP(D30,'Membership #'!$A$1:$C$1005,2,0)))","v":""},{"$f":"IF(D30=\"\",\"\",(VLOOKUP(D30,'Membership #'!$A$1:$C$1005,3,0)))","v":""},null,null,""]
["","","",null,{"$f":"IF(D31=\"\",\"\",(VLOOKUP(D31,'Membership #'!$A$1:$C$1005,2,0)))","v":""},{"$f":"IF(D31=\"\",\"\",(VLOOKUP(D31,'Membership #'!$A$1:$C$1005,3,0)))","v":""},null,null,""]
["","","",null,{"$f":"IF(D32=\"\",\"\",(VLOOKUP(D32,'Membership #'!$A$1:$C$1005,2,0)))","v":""},{"$f":"IF(D32=\"\",\"\",(VLOOKUP(D32,'Membership #'!$A$1:$C$1005,3,0)))","v":""},null,null,""]
["","","",null,{"$f":"IF(D33=\"\",\"\",(VLOOKUP(D33,'Membership #'!$A$1:$C$1005,2,0)))","v":""},{"$f":"IF(D33=\"\",\"\",(VLOOKUP(D33,'Membership #'!$A$1:$C$1005,3,0)))","v":""},null,null,""]
["","","",null,{"$f":"IF(D34=\"\",\"\",(VLOOKUP(D34,'Membership #'!$A$1:$C$1005,2,0)))","v":""},{"$f":"IF(D34=\"\",\"\",(VLOOKUP(D34,'Membership #'!$A$1:$C$1005,3,0)))","v":""},null,null,""]
["","","",null,{"$f":"IF(D35=\"\",\"\",(VLOOKUP(D35,'Membership #'!$A$1:$C$1005,2,0)))","v":""},{"$f":"IF(D35=\"\",\"\",(VLOOKUP(D35,'Membership #'!$A$1:$C$1005,3,0)))","v":""},null,null,""]
["","","",null,{"$f":"IF(D36=\"\",\"\",(VLOOKUP(D36,'Membership #'!$A$1:$C$1005,2,0)))","v":""},{"$f":"IF(D36=\"\",\"\",(VLOOKUP(D36,'Membership #'!$A$1:$C$1005,3,0)))","v":""},null,null,""]
["","","",null,{"$f":"IF(D37=\"\",\"\",(VLOOKUP(D37,'Membership #'!$A$1:$C$1005,2,0)))","v":""},{"$f":"IF(D37=\"\",\"\",(VLOOKUP(D37,'Membership #'!$A$1:$C$1005,3,0)))","v":""},null,null,""]
["","","",null,{"$f":"IF(D38=\"\",\"\",(VLOOKUP(D38,'Membership #'!$A$1:$C$1005,2,0)))","v":""},{"$f":"IF(D38=\"\",\"\",(VLOOKUP(D38,'Membership #'!$A$1:$C$1005,3,0)))","v":""},null,null,""]
["","","",null,{"$f":"IF(D39=\"\",\"\",(VLOOKUP(D39,'Membership #'!$A$1:$C$1005,2,0)))","v":""},{"$f":"IF(D39=\"\",\"\",(VLOOKUP(D39,'Membership #'!$A$1:$C$1005,3,0)))","v":""},null,null,""]
[{"$f":"IF(D40<>\"\",RAND(),\"\")","v":""},{"$f":"IF(D40<>\"\",RANK(A40,A$8:A$101),\"\")","v":""},"",null,{"$f":"IF(D40=\"\",\"\",(VLOOKUP(D40,'Membership #'!$A$1:$C$1005,2,0)))","v":""},{"$f":"IF(D40=\"\",\"\",(VLOOKUP(D40,'Membership #'!$A$1:$C$1005,3,0)))","v":""},null,null,""]
["","","",null,{"$f":"IF(D41=\"\",\"\",(VLOOKUP(D41,'Membership #'!$A$1:$C$1005,2,0)))","v":""},{"$f":"IF(D41=\"\",\"\",(VLOOKUP(D41,'Membership #'!$A$1:$C$1005,3,0)))","v":""},null,null,""]
["","","",null,{"$f":"IF(D42=\"\",\"\",(VLOOKUP(D42,'Membership #'!$A$1:$C$1005,2,0)))","v":""},{"$f":"IF(D42=\"\",\"\",(VLOOKUP(D42,'Membership #'!$A$1:$C$1005,3,0)))","v":""},null,null,""]
["","","",null,{"$f":"IF(D43=\"\",\"\",(VLOOKUP(D43,'Membership #'!$A$1:$C$1005,2,0)))","v":""},{"$f":"IF(D43=\"\",\"\",(VLOOKUP(D43,'Membership #'!$A$1:$C$1005,3,0)))","v":""},null,null,""]
["","","",null,{"$f":"IF(D44=\"\",\"\",(VLOOKUP(D44,'Membership #'!$A$1:$C$1005,2,0)))","v":""},{"$f":"IF(D44=\"\",\"\",(VLOOKUP(D44,'Membership #'!$A$1:$C$1005,3,0)))","v":""},null,null,""]
["","","",null,{"$f":"IF(D45=\"\",\"\",(VLOOKUP(D45,'Membership #'!$A$1:$C$1005,2,0)))","v":""},{"$f":"IF(D45=\"\",\"\",(VLOOKUP(D45,'Membership #'!$A$1:$C$1005,3,0)))","v":""},null,null,""]
["","","",null,{"$f":"IF(D46=\"\",\"\",(VLOOKUP(D46,'Membership #'!$A$1:$C$1005,2,0)))","v":""},{"$f":"IF(D46=\"\",\"\",(VLOOKUP(D46,'Membership #'!$A$1:$C$1005,3,0)))","v":""},null,null,""]
["","","",null,{"$f":"IF(D47=\"\",\"\",(VLOOKUP(D47,'Membership #'!$A$1:$C$1005,2,0)))","v":""},{"$f":"IF(D47=\"\",\"\",(VLOOKUP(D47,'Membership #'!$A$1:$C$1005,3,0)))","v":""},null,null,""]
["","","",null,{"$f":"IF(D48=\"\",\"\",(VLOOKUP(D48,'Membership #'!$A$1:$C$1005,2,0)))","v":""},{"$f":"IF(D48=\"\",\"\",(VLOOKUP(D48,'Membership #'!$A$1:$C$1005,3,0)))","v":""},null,null,""]
["","","",null,{"$f":"IF(D49=\"\",\"\",(VLOOKUP(D49,'Membership #'!$A$1:$C$1005,2,0)))","v":""},{"$f":"IF(D49=\"\",\"\",(VLOOKUP(D49,'Membership #'!$A$1:$C$1005,3,0)))","v":""},null,null,""]
["","","",null,{"$f":"IF(D50=\"\",\"\",(VLOOKUP(D50,'Membership #'!$A$1:$C$1005,2,0)))","v":""},{"$f":"IF(D50=\"\",\"\",(VLOOKUP(D50,'Membership #'!$A$1:$C$1005,3,0)))","v":""},null,null,""]
["","","",null,{"$f":"IF(D51=\"\",\"\",(VLOOKUP(D51,'Membership #'!$A$1:$C$1005,2,0)))","v":""},{"$f":"IF(D51=\"\",\"\",(VLOOKUP(D51,'Membership #'!$A$1:$C$1005,3,0)))","v":""},null,null,""]
["","","",null,{"$f":"IF(D52=\"\",\"\",(VLOOKUP(D52,'Membership #'!$A$1:$C$1005,2,0)))","v":""},{"$f":"IF(D52=\"\",\"\",(VLOOKUP(D52,'Membership #'!$A$1:$C$1005,3,0)))","v":""},null,null,""]
["","","",null,{"$f":"IF(D53=\"\",\"\",(VLOOKUP(D53,'Membership #'!$A$1:$C$1005,2,0)))","v":""},{"$f":"IF(D53=\"\",\"\",(VLOOKUP(D53,'Membership #'!$A$1:$C$1005,3,0)))","v":""},null,null,""]
["","","",null,{"$f":"IF(D54=\"\",\"\",(VLOOKUP(D54,'Membership #'!$A$1:$C$1005,2,0)))","v":""},{"$f":"IF(D54=\"\",\"\",(VLOOKUP(D54,'Membership #'!$A$1:$C$1005,3,0)))","v":""},null,null,""]
["","","",null,{"$f":"IF(D55=\"\",\"\",(VLOOKUP(D55,'Membership #'!$A$1:$C$1005,2,0)))","v":""},{"$f":"IF(D55=\"\",\"\",(VLOOKUP(D55,'Membership #'!$A$1:$C$1005,3,0)))","v":""},null,null,""]
["","","",null,{"$f":"IF(D56=\"\",\"\",(VLOOKUP(D56,'Membership #'!$A$1:$C$1005,2,0)))","v":""},{"$f":"IF(D56=\"\",\"\",(VLOOKUP(D56,'Membership #'!$A$1:$C$1005,3,0)))","v":""},null,null,""]
["","","",null,{"$f":"IF(D57=\"\",\"\",(VLOOKUP(D57,'Membership #'!$A$1:$C$1005,2,0)))","v":""},{"$f":"IF(D57=\"\",\"\",(VLOOKUP(D57,'Membership #'!$A$1:$C$1005,3,0)))","v":""},null,null,""]
["","","",null,{"$f":"IF(D58=\"\",\"\",(VLOOKUP(D58,'Membership #'!$A$1:$C$1005,2,0)))","v":""},{"$f":"IF(D58=\"\",\"\",(VLOOKUP(D58,'Membership #'!$A$1:$C$1005,3,0)))","v":""},null,null,""]
["","","",null,{"$f":"IF(D59=\"\",\"\",(VLOOKUP(D59,'Membership #'!$A$1:$C$1005,2,0)))","v":""},{"$f":"IF(D59=\"\",\"\",(VLOOKUP(D59,'Membership #'!$A$1:$C$1005,3,0)))","v":""},null,null,""]
["","","",null,{"$f":"IF(D60=\"\",\"\",(VLOOKUP(D60,'Membership #'!$A$1:$C$1005,2,0)))","v":""},{"$f":"IF(D60=\"\",\"\",(VLOOKUP(D60,'Membership #'!$A$1:$C$1005,3,0)))","v":""},null,null,""]
["","","",null,{"$f":"IF(D61=\"\",\"\",(VLOOKUP(D61,'Membership #'!$A$1:$C$1005,2,0)))","v":""},{"$f":"IF(D61=\"\",\"\",(VLOOKUP(D61,'Membership #'!$A$1:$C$1005,3,0)))","v":""},null,null,""]
["","","",null,{"$f":"IF(D62=\"\",\"\",(VLOOKUP(D62,'Membership #'!$A$1:$C$1005,2,0)))","v":""},{"$f":"IF(D62=\"\",\"\",(VLOOKUP(D62,'Membership #'!$A$1:$C$1005,3,0)))","v":""},null,null,""]
["","","",null,{"$f":"IF(D63=\"\",\"\",(VLOOKUP(D63,'Membership #'!$A$1:$C$1005,2,0)))","v":""},{"$f":"IF(D63=\"\",\"\",(VLOOKUP(D63,'Membership #'!$A$1:$C$1005,3,0)))","v":""},null,null,""]
["","","",null,{"$f":"IF(D64=\"\",\"\",(VLOOKUP(D64,'Membership #'!$A$1:$C$1005,2,0)))","v":""},{"$f":"IF(D64=\"\",\"\",(VLOOKUP(D64,'Membership #'!$A$1:$C$1005,3,0)))","v":""},null,null,""]
["","","",null,{"$f":"IF(D65=\"\",\"\",(VLOOKUP(D65,'Membership #'!$A$1:$C$1005,2,0)))","v":""},{"$f":"IF(D65=\"\",\"\",(VLOOKUP(D65,'Membership #'!$A$1:$C$1005,3,0)))","v":""},null,null,""]
["","","",null,{"$f":"IF(D66=\"\",\"\",(VLOOKUP(D66,'Membership #'!$A$1:$C$1005,2,0)))","v":""},{"$f":"IF(D66=\"\",\"\",(VLOOKUP(D66,'Membership #'!$A$1:$C$1005,3,0)))","v":""},null,null,""]
["","","",null,{"$f":"IF(D67=\"\",\"\",(VLOOKUP(D67,'Membership #'!$A$1:$C$1005,2,0)))","v":""},{"$f":"IF(D67=\"\",\"\",(VLOOKUP(D67,'Membership #'!$A$1:$C$1005,3,0)))","v":""},null,null,""]
["","","",null,{"$f":"IF(D68=\"\",\"\",(VLOOKUP(D68,'Membership #'!$A$1:$C$1005,2,0)))","v":""},{"$f":"IF(D68=\"\",\"\",(VLOOKUP(D68,'Membership #'!$A$1:$C$1005,3,0)))","v":""},null,null,""]
["","","",null,{"$f":"IF(D69=\"\",\"\",(VLOOKUP(D69,'Membership #'!$A$1:$C$1005,2,0)))","v":""},{"$f":"IF(D69=\"\",\"\",(VLOOKUP(D69,'Membership #'!$A$1:$C$1005,3,0)))","v":""},null,null,""]
["","","",null,{"$f":"IF(D70=\"\",\"\",(VLOOKUP(D70,'Membership #'!$A$1:$C$1005,2,0)))","v":""},{"$f":"IF(D70=\"\",\"\",(VLOOKUP(D70,'Membership #'!$A$1:$C$1005,3,0)))","v":""},null,null,""]
["","","",null,{"$f":"IF(D71=\"\",\"\",(VLOOKUP(D71,'Membership #'!$A$1:$C$1005,2,0)))","v":""},{"$f":"IF(D71=\"\",\"\",(VLOOKUP(D71,'Membership #'!$A$1:$C$1005,3,0)))","v":""},null,null,""]
[{"$f":"IF(D72<>\"\",RAND(),\"\")","v":""},{"$f":"IF(D72<>\"\",RANK(A72,A$8:A$101),\"\")","v":""},"",null,{"$f":"IF(D72=\"\",\"\",(VLOOKUP(D72,'Membership #'!$A$1:$C$1005,2,0)))","v":""},{"$f":"IF(D72=\"\",\"\",(VLOOKUP(D72,'Membership #'!$A$1:$C$1005,3,0)))","v":""},null,null,""]
["","","",null,{"$f":"IF(D73=\"\",\"\",(VLOOKUP(D73,'Membership #'!$A$1:$C$1005,2,0)))","v":""},{"$f":"IF(D73=\"\",\"\",(VLOOKUP(D73,'Membership #'!$A$1:$C$1005,3,0)))","v":""},null,null,{"$f":"IF(G73=\"n\",\"No Time\",IF(G73=\"x\",\"Scratch\",IF(G73<>\"\",SUM(G73+H73),\"\")))","v":""}]
["","","",null,{"$f":"IF(D74=\"\",\"\",(VLOOKUP(D74,'Membership #'!$A$1:$C$1005,2,0)))","v":""},{"$f":"IF(D74=\"\",\"\",(VLOOKUP(D74,'Membership #'!$A$1:$C$1005,3,0)))","v":""},null,null,""]
["","","",null,{"$f":"IF(D75=\"\",\"\",(VLOOKUP(D75,'Membership #'!$A$1:$C$1005,2,0)))","v":""},{"$f":"IF(D75=\"\",\"\",(VLOOKUP(D75,'Membership #'!$A$1:$C$1005,3,0)))","v":""},null,null,""]
["","","",null,{"$f":"IF(D76=\"\",\"\",(VLOOKUP(D76,'Membership #'!$A$1:$C$1005,2,0)))","v":""},{"$f":"IF(D76=\"\",\"\",(VLOOKUP(D76,'Membership #'!$A$1:$C$1005,3,0)))","v":""},null,null,""]
["","","",null,{"$f":"IF(D77=\"\",\"\",(VLOOKUP(D77,'Membership #'!$A$1:$C$1005,2,0)))","v":""},{"$f":"IF(D77=\"\",\"\",(VLOOKUP(D77,'Membership #'!$A$1:$C$1005,3,0)))","v":""},null,null,""]
["","","",null,{"$f":"IF(D78=\"\",\"\",(VLOOKUP(D78,'Membership #'!$A$1:$C$1005,2,0)))","v":""},{"$f":"IF(D78=\"\",\"\",(VLOOKUP(D78,'Membership #'!$A$1:$C$1005,3,0)))","v":""},null,null,""]
["","","",null,{"$f":"IF(D79=\"\",\"\",(VLOOKUP(D79,'Membership #'!$A$1:$C$1005,2,0)))","v":""},{"$f":"IF(D79=\"\",\"\",(VLOOKUP(D79,'Membership #'!$A$1:$C$1005,3,0)))","v":""},null,null,""]
["","","",null,{"$f":"IF(D80=\"\",\"\",(VLOOKUP(D80,'Membership #'!$A$1:$C$1005,2,0)))","v":""},{"$f":"IF(D80=\"\",\"\",(VLOOKUP(D80,'Membership #'!$A$1:$C$1005,3,0)))","v":""},null,null,""]
["","","",null,{"$f":"IF(D81=\"\",\"\",(VLOOKUP(D81,'Membership #'!$A$1:$C$1005,2,0)))","v":""},{"$f":"IF(D81=\"\",\"\",(VLOOKUP(D81,'Membership #'!$A$1:$C$1005,3,0)))","v":""},null,null,""]
["","","",null,{"$f":"IF(D82=\"\",\"\",(VLOOKUP(D82,'Membership #'!$A$1:$C$1005,2,0)))","v":""},{"$f":"IF(D82=\"\",\"\",(VLOOKUP(D82,'Membership #'!$A$1:$C$1005,3,0)))","v":""},null,null,""]
["","","",null,{"$f":"IF(D83=\"\",\"\",(VLOOKUP(D83,'Membership #'!$A$1:$C$1005,2,0)))","v":""},{"$f":"IF(D83=\"\",\"\",(VLOOKUP(D83,'Membership #'!$A$1:$C$1005,3,0)))","v":""},null,null,""]
["","","",null,{"$f":"IF(D84=\"\",\"\",(VLOOKUP(D84,'Membership #'!$A$1:$C$1005,2,0)))","v":""},{"$f":"IF(D84=\"\",\"\",(VLOOKUP(D84,'Membership #'!$A$1:$C$1005,3,0)))","v":""},null,null,""]
["","","",null,{"$f":"IF(D85=\"\",\"\",(VLOOKUP(D85,'Membership #'!$A$1:$C$1005,2,0)))","v":""},{"$f":"IF(D85=\"\",\"\",(VLOOKUP(D85,'Membership #'!$A$1:$C$1005,3,0)))","v":""},null,null,""]
["","","",null,{"$f":"IF(D86=\"\",\"\",(VLOOKUP(D86,'Membership #'!$A$1:$C$1005,2,0)))","v":""},{"$f":"IF(D86=\"\",\"\",(VLOOKUP(D86,'Membership #'!$A$1:$C$1005,3,0)))","v":""},null,null,""]
["","","",null,{"$f":"IF(D87=\"\",\"\",(VLOOKUP(D87,'Membership #'!$A$1:$C$1005,2,0)))","v":""},{"$f":"IF(D87=\"\",\"\",(VLOOKUP(D87,'Membership #'!$A$1:$C$1005,3,0)))","v":""},null,null,""]
["","","",null,{"$f":"IF(D88=\"\",\"\",(VLOOKUP(D88,'Membership #'!$A$1:$C$1005,2,0)))","v":""},{"$f":"IF(D88=\"\",\"\",(VLOOKUP(D88,'Membership #'!$A$1:$C$1005,3,0)))","v":""},null,null,""]
["","","",null,{"$f":"IF(D89=\"\",\"\",(VLOOKUP(D89,'Membership #'!$A$1:$C$1005,2,0)))","v":""},{"$f":"IF(D89=\"\",\"\",(VLOOKUP(D89,'Membership #'!$A$1:$C$1005,3,0)))","v":""},null,null,""]
["","","",null,{"$f":"IF(D90=\"\",\"\",(VLOOKUP(D90,'Membership #'!$A$1:$C$1005,2,0)))","v":""},{"$f":"IF(D90=\"\",\"\",(VLOOKUP(D90,'Membership #'!$A$1:$C$1005,3,0)))","v":""},null,null,""]
["","","",null,{"$f":"IF(D91=\"\",\"\",(VLOOKUP(D91,'Membership #'!$A$1:$C$1005,2,0)))","v":""},{"$f":"IF(D91=\"\",\"\",(VLOOKUP(D91,'Membership #'!$A$1:$C$1005,3,0)))","v":""},null,null,""]
["","","",null,{"$f":"IF(D92=\"\",\"\",(VLOOKUP(D92,'Membership #'!$A$1:$C$1005,2,0)))","v":""},{"$f":"IF(D92=\"\",\"\",(VLOOKUP(D92,'Membership #'!$A$1:$C$1005,3,0)))","v":""},null,null,""]
["","","",null,{"$f":"IF(D93=\"\",\"\",(VLOOKUP(D93,'Membership #'!$A$1:$C$1005,2,0)))","v":""},{"$f":"IF(D93=\"\",\"\",(VLOOKUP(D93,'Membership #'!$A$1:$C$1005,3,0)))","v":""},null,null,""]
["","","",null,{"$f":"IF(D94=\"\",\"\",(VLOOKUP(D94,'Membership #'!$A$1:$C$1005,2,0)))","v":""},{"$f":"IF(D94=\"\",\"\",(VLOOKUP(D94,'Membership #'!$A$1:$C$1005,3,0)))","v":""},null,null,""]
["","","",null,{"$f":"IF(D95=\"\",\"\",(VLOOKUP(D95,'Membership #'!$A$1:$C$1005,2,0)))","v":""},{"$f":"IF(D95=\"\",\"\",(VLOOKUP(D95,'Membership #'!$A$1:$C$1005,3,0)))","v":""},null,null,""]
["","","",null,{"$f":"IF(D96=\"\",\"\",(VLOOKUP(D96,'Membership #'!$A$1:$C$1005,2,0)))","v":""},{"$f":"IF(D96=\"\",\"\",(VLOOKUP(D96,'Membership #'!$A$1:$C$1005,3,0)))","v":""},null,null,""]
["","","",null,{"$f":"IF(D97=\"\",\"\",(VLOOKUP(D97,'Membership #'!$A$1:$C$1005,2,0)))","v":""},{"$f":"IF(D97=\"\",\"\",(VLOOKUP(D97,'Membership #'!$A$1:$C$1005,3,0)))","v":""},null,null,""]
["","","",null,{"$f":"IF(D98=\"\",\"\",(VLOOKUP(D98,'Membership #'!$A$1:$C$1005,2,0)))","v":""},{"$f":"IF(D98=\"\",\"\",(VLOOKUP(D98,'Membership #'!$A$1:$C$1005,3,0)))","v":""},null,null,""]
["","","",null,{"$f":"IF(D99=\"\",\"\",(VLOOKUP(D99,'Membership #'!$A$1:$C$1005,2,0)))","v":""},{"$f":"IF(D99=\"\",\"\",(VLOOKUP(D99,'Membership #'!$A$1:$C$1005,3,0)))","v":""},null,null,""]
["","","",null,{"$f":"IF(D100=\"\",\"\",(VLOOKUP(D100,'Membership #'!$A$1:$C$1005,2,0)))","v":""},{"$f":"IF(D100=\"\",\"\",(VLOOKUP(D100,'Membership #'!$A$1:$C$1005,3,0)))","v":""},null,null,""]
["","","",null,{"$f":"IF(D101=\"\",\"\",(VLOOKUP(D101,'Membership #'!$A$1:$C$1005,2,0)))","v":""},{"$f":"IF(D101=\"\",\"\",(VLOOKUP(D101,'Membership #'!$A$1:$C$1005,3,0)))","v":""},null,null,""]

{"sheet":"Adult Green Barrels","index":8,"n_rows":101,"n_cols":26,"rows_kept":101,"cut":false,"hidden":false,"merged":[[5,12,5,15],[0,0,0,10],[1,0,1,10],[2,0,2,3],[2,6,2,10],[3,0,6,0],[3,1,6,1],[3,2,6,2],[3,3,6,3],[3,4,6,4],[3,9,6,9],[3,10,6,10],[3,5,6,5],[3,6,6,6],[3,7,6,7],[3,8,6,8]]}
["Tom Burt & Mark McGuire Memorial Jackpot Aug 22, 2021",null,null,null,null,null,null,null,null,null,null,null,"x=Scratch"]
["Adult Green Barrels ",null,null,null,null,null,null,null,null,null,null,null,"n=No Time"]
["# Enteries:",null,null,null,{"$f":"COUNTIF($D$8:$D$100,\">0\")","v":1},null,null,null,null,null,null,null,null,null,null,null,null,"Don't Erase these numbers below!!"]
["Rand Draw","Seed",null,"RING #      ","NAME","HORSE NAME","TIME","PENALTY ","TOTAL","PLACINGS","POINTS",null,null,null,null,null,null,{"$f":"IF(N9=2,7,IF(N9=3,6,IF(N9=4,5,IF(N9=5,4,IF(AND(N9>5,N11>600),3,IF(AND(N9>5,N11<600,N11>299.99),2,IF(AND(N9>5,N11<300),1,8)))))))","v":7},1,2,3,4,5,6,7,8]
[null,null,null,null,null,null,null,null,null,null,null,null,null,null,null,null,null,null,299,"$300-","$600 -"]
[null,null,null,null,null,null,null,null,null,null,null,null,"Adult Green Barrels ",null,null,null,null,null,"or less",599,"More","5 Entries","4 Entries","3 Entries","2 Entries"]
[null,null,null,null,null,null,null,null,null,null,null,null,null,null,null,null,null,"1st",0.32,0.27,0.24,0.35,0.4,0.46,0.6]
[{"$f":"IF(D8<>\"\",RAND(),\"\")","v":0.92367031964961477},{"$f":"IF(D8<>\"\",RANK(A8,A$8:A$101),\"\")","v":1},1,969,{"$f":"IF(D8=\"\",\"\",(VLOOKUP(D8,'Membership #'!$A$1:$C$1005,2,0)))","v":"Kenzie Cook"},{"$f":"IF(D8=\"\",\"\",(VLOOKUP(D8,'Membership #'!$A$1:$C$1005,3,0)))","v":"Pocos Lady Emerald"},33.023000000000003,null,{"$f":"IF(G8=\"n\",\"No Time\",IF(G8=\"x\",\"Scratch\",IF(G8<>\"\",SUM(G8+H8),\"\")))","v":33.023000000000003},null,null,null,"Added",25,null,null,null,"2nd",0.23,0.22,0.19,0.25,0.28000000000000003,0.34,0.4]
[{"$f":"IF(M26<>\"\",RAND(),\"\")","v":""},{"$f":"IF(M26<>\"\",RANK(A9,A$8:A$101),\"\")","v":""},2,"909b",{"$f":"IF(D9=\"\",\"\",(VLOOKUP(D9,'Membership #'!$A$1:$C$1005,2,0)))","v":"Bryden MacNeil"},{"$f":"IF(D9=\"\",\"\",(VLOOKUP(D9,'Membership #'!$A$1:$C$1005,3,0)))","v":"Martha's Tivio Moon"},"x",null,{"$f":"IF(G9=\"n\",\"No Time\",IF(G9=\"x\",\"Scratch\",IF(G9<>\"\",SUM(G9+H9),\"\")))","v":"Scratch"},null,null,null,"Entries",2,null,10,"per head","3rd",0.15,0.18,0.16,0.17,0.18,0.2]
[{"$f":"IF(M27<>\"\",RAND(),\"\")","v":""},{"$f":"IF(M27<>\"\",RANK(A10,A$8:A$101),\"\")","v":""},null,null,{"$f":"IF(D10=\"\",\"\",(VLOOKUP(D10,'Membership #'!$A$1:$C$1005,2,0)))","v":""},{"$f":"IF(D10=\"\",\"\",(VLOOKUP(D10,'Membership #'!$A$1:$C$1005,3,0)))","v":""},null,null,{"$f":"IF(G10=\"n\",\"No Time\",IF(G10=\"x\",\"Scratch\",IF(G10<>\"\",SUM(G10+H10),\"\")))","v":""},null,null,null,"Jackpot",{"$f":"P9*N9","v":20},null,0.85,"payback","4th",0.12,0.13,0.13,0.13,0.14000000000000001]
["","",null,null,{"$f":"IF(D11=\"\",\"\",(VLOOKUP(D11,'Membership #'!$A$1:$C$1005,2,0)))","v":""},{"$f":"IF(D11=\"\",\"\",(VLOOKUP(D11,'Membership #'!$A$1:$C$1005,3,0)))","v":""},null,null,{"$f":"IF(G11=\"n\",\"No Time\",IF(G11=\"x\",\"Scratch\",IF(G11<>\"\",SUM(G11+H11),\"\")))","v":""},null,null,null,"Total Money",{"$f":"N8+(N10*P10)","v":42},null,{"$f":"N10*P10","v":17},"Jackpot","5th",0.1,0.09,0.08,0.1]
["","","",null,{"$f":"IF(D12=\"\",\"\",(VLOOKUP(D12,'Membership #'!$A$1:$C$1005,2,0)))","v":""},{"$f":"IF(D12=\"\",\"\",(VLOOKUP(D12,'Membership #'!$A$1:$C$1005,3,0)))","v":""},null,null,{"$f":"IF(G12=\"n\",\"No Time\",IF(G12=\"x\",\"Scratch\",IF(G12<>\"\",SUM(G12+H12),\"\")))","v":""},null,null,null,null,"Percentage","Money","Ring #",null,"6th",0.08,0.06,0.06]
["","","",null,{"$f":"IF(D13=\"\",\"\",(VLOOKUP(D13,'Membership #'!$A$1:$C$1005,2,0)))","v":""},{"$f":"IF(D13=\"\",\"\",(VLOOKUP(D13,'Membership #'!$A$1:$C$1005,3,0)))","v":""},null,null,{"$f":"IF(G13=\"n\",\"No Time\",IF(G13=\"x\",\"Scratch\",IF(G13<>\"\",SUM(G13+H13),\"\")))","v":""},null,null,null,"1st",0.6,{"$f":"IF(N13<>0,N$11*N13,\"\")","v":25.2},null,{"$f":"IF(P13=\"\",\"\",(VLOOKUP(P13,'Membership #'!$A$1:$C$1005,2,0)))","v":""},"7th",null,0.03,0.05]
["","","",null,{"$f":"IF(D14=\"\",\"\",(VLOOKUP(D14,'Membership #'!$A$1:$C$1005,2,0)))","v":""},{"$f":"IF(D14=\"\",\"\",(VLOOKUP(D14,'Membership #'!$A$1:$C$1005,3,0)))","v":""},null,null,"",null,null,null,"2nd",0.4,16.8,null,{"$f":"IF(P14=\"\",\"\",(VLOOKUP(P14,'Membership #'!$A$1:$C$1005,2,0)))","v":""},"8th",null,0.02,0.04]
["","","",null,{"$f":"IF(D15=\"\",\"\",(VLOOKUP(D15,'Membership #'!$A$1:$C$1005,2,0)))","v":""},{"$f":"IF(D15=\"\",\"\",(VLOOKUP(D15,'Membership #'!$A$1:$C$1005,3,0)))","v":""},null,null,{"$f":"IF(G15=\"n\",\"No Time\",IF(G15=\"x\",\"Scratch\",IF(G15<>\"\",SUM(G15+H15),\"\")))","v":""},null,null,null,"3rd",null,"",null,{"$f":"IF(P15=\"\",\"\",(VLOOKUP(P15,'Membership #'!$A$1:$C$1005,2,0)))","v":""},"9th",null,null,0.03]
["","","",null,{"$f":"IF(D16=\"\",\"\",(VLOOKUP(D16,'Membership #'!$A$1:$C$1005,2,0)))","v":""},{"$f":"IF(D16=\"\",\"\",(VLOOKUP(D16,'Membership #'!$A$1:$C$1005,3,0)))","v":""},null,null,{"$f":"IF(G16=\"n\",\"No Time\",IF(G16=\"x\",\"Scratch\",IF(G16<>\"\",SUM(G16+H16),\"\")))","v":""},null,null,null,"4th",null,"",null,{"$f":"IF(P16=\"\",\"\",(VLOOKUP(P16,'Membership #'!$A$1:$C$1005,2,0)))","v":""},"10th",null,null,0.02]
["","","",null,{"$f":"IF(D17=\"\",\"\",(VLOOKUP(D17,'Membership #'!$A$1:$C$1005,2,0)))","v":""},{"$f":"IF(D17=\"\",\"\",(VLOOKUP(D17,'Membership #'!$A$1:$C$1005,3,0)))","v":""},null,null,{"$f":"IF(G17=\"n\",\"No Time\",IF(G17=\"x\",\"Scratch\",IF(G17<>\"\",SUM(G17+H17),\"\")))","v":""},null,null,null,"5th",null,"",null,{"$f":"IF(P17=\"\",\"\",(VLOOKUP(P17,'Membership #'!$A$1:$C$1005,2,0)))","v":""}]
["","","",null,{"$f":"IF(D18=\"\",\"\",(VLOOKUP(D18,'Membership #'!$A$1:$C$1005,2,0)))","v":""},{"$f":"IF(D18=\"\",\"\",(VLOOKUP(D18,'Membership #'!$A$1:$C$1005,3,0)))","v":""},null,null,{"$f":"IF(G18=\"n\",\"No Time\",IF(G18=\"x\",\"Scratch\",IF(G18<>\"\",SUM(G18+H18),\"\")))","v":""},null,null,null,"6th",null,"",null,{"$f":"IF(P18=\"\",\"\",(VLOOKUP(P18,'Membership #'!$A$1:$C$1005,2,0)))","v":""}]
["","","",null,{"$f":"IF(D19=\"\",\"\",(VLOOKUP(D19,'Membership #'!$A$1:$C$1005,2,0)))","v":""},{"$f":"IF(D19=\"\",\"\",(VLOOKUP(D19,'Membership #'!$A$1:$C$1005,3,0)))","v":""},null,null,"",null,null,null,"7th",null,"",null,{"$f":"IF(P19=\"\",0,(VLOOKUP(P19,'Membership #'!$A$1:$C$1005,2,0)))","v":0}]
["","","",null,{"$f":"IF(D20=\"\",\"\",(VLOOKUP(D20,'Membership #'!$A$1:$C$1005,2,0)))","v":""},{"$f":"IF(D20=\"\",\"\",(VLOOKUP(D20,'Membership #'!$A$1:$C$1005,3,0)))","v":""},null,null,"",null,null,null,"8th",null,"",null,{"$f":"IF(P20=\"\",0,(VLOOKUP(P20,'Membership #'!$A$1:$C$1005,2,0)))","v":0}]
["","","",null,{"$f":"IF(D21=\"\",\"\",(VLOOKUP(D21,'Membership #'!$A$1:$C$1005,2,0)))","v":""},{"$f":"IF(D21=\"\",\"\",(VLOOKUP(D21,'Membership #'!$A$1:$C$1005,3,0)))","v":""},null,null,"",null,null,null,"9th",null,""]
["","","",null,{"$f":"IF(D22=\"\",\"\",(VLOOKUP(D22,'Membership #'!$A$1:$C$1005,2,0)))","v":""},{"$f":"IF(D22=\"\",\"\",(VLOOKUP(D22,'Membership #'!$A$1:$C$1005,3,0)))","v":""},null,null,"",null,null,null,"10th",{"$f":"HLOOKUP($R$4,$S$4:$Z$17,13,0)","v":0},""]
["","","",null,{"$f":"IF(D23=\"\",\"\",(VLOOKUP(D23,'Membership #'!$A$1:$C$1005,2,0)))","v":""},{"$f":"IF(D23=\"\",\"\",(VLOOKUP(D23,'Membership #'!$A$1:$C$1005,3,0)))","v":""},null,null,"",null,null,null,"Total Money",null,{"$f":"SUM(O13:O22)","v":42}]
["","","",null,{"$f":"IF(D24=\"\",\"\",(VLOOKUP(D24,'Membership #'!$A$1:$C$1005,2,0)))","v":""},{"$f":"IF(D24=\"\",\"\",(VLOOKUP(D24,'Membership #'!$A$1:$C$1005,3,0)))","v":""},null,null,""]
["","","",null,{"$f":"IF(D25=\"\",\"\",(VLOOKUP(D25,'Membership #'!$A$1:$C$1005,2,0)))","v":""},{"$f":"IF(D25=\"\",\"\",(VLOOKUP(D25,'Membership #'!$A$1:$C$1005,3,0)))","v":""},null,null,""]
["","","",null,{"$f":"IF(D26=\"\",\"\",(VLOOKUP(D26,'Membership #'!$A$1:$C$1005,2,0)))","v":""},{"$f":"IF(D26=\"\",\"\",(VLOOKUP(D26,'Membership #'!$A$1:$C$1005,3,0)))","v":""},null,null,"",null,null,null,null,"Terry Cole"]
["","","",null,{"$f":"IF(D27=\"\",\"\",(VLOOKUP(D27,'Membership #'!$A$1:$C$1005,2,0)))","v":""},{"$f":"IF(D27=\"\",\"\",(VLOOKUP(D27,'Membership #'!$A$1:$C$1005,3,0)))","v":""},null,null,""]
["","","",null,{"$f":"IF(D28=\"\",\"\",(VLOOKUP(D28,'Membership #'!$A$1:$C$1005,2,0)))","v":""},{"$f":"IF(D28=\"\",\"\",(VLOOKUP(D28,'Membership #'!$A$1:$C$1005,3,0)))","v":""},null,null,""]
["","","",null,{"$f":"IF(D29=\"\",\"\",(VLOOKUP(D29,'Membership #'!$A$1:$C$1005,2,0)))","v":""},{"$f":"IF(D29=\"\",\"\",(VLOOKUP(D29,'Membership #'!$A$1:$C$1005,3,0)))","v":""},null,null,""]
["","","",null,{"$f":"IF(D30=\"\",\"\",(VLOOKUP(D30,'Membership #'!$A$1:$C$1005,2,0)))","v":""},{"$f":"IF(D30=\"\",\"\",(VLOOKUP(D30,'Membership #'!$A$1:$C$1005,3,0)))","v":""},null,null,""]
["","","",null,{"$f":"IF(D31=\"\",\"\",(VLOOKUP(D31,'Membership #'!$A$1:$C$1005,2,0)))","v":""},{"$f":"IF(D31=\"\",\"\",(VLOOKUP(D31,'Membership #'!$A$1:$C$1005,3,0)))","v":""},null,null,""]
["","","",null,{"$f":"IF(D32=\"\",\"\",(VLOOKUP(D32,'Membership #'!$A$1:$C$1005,2,0)))","v":""},{"$f":"IF(D32=\"\",\"\",(VLOOKUP(D32,'Membership #'!$A$1:$C$1005,3,0)))","v":""},null,null,""]
["","","",null,{"$f":"IF(D33=\"\",\"\",(VLOOKUP(D33,'Membership #'!$A$1:$C$1005,2,0)))","v":""},{"$f":"IF(D33=\"\",\"\",(VLOOKUP(D33,'Membership #'!$A$1:$C$1005,3,0)))","v":""},null,null,""]
["","","",null,{"$f":"IF(D34=\"\",\"\",(VLOOKUP(D34,'Membership #'!$A$1:$C$1005,2,0)))","v":""},{"$f":"IF(D34=\"\",\"\",(VLOOKUP(D34,'Membership #'!$A$1:$C$1005,3,0)))","v":""},null,null,""]
["","","",null,{"$f":"IF(D35=\"\",\"\",(VLOOKUP(D35,'Membership #'!$A$1:$C$1005,2,0)))","v":""},{"$f":"IF(D35=\"\",\"\",(VLOOKUP(D35,'Membership #'!$A$1:$C$1005,3,0)))","v":""},null,null,""]
["","","",null,{"$f":"IF(D36=\"\",\"\",(VLOOKUP(D36,'Membership #'!$A$1:$C$1005,2,0)))","v":""},{"$f":"IF(D36=\"\",\"\",(VLOOKUP(D36,'Membership #'!$A$1:$C$1005,3,0)))","v":""},null,null,""]
["","","",null,{"$f":"IF(D37=\"\",\"\",(VLOOKUP(D37,'Membership #'!$A$1:$C$1005,2,0)))","v":""},{"$f":"IF(D37=\"\",\"\",(VLOOKUP(D37,'Membership #'!$A$1:$C$1005,3,0)))","v":""},null,null,""]
["","","",null,{"$f":"IF(D38=\"\",\"\",(VLOOKUP(D38,'Membership #'!$A$1:$C$1005,2,0)))","v":""},{"$f":"IF(D38=\"\",\"\",(VLOOKUP(D38,'Membership #'!$A$1:$C$1005,3,0)))","v":""},null,null,""]
["","","",null,{"$f":"IF(D39=\"\",\"\",(VLOOKUP(D39,'Membership #'!$A$1:$C$1005,2,0)))","v":""},{"$f":"IF(D39=\"\",\"\",(VLOOKUP(D39,'Membership #'!$A$1:$C$1005,3,0)))","v":""},null,null,""]
["","","",null,{"$f":"IF(D40=\"\",\"\",(VLOOKUP(D40,'Membership #'!$A$1:$C$1005,2,0)))","v":""},{"$f":"IF(D40=\"\",\"\",(VLOOKUP(D40,'Membership #'!$A$1:$C$1005,3,0)))","v":""},null,null,""]
["","","",null,{"$f":"IF(D41=\"\",\"\",(VLOOKUP(D41,'Membership #'!$A$1:$C$1005,2,0)))","v":""},{"$f":"IF(D41=\"\",\"\",(VLOOKUP(D41,'Membership #'!$A$1:$C$1005,3,0)))","v":""},null,null,""]
["","","",null,{"$f":"IF(D42=\"\",\"\",(VLOOKUP(D42,'Membership #'!$A$1:$C$1005,2,0)))","v":""},{"$f":"IF(D42=\"\",\"\",(VLOOKUP(D42,'Membership #'!$A$1:$C$1005,3,0)))","v":""},null,null,""]
["","","",null,{"$f":"IF(D43=\"\",\"\",(VLOOKUP(D43,'Membership #'!$A$1:$C$1005,2,0)))","v":""},{"$f":"IF(D43=\"\",\"\",(VLOOKUP(D43,'Membership #'!$A$1:$C$1005,3,0)))","v":""},null,null,""]
["","","",null,{"$f":"IF(D44=\"\",\"\",(VLOOKUP(D44,'Membership #'!$A$1:$C$1005,2,0)))","v":""},{"$f":"IF(D44=\"\",\"\",(VLOOKUP(D44,'Membership #'!$A$1:$C$1005,3,0)))","v":""},null,null,""]
["","","",null,{"$f":"IF(D45=\"\",\"\",(VLOOKUP(D45,'Membership #'!$A$1:$C$1005,2,0)))","v":""},{"$f":"IF(D45=\"\",\"\",(VLOOKUP(D45,'Membership #'!$A$1:$C$1005,3,0)))","v":""},null,null,""]
["","","",null,{"$f":"IF(D46=\"\",\"\",(VLOOKUP(D46,'Membership #'!$A$1:$C$1005,2,0)))","v":""},{"$f":"IF(D46=\"\",\"\",(VLOOKUP(D46,'Membership #'!$A$1:$C$1005,3,0)))","v":""},null,null,""]
["","","",null,{"$f":"IF(D47=\"\",\"\",(VLOOKUP(D47,'Membership #'!$A$1:$C$1005,2,0)))","v":""},{"$f":"IF(D47=\"\",\"\",(VLOOKUP(D47,'Membership #'!$A$1:$C$1005,3,0)))","v":""},null,null,""]
["","","",null,{"$f":"IF(D48=\"\",\"\",(VLOOKUP(D48,'Membership #'!$A$1:$C$1005,2,0)))","v":""},{"$f":"IF(D48=\"\",\"\",(VLOOKUP(D48,'Membership #'!$A$1:$C$1005,3,0)))","v":""},null,null,""]
["","","",null,{"$f":"IF(D49=\"\",\"\",(VLOOKUP(D49,'Membership #'!$A$1:$C$1005,2,0)))","v":""},{"$f":"IF(D49=\"\",\"\",(VLOOKUP(D49,'Membership #'!$A$1:$C$1005,3,0)))","v":""},null,null,""]
["","","",null,{"$f":"IF(D50=\"\",\"\",(VLOOKUP(D50,'Membership #'!$A$1:$C$1005,2,0)))","v":""},{"$f":"IF(D50=\"\",\"\",(VLOOKUP(D50,'Membership #'!$A$1:$C$1005,3,0)))","v":""},null,null,""]
["","","",null,{"$f":"IF(D51=\"\",\"\",(VLOOKUP(D51,'Membership #'!$A$1:$C$1005,2,0)))","v":""},{"$f":"IF(D51=\"\",\"\",(VLOOKUP(D51,'Membership #'!$A$1:$C$1005,3,0)))","v":""},null,null,""]
["","","",null,{"$f":"IF(D52=\"\",\"\",(VLOOKUP(D52,'Membership #'!$A$1:$C$1005,2,0)))","v":""},{"$f":"IF(D52=\"\",\"\",(VLOOKUP(D52,'Membership #'!$A$1:$C$1005,3,0)))","v":""},null,null,""]
["","","",null,{"$f":"IF(D53=\"\",\"\",(VLOOKUP(D53,'Membership #'!$A$1:$C$1005,2,0)))","v":""},{"$f":"IF(D53=\"\",\"\",(VLOOKUP(D53,'Membership #'!$A$1:$C$1005,3,0)))","v":""},null,null,""]
["","","",null,{"$f":"IF(D54=\"\",\"\",(VLOOKUP(D54,'Membership #'!$A$1:$C$1005,2,0)))","v":""},{"$f":"IF(D54=\"\",\"\",(VLOOKUP(D54,'Membership #'!$A$1:$C$1005,3,0)))","v":""},null,null,""]
["","","",null,{"$f":"IF(D55=\"\",\"\",(VLOOKUP(D55,'Membership #'!$A$1:$C$1005,2,0)))","v":""},{"$f":"IF(D55=\"\",\"\",(VLOOKUP(D55,'Membership #'!$A$1:$C$1005,3,0)))","v":""},null,null,""]
["","","",null,{"$f":"IF(D56=\"\",\"\",(VLOOKUP(D56,'Membership #'!$A$1:$C$1005,2,0)))","v":""},{"$f":"IF(D56=\"\",\"\",(VLOOKUP(D56,'Membership #'!$A$1:$C$1005,3,0)))","v":""},null,null,""]
["","","",null,{"$f":"IF(D57=\"\",\"\",(VLOOKUP(D57,'Membership #'!$A$1:$C$1005,2,0)))","v":""},{"$f":"IF(D57=\"\",\"\",(VLOOKUP(D57,'Membership #'!$A$1:$C$1005,3,0)))","v":""},null,null,""]
["","","",null,{"$f":"IF(D58=\"\",\"\",(VLOOKUP(D58,'Membership #'!$A$1:$C$1005,2,0)))","v":""},{"$f":"IF(D58=\"\",\"\",(VLOOKUP(D58,'Membership #'!$A$1:$C$1005,3,0)))","v":""},null,null,""]
["","","",null,{"$f":"IF(D59=\"\",\"\",(VLOOKUP(D59,'Membership #'!$A$1:$C$1005,2,0)))","v":""},{"$f":"IF(D59=\"\",\"\",(VLOOKUP(D59,'Membership #'!$A$1:$C$1005,3,0)))","v":""},null,null,""]
["","","",null,{"$f":"IF(D60=\"\",\"\",(VLOOKUP(D60,'Membership #'!$A$1:$C$1005,2,0)))","v":""},{"$f":"IF(D60=\"\",\"\",(VLOOKUP(D60,'Membership #'!$A$1:$C$1005,3,0)))","v":""},null,null,""]
["","","",null,{"$f":"IF(D61=\"\",\"\",(VLOOKUP(D61,'Membership #'!$A$1:$C$1005,2,0)))","v":""},{"$f":"IF(D61=\"\",\"\",(VLOOKUP(D61,'Membership #'!$A$1:$C$1005,3,0)))","v":""},null,null,""]
["","","",null,{"$f":"IF(D62=\"\",\"\",(VLOOKUP(D62,'Membership #'!$A$1:$C$1005,2,0)))","v":""},{"$f":"IF(D62=\"\",\"\",(VLOOKUP(D62,'Membership #'!$A$1:$C$1005,3,0)))","v":""},null,null,""]
["","","",null,{"$f":"IF(D63=\"\",\"\",(VLOOKUP(D63,'Membership #'!$A$1:$C$1005,2,0)))","v":""},{"$f":"IF(D63=\"\",\"\",(VLOOKUP(D63,'Membership #'!$A$1:$C$1005,3,0)))","v":""},null,null,""]
["","","",null,{"$f":"IF(D64=\"\",\"\",(VLOOKUP(D64,'Membership #'!$A$1:$C$1005,2,0)))","v":""},{"$f":"IF(D64=\"\",\"\",(VLOOKUP(D64,'Membership #'!$A$1:$C$1005,3,0)))","v":""},null,null,""]
["","","",null,{"$f":"IF(D65=\"\",\"\",(VLOOKUP(D65,'Membership #'!$A$1:$C$1005,2,0)))","v":""},{"$f":"IF(D65=\"\",\"\",(VLOOKUP(D65,'Membership #'!$A$1:$C$1005,3,0)))","v":""},null,null,""]
["","","",null,{"$f":"IF(D66=\"\",\"\",(VLOOKUP(D66,'Membership #'!$A$1:$C$1005,2,0)))","v":""},{"$f":"IF(D66=\"\",\"\",(VLOOKUP(D66,'Membership #'!$A$1:$C$1005,3,0)))","v":""},null,null,""]
["","","",null,{"$f":"IF(D67=\"\",\"\",(VLOOKUP(D67,'Membership #'!$A$1:$C$1005,2,0)))","v":""},{"$f":"IF(D67=\"\",\"\",(VLOOKUP(D67,'Membership #'!$A$1:$C$1005,3,0)))","v":""},null,null,""]
["","","",null,{"$f":"IF(D68=\"\",\"\",(VLOOKUP(D68,'Membership #'!$A$1:$C$1005,2,0)))","v":""},{"$f":"IF(D68=\"\",\"\",(VLOOKUP(D68,'Membership #'!$A$1:$C$1005,3,0)))","v":""},null,null,""]
["","","",null,{"$f":"IF(D69=\"\",\"\",(VLOOKUP(D69,'Membership #'!$A$1:$C$1005,2,0)))","v":""},{"$f":"IF(D69=\"\",\"\",(VLOOKUP(D69,'Membership #'!$A$1:$C$1005,3,0)))","v":""},null,null,""]
["","","",null,{"$f":"IF(D70=\"\",\"\",(VLOOKUP(D70,'Membership #'!$A$1:$C$1005,2,0)))","v":""},{"$f":"IF(D70=\"\",\"\",(VLOOKUP(D70,'Membership #'!$A$1:$C$1005,3,0)))","v":""},null,null,""]
["","","",null,{"$f":"IF(D71=\"\",\"\",(VLOOKUP(D71,'Membership #'!$A$1:$C$1005,2,0)))","v":""},{"$f":"IF(D71=\"\",\"\",(VLOOKUP(D71,'Membership #'!$A$1:$C$1005,3,0)))","v":""},null,null,""]
[{"$f":"IF(D72<>\"\",RAND(),\"\")","v":""},{"$f":"IF(D72<>\"\",RANK(A72,A$8:A$101),\"\")","v":""},"",null,{"$f":"IF(D72=\"\",\"\",(VLOOKUP(D72,'Membership #'!$A$1:$C$1005,2,0)))","v":""},{"$f":"IF(D72=\"\",\"\",(VLOOKUP(D72,'Membership #'!$A$1:$C$1005,3,0)))","v":""},null,null,""]
["","","",null,{"$f":"IF(D73=\"\",\"\",(VLOOKUP(D73,'Membership #'!$A$1:$C$1005,2,0)))","v":""},{"$f":"IF(D73=\"\",\"\",(VLOOKUP(D73,'Membership #'!$A$1:$C$1005,3,0)))","v":""},null,null,{"$f":"IF(G73=\"n\",\"No Time\",IF(G73=\"x\",\"Scratch\",IF(G73<>\"\",SUM(G73+H73),\"\")))","v":""}]
["","","",null,{"$f":"IF(D74=\"\",\"\",(VLOOKUP(D74,'Membership #'!$A$1:$C$1005,2,0)))","v":""},{"$f":"IF(D74=\"\",\"\",(VLOOKUP(D74,'Membership #'!$A$1:$C$1005,3,0)))","v":""},null,null,""]
["","","",null,{"$f":"IF(D75=\"\",\"\",(VLOOKUP(D75,'Membership #'!$A$1:$C$1005,2,0)))","v":""},{"$f":"IF(D75=\"\",\"\",(VLOOKUP(D75,'Membership #'!$A$1:$C$1005,3,0)))","v":""},null,null,""]
["","","",null,{"$f":"IF(D76=\"\",\"\",(VLOOKUP(D76,'Membership #'!$A$1:$C$1005,2,0)))","v":""},{"$f":"IF(D76=\"\",\"\",(VLOOKUP(D76,'Membership #'!$A$1:$C$1005,3,0)))","v":""},null,null,""]
["","","",null,{"$f":"IF(D77=\"\",\"\",(VLOOKUP(D77,'Membership #'!$A$1:$C$1005,2,0)))","v":""},{"$f":"IF(D77=\"\",\"\",(VLOOKUP(D77,'Membership #'!$A$1:$C$1005,3,0)))","v":""},null,null,""]
["","","",null,{"$f":"IF(D78=\"\",\"\",(VLOOKUP(D78,'Membership #'!$A$1:$C$1005,2,0)))","v":""},{"$f":"IF(D78=\"\",\"\",(VLOOKUP(D78,'Membership #'!$A$1:$C$1005,3,0)))","v":""},null,null,""]
["","","",null,{"$f":"IF(D79=\"\",\"\",(VLOOKUP(D79,'Membership #'!$A$1:$C$1005,2,0)))","v":""},{"$f":"IF(D79=\"\",\"\",(VLOOKUP(D79,'Membership #'!$A$1:$C$1005,3,0)))","v":""},null,null,""]
["","","",null,{"$f":"IF(D80=\"\",\"\",(VLOOKUP(D80,'Membership #'!$A$1:$C$1005,2,0)))","v":""},{"$f":"IF(D80=\"\",\"\",(VLOOKUP(D80,'Membership #'!$A$1:$C$1005,3,0)))","v":""},null,null,""]
["","","",null,{"$f":"IF(D81=\"\",\"\",(VLOOKUP(D81,'Membership #'!$A$1:$C$1005,2,0)))","v":""},{"$f":"IF(D81=\"\",\"\",(VLOOKUP(D81,'Membership #'!$A$1:$C$1005,3,0)))","v":""},null,null,""]
["","","",null,{"$f":"IF(D82=\"\",\"\",(VLOOKUP(D82,'Membership #'!$A$1:$C$1005,2,0)))","v":""},{"$f":"IF(D82=\"\",\"\",(VLOOKUP(D82,'Membership #'!$A$1:$C$1005,3,0)))","v":""},null,null,""]
["","","",null,{"$f":"IF(D83=\"\",\"\",(VLOOKUP(D83,'Membership #'!$A$1:$C$1005,2,0)))","v":""},{"$f":"IF(D83=\"\",\"\",(VLOOKUP(D83,'Membership #'!$A$1:$C$1005,3,0)))","v":""},null,null,""]
["","","",null,{"$f":"IF(D84=\"\",\"\",(VLOOKUP(D84,'Membership #'!$A$1:$C$1005,2,0)))","v":""},{"$f":"IF(D84=\"\",\"\",(VLOOKUP(D84,'Membership #'!$A$1:$C$1005,3,0)))","v":""},null,null,""]
["","","",null,{"$f":"IF(D85=\"\",\"\",(VLOOKUP(D85,'Membership #'!$A$1:$C$1005,2,0)))","v":""},{"$f":"IF(D85=\"\",\"\",(VLOOKUP(D85,'Membership #'!$A$1:$C$1005,3,0)))","v":""},null,null,""]
["","","",null,{"$f":"IF(D86=\"\",\"\",(VLOOKUP(D86,'Membership #'!$A$1:$C$1005,2,0)))","v":""},{"$f":"IF(D86=\"\",\"\",(VLOOKUP(D86,'Membership #'!$A$1:$C$1005,3,0)))","v":""},null,null,""]
["","","",null,{"$f":"IF(D87=\"\",\"\",(VLOOKUP(D87,'Membership #'!$A$1:$C$1005,2,0)))","v":""},{"$f":"IF(D87=\"\",\"\",(VLOOKUP(D87,'Membership #'!$A$1:$C$1005,3,0)))","v":""},null,null,""]
["","","",null,{"$f":"IF(D88=\"\",\"\",(VLOOKUP(D88,'Membership #'!$A$1:$C$1005,2,0)))","v":""},{"$f":"IF(D88=\"\",\"\",(VLOOKUP(D88,'Membership #'!$A$1:$C$1005,3,0)))","v":""},null,null,""]
["","","",null,{"$f":"IF(D89=\"\",\"\",(VLOOKUP(D89,'Membership #'!$A$1:$C$1005,2,0)))","v":""},{"$f":"IF(D89=\"\",\"\",(VLOOKUP(D89,'Membership #'!$A$1:$C$1005,3,0)))","v":""},null,null,""]
["","","",null,{"$f":"IF(D90=\"\",\"\",(VLOOKUP(D90,'Membership #'!$A$1:$C$1005,2,0)))","v":""},{"$f":"IF(D90=\"\",\"\",(VLOOKUP(D90,'Membership #'!$A$1:$C$1005,3,0)))","v":""},null,null,""]
["","","",null,{"$f":"IF(D91=\"\",\"\",(VLOOKUP(D91,'Membership #'!$A$1:$C$1005,2,0)))","v":""},{"$f":"IF(D91=\"\",\"\",(VLOOKUP(D91,'Membership #'!$A$1:$C$1005,3,0)))","v":""},null,null,""]
["","","",null,{"$f":"IF(D92=\"\",\"\",(VLOOKUP(D92,'Membership #'!$A$1:$C$1005,2,0)))","v":""},{"$f":"IF(D92=\"\",\"\",(VLOOKUP(D92,'Membership #'!$A$1:$C$1005,3,0)))","v":""},null,null,""]
["","","",null,{"$f":"IF(D93=\"\",\"\",(VLOOKUP(D93,'Membership #'!$A$1:$C$1005,2,0)))","v":""},{"$f":"IF(D93=\"\",\"\",(VLOOKUP(D93,'Membership #'!$A$1:$C$1005,3,0)))","v":""},null,null,""]
["","","",null,{"$f":"IF(D94=\"\",\"\",(VLOOKUP(D94,'Membership #'!$A$1:$C$1005,2,0)))","v":""},{"$f":"IF(D94=\"\",\"\",(VLOOKUP(D94,'Membership #'!$A$1:$C$1005,3,0)))","v":""},null,null,""]
["","","",null,{"$f":"IF(D95=\"\",\"\",(VLOOKUP(D95,'Membership #'!$A$1:$C$1005,2,0)))","v":""},{"$f":"IF(D95=\"\",\"\",(VLOOKUP(D95,'Membership #'!$A$1:$C$1005,3,0)))","v":""},null,null,""]
["","","",null,{"$f":"IF(D96=\"\",\"\",(VLOOKUP(D96,'Membership #'!$A$1:$C$1005,2,0)))","v":""},{"$f":"IF(D96=\"\",\"\",(VLOOKUP(D96,'Membership #'!$A$1:$C$1005,3,0)))","v":""},null,null,""]
["","","",null,{"$f":"IF(D97=\"\",\"\",(VLOOKUP(D97,'Membership #'!$A$1:$C$1005,2,0)))","v":""},{"$f":"IF(D97=\"\",\"\",(VLOOKUP(D97,'Membership #'!$A$1:$C$1005,3,0)))","v":""},null,null,""]
["","","",null,{"$f":"IF(D98=\"\",\"\",(VLOOKUP(D98,'Membership #'!$A$1:$C$1005,2,0)))","v":""},{"$f":"IF(D98=\"\",\"\",(VLOOKUP(D98,'Membership #'!$A$1:$C$1005,3,0)))","v":""},null,null,""]
["","","",null,{"$f":"IF(D99=\"\",\"\",(VLOOKUP(D99,'Membership #'!$A$1:$C$1005,2,0)))","v":""},{"$f":"IF(D99=\"\",\"\",(VLOOKUP(D99,'Membership #'!$A$1:$C$1005,3,0)))","v":""},null,null,""]
["","","",null,{"$f":"IF(D100=\"\",\"\",(VLOOKUP(D100,'Membership #'!$A$1:$C$1005,2,0)))","v":""},{"$f":"IF(D100=\"\",\"\",(VLOOKUP(D100,'Membership #'!$A$1:$C$1005,3,0)))","v":""},null,null,""]
["","","",null,{"$f":"IF(D101=\"\",\"\",(VLOOKUP(D101,'Membership #'!$A$1:$C$1005,2,0)))","v":""},{"$f":"IF(D101=\"\",\"\",(VLOOKUP(D101,'Membership #'!$A$1:$C$1005,3,0)))","v":""},null,null,""]

{"sheet":"ADULT GREEN POLES","index":9,"n_rows":101,"n_cols":26,"rows_kept":101,"cut":false,"hidden":false,"merged":[[5,12,5,15],[0,0,0,10],[1,0,1,10],[2,0,2,3],[2,6,2,10],[3,0,6,0],[3,1,6,1],[3,2,6,2],[3,3,6,3],[3,4,6,4],[3,9,6,9],[3,10,6,10],[3,5,6,5],[3,6,6,6],[3,7,6,7],[3,8,6,8]]}
["Tom Burt & Mark McGuire Memorial Jackpot Aug 22, 2021",null,null,null,null,null,null,null,null,null,null,null,"x=Scratch"]
["ADULT GREEN POLES",null,null,null,null,null,null,null,null,null,null,null,"n=No Time"]
["# Enteries:",null,null,null,{"$f":"COUNTIF($D$8:$D$100,\">0\")","v":1},null,null,null,null,null,null,null,null,null,null,null,null,"Don't Erase these numbers below!!"]
["Rand Draw","Seed","Running Order","RING #      ","NAME","HORSE NAME","TIME","PENALTY ","TOTAL","PLACINGS","POINTS",null,null,null,null,null,null,{"$f":"IF(N9=2,7,IF(N9=3,6,IF(N9=4,5,IF(N9=5,4,IF(AND(N9>5,N11>600),3,IF(AND(N9>5,N11<600,N11>299.99),2,IF(AND(N9>5,N11<300),1,8)))))))","v":7},1,2,3,4,5,6,7,8]
[null,null,null,null,null,null,null,null,null,null,null,null,null,null,null,null,null,null,299,"$300-","$600 -"]
[null,null,null,null,null,null,null,null,null,null,null,null,"ADULT GREEN POLES",null,null,null,null,null,"or less",599,"More","5 Entries","4 Entries","3 Entries","2 Entries"]
[null,null,null,null,null,null,null,null,null,null,null,null,null,null,null,null,null,"1st",0.32,0.27,0.24,0.35,0.4,0.46,0.6]
[{"$f":"IF(D8<>\"\",RAND(),\"\")","v":0.33950583491683461},{"$f":"IF(D8<>\"\",RANK(A8,A$8:A$101),\"\")","v":2},1,"909b",{"$f":"IF(D8=\"\",\"\",(VLOOKUP(D8,'Membership #'!$A$1:$C$1005,2,0)))","v":"Bryden MacNeil"},{"$f":"IF(D8=\"\",\"\",(VLOOKUP(D8,'Membership #'!$A$1:$C$1005,3,0)))","v":"Martha's Tivio Moon"},"x",null,{"$f":"IF(G8=\"n\",\"No Time\",IF(G8=\"x\",\"Scratch\",IF(G8<>\"\",SUM(G8+H8),\"\")))","v":"Scratch"},null,null,null,"Added",25,null,null,null,"2nd",0.23,0.22,0.19,0.25,0.28000000000000003,0.34,0.4]
[0.54999623900694616,1,2,969,{"$f":"IF(D9=\"\",\"\",(VLOOKUP(D9,'Membership #'!$A$1:$C$1005,2,0)))","v":"Kenzie Cook"},{"$f":"IF(D9=\"\",\"\",(VLOOKUP(D9,'Membership #'!$A$1:$C$1005,3,0)))","v":"Pocos Lady Emerald"},"x",null,{"$f":"IF(G9=\"n\",\"No Time\",IF(G9=\"x\",\"Scratch\",IF(G9<>\"\",SUM(G9+H9),\"\")))","v":"Scratch"},null,null,null,"Entries",2,null,10,"per head","3rd",0.15,0.18,0.16,0.17,0.18,0.2]
["","","",null,{"$f":"IF(D10=\"\",\"\",(VLOOKUP(D10,'Membership #'!$A$1:$C$1005,2,0)))","v":""},{"$f":"IF(D10=\"\",\"\",(VLOOKUP(D10,'Membership #'!$A$1:$C$1005,3,0)))","v":""},null,null,{"$f":"IF(G10=\"n\",\"No Time\",IF(G10=\"x\",\"Scratch\",IF(G10<>\"\",SUM(G10+H10),\"\")))","v":""},null,null,null,"Jackpot",{"$f":"P9*N9","v":20},null,0.85,"payback","4th",0.12,0.13,0.13,0.13,0.14000000000000001]
["","","",null,{"$f":"IF(D11=\"\",\"\",(VLOOKUP(D11,'Membership #'!$A$1:$C$1005,2,0)))","v":""},{"$f":"IF(D11=\"\",\"\",(VLOOKUP(D11,'Membership #'!$A$1:$C$1005,3,0)))","v":""},null,null,{"$f":"IF(G11=\"n\",\"No Time\",IF(G11=\"x\",\"Scratch\",IF(G11<>\"\",SUM(G11+H11),\"\")))","v":""},null,null,null,"Total Money",{"$f":"N8+(N10*P10)","v":42},null,{"$f":"N10*P10","v":17},"Jackpot","5th",0.1,0.09,0.08,0.1]
["","","",null,{"$f":"IF(D12=\"\",\"\",(VLOOKUP(D12,'Membership #'!$A$1:$C$1005,2,0)))","v":""},{"$f":"IF(D12=\"\",\"\",(VLOOKUP(D12,'Membership #'!$A$1:$C$1005,3,0)))","v":""},null,null,"",null,null,null,null,"Percentage","Money","Ring #",null,"6th",0.08,0.06,0.06]
["","","",null,{"$f":"IF(D13=\"\",\"\",(VLOOKUP(D13,'Membership #'!$A$1:$C$1005,2,0)))","v":""},{"$f":"IF(D13=\"\",\"\",(VLOOKUP(D13,'Membership #'!$A$1:$C$1005,3,0)))","v":""},null,null,"",null,null,null,"1st",0.6,{"$f":"IF(N13<>0,N$11*N13,\"\")","v":25.2},null,{"$f":"IF(P13=\"\",\"\",(VLOOKUP(P13,'Membership #'!$A$1:$C$1005,2,0)))","v":""},"7th",null,0.03,0.05]
["","","",null,{"$f":"IF(D14=\"\",\"\",(VLOOKUP(D14,'Membership #'!$A$1:$C$1005,2,0)))","v":""},{"$f":"IF(D14=\"\",\"\",(VLOOKUP(D14,'Membership #'!$A$1:$C$1005,3,0)))","v":""},null,null,{"$f":"IF(G14=\"n\",\"No Time\",IF(G14=\"x\",\"Scratch\",IF(G14<>\"\",SUM(G14+H14),\"\")))","v":""},null,null,null,"2nd",0.4,16.8,null,{"$f":"IF(P14=\"\",\"\",(VLOOKUP(P14,'Membership #'!$A$1:$C$1005,2,0)))","v":""},"8th",null,0.02,0.04]
["","","",null,{"$f":"IF(D15=\"\",\"\",(VLOOKUP(D15,'Membership #'!$A$1:$C$1005,2,0)))","v":""},{"$f":"IF(D15=\"\",\"\",(VLOOKUP(D15,'Membership #'!$A$1:$C$1005,3,0)))","v":""},null,null,{"$f":"IF(G15=\"n\",\"No Time\",IF(G15=\"x\",\"Scratch\",IF(G15<>\"\",SUM(G15+H15),\"\")))","v":""},null,null,null,"3rd",null,"",null,{"$f":"IF(P15=\"\",\"\",(VLOOKUP(P15,'Membership #'!$A$1:$C$1005,2,0)))","v":""},"9th",null,null,0.03]
["","","",null,{"$f":"IF(D16=\"\",\"\",(VLOOKUP(D16,'Membership #'!$A$1:$C$1005,2,0)))","v":""},{"$f":"IF(D16=\"\",\"\",(VLOOKUP(D16,'Membership #'!$A$1:$C$1005,3,0)))","v":""},null,null,"",null,null,null,"4th",null,"",null,{"$f":"IF(P16=\"\",\"\",(VLOOKUP(P16,'Membership #'!$A$1:$C$1005,2,0)))","v":""},"10th",null,null,0.02]
["","","",null,{"$f":"IF(D17=\"\",\"\",(VLOOKUP(D17,'Membership #'!$A$1:$C$1005,2,0)))","v":""},{"$f":"IF(D17=\"\",\"\",(VLOOKUP(D17,'Membership #'!$A$1:$C$1005,3,0)))","v":""},null,null,"",null,null,null,"5th",null,"",null,{"$f":"IF(P17=\"\",\"\",(VLOOKUP(P17,'Membership #'!$A$1:$C$1005,2,0)))","v":""}]
["","","",null,{"$f":"IF(D18=\"\",\"\",(VLOOKUP(D18,'Membership #'!$A$1:$C$1005,2,0)))","v":""},{"$f":"IF(D18=\"\",\"\",(VLOOKUP(D18,'Membership #'!$A$1:$C$1005,3,0)))","v":""},null,null,"",null,null,null,"6th",null,"",null,{"$f":"IF(P18=\"\",\"\",(VLOOKUP(P18,'Membership #'!$A$1:$C$1005,2,0)))","v":""}]
["","","",null,{"$f":"IF(D19=\"\",\"\",(VLOOKUP(D19,'Membership #'!$A$1:$C$1005,2,0)))","v":""},{"$f":"IF(D19=\"\",\"\",(VLOOKUP(D19,'Membership #'!$A$1:$C$1005,3,0)))","v":""},null,null,"",null,null,null,"7th",{"$f":"HLOOKUP($R$4,$S$4:$Z$17,10,0)","v":0},"",null,{"$f":"IF(P19=\"\",0,(VLOOKUP(P19,'Membership #'!$A$1:$C$1005,2,0)))","v":0}]
["","","",null,{"$f":"IF(D20=\"\",\"\",(VLOOKUP(D20,'Membership #'!$A$1:$C$1005,2,0)))","v":""},{"$f":"IF(D20=\"\",\"\",(VLOOKUP(D20,'Membership #'!$A$1:$C$1005,3,0)))","v":""},null,null,"",null,null,null,"8th",{"$f":"HLOOKUP($R$4,$S$4:$Z$17,11,0)","v":0},"",null,{"$f":"IF(P20=\"\",0,(VLOOKUP(P20,'Membership #'!$A$1:$C$1005,2,0)))","v":0}]
["","","",null,{"$f":"IF(D21=\"\",\"\",(VLOOKUP(D21,'Membership #'!$A$1:$C$1005,2,0)))","v":""},{"$f":"IF(D21=\"\",\"\",(VLOOKUP(D21,'Membership #'!$A$1:$C$1005,3,0)))","v":""},null,null,"",null,null,null,"9th",{"$f":"HLOOKUP($R$4,$S$4:$Z$17,12,0)","v":0},""]
["","","",null,{"$f":"IF(D22=\"\",\"\",(VLOOKUP(D22,'Membership #'!$A$1:$C$1005,2,0)))","v":""},{"$f":"IF(D22=\"\",\"\",(VLOOKUP(D22,'Membership #'!$A$1:$C$1005,3,0)))","v":""},null,null,"",null,null,null,"10th",{"$f":"HLOOKUP($R$4,$S$4:$Z$17,13,0)","v":0},""]
["","","",null,{"$f":"IF(D23=\"\",\"\",(VLOOKUP(D23,'Membership #'!$A$1:$C$1005,2,0)))","v":""},{"$f":"IF(D23=\"\",\"\",(VLOOKUP(D23,'Membership #'!$A$1:$C$1005,3,0)))","v":""},null,null,"",null,null,null,"Total Money",null,{"$f":"SUM(O13:O22)","v":42}]
["","","",null,{"$f":"IF(D24=\"\",\"\",(VLOOKUP(D24,'Membership #'!$A$1:$C$1005,2,0)))","v":""},{"$f":"IF(D24=\"\",\"\",(VLOOKUP(D24,'Membership #'!$A$1:$C$1005,3,0)))","v":""},null,null,""]
["","","",null,{"$f":"IF(D25=\"\",\"\",(VLOOKUP(D25,'Membership #'!$A$1:$C$1005,2,0)))","v":""},{"$f":"IF(D25=\"\",\"\",(VLOOKUP(D25,'Membership #'!$A$1:$C$1005,3,0)))","v":""},null,null,""]
["","","",null,{"$f":"IF(D26=\"\",\"\",(VLOOKUP(D26,'Membership #'!$A$1:$C$1005,2,0)))","v":""},{"$f":"IF(D26=\"\",\"\",(VLOOKUP(D26,'Membership #'!$A$1:$C$1005,3,0)))","v":""},null,null,""]
["","","",null,{"$f":"IF(D27=\"\",\"\",(VLOOKUP(D27,'Membership #'!$A$1:$C$1005,2,0)))","v":""},{"$f":"IF(D27=\"\",\"\",(VLOOKUP(D27,'Membership #'!$A$1:$C$1005,3,0)))","v":""},null,null,""]
["","","",null,{"$f":"IF(D28=\"\",\"\",(VLOOKUP(D28,'Membership #'!$A$1:$C$1005,2,0)))","v":""},{"$f":"IF(D28=\"\",\"\",(VLOOKUP(D28,'Membership #'!$A$1:$C$1005,3,0)))","v":""},null,null,""]
["","","",null,{"$f":"IF(D29=\"\",\"\",(VLOOKUP(D29,'Membership #'!$A$1:$C$1005,2,0)))","v":""},{"$f":"IF(D29=\"\",\"\",(VLOOKUP(D29,'Membership #'!$A$1:$C$1005,3,0)))","v":""},null,null,""]
["","","",null,{"$f":"IF(D30=\"\",\"\",(VLOOKUP(D30,'Membership #'!$A$1:$C$1005,2,0)))","v":""},{"$f":"IF(D30=\"\",\"\",(VLOOKUP(D30,'Membership #'!$A$1:$C$1005,3,0)))","v":""},null,null,""]
["","","",null,{"$f":"IF(D31=\"\",\"\",(VLOOKUP(D31,'Membership #'!$A$1:$C$1005,2,0)))","v":""},{"$f":"IF(D31=\"\",\"\",(VLOOKUP(D31,'Membership #'!$A$1:$C$1005,3,0)))","v":""},null,null,""]
["","","",null,{"$f":"IF(D32=\"\",\"\",(VLOOKUP(D32,'Membership #'!$A$1:$C$1005,2,0)))","v":""},{"$f":"IF(D32=\"\",\"\",(VLOOKUP(D32,'Membership #'!$A$1:$C$1005,3,0)))","v":""},null,null,""]
["","","",null,{"$f":"IF(D33=\"\",\"\",(VLOOKUP(D33,'Membership #'!$A$1:$C$1005,2,0)))","v":""},{"$f":"IF(D33=\"\",\"\",(VLOOKUP(D33,'Membership #'!$A$1:$C$1005,3,0)))","v":""},null,null,""]
["","","",null,{"$f":"IF(D34=\"\",\"\",(VLOOKUP(D34,'Membership #'!$A$1:$C$1005,2,0)))","v":""},{"$f":"IF(D34=\"\",\"\",(VLOOKUP(D34,'Membership #'!$A$1:$C$1005,3,0)))","v":""},null,null,""]
["","","",null,{"$f":"IF(D35=\"\",\"\",(VLOOKUP(D35,'Membership #'!$A$1:$C$1005,2,0)))","v":""},{"$f":"IF(D35=\"\",\"\",(VLOOKUP(D35,'Membership #'!$A$1:$C$1005,3,0)))","v":""},null,null,""]
["","","",null,{"$f":"IF(D36=\"\",\"\",(VLOOKUP(D36,'Membership #'!$A$1:$C$1005,2,0)))","v":""},{"$f":"IF(D36=\"\",\"\",(VLOOKUP(D36,'Membership #'!$A$1:$C$1005,3,0)))","v":""},null,null,""]
["","","",null,{"$f":"IF(D37=\"\",\"\",(VLOOKUP(D37,'Membership #'!$A$1:$C$1005,2,0)))","v":""},{"$f":"IF(D37=\"\",\"\",(VLOOKUP(D37,'Membership #'!$A$1:$C$1005,3,0)))","v":""},null,null,""]
["","","",null,{"$f":"IF(D38=\"\",\"\",(VLOOKUP(D38,'Membership #'!$A$1:$C$1005,2,0)))","v":""},{"$f":"IF(D38=\"\",\"\",(VLOOKUP(D38,'Membership #'!$A$1:$C$1005,3,0)))","v":""},null,null,""]
["","","",null,{"$f":"IF(D39=\"\",\"\",(VLOOKUP(D39,'Membership #'!$A$1:$C$1005,2,0)))","v":""},{"$f":"IF(D39=\"\",\"\",(VLOOKUP(D39,'Membership #'!$A$1:$C$1005,3,0)))","v":""},null,null,""]
["","","",null,{"$f":"IF(D40=\"\",\"\",(VLOOKUP(D40,'Membership #'!$A$1:$C$1005,2,0)))","v":""},{"$f":"IF(D40=\"\",\"\",(VLOOKUP(D40,'Membership #'!$A$1:$C$1005,3,0)))","v":""},null,null,""]
["","","",null,{"$f":"IF(D41=\"\",\"\",(VLOOKUP(D41,'Membership #'!$A$1:$C$1005,2,0)))","v":""},{"$f":"IF(D41=\"\",\"\",(VLOOKUP(D41,'Membership #'!$A$1:$C$1005,3,0)))","v":""},null,null,""]
["","","",null,{"$f":"IF(D42=\"\",\"\",(VLOOKUP(D42,'Membership #'!$A$1:$C$1005,2,0)))","v":""},{"$f":"IF(D42=\"\",\"\",(VLOOKUP(D42,'Membership #'!$A$1:$C$1005,3,0)))","v":""},null,null,""]
["","","",null,{"$f":"IF(D43=\"\",\"\",(VLOOKUP(D43,'Membership #'!$A$1:$C$1005,2,0)))","v":""},{"$f":"IF(D43=\"\",\"\",(VLOOKUP(D43,'Membership #'!$A$1:$C$1005,3,0)))","v":""},null,null,""]
["","","",null,{"$f":"IF(D44=\"\",\"\",(VLOOKUP(D44,'Membership #'!$A$1:$C$1005,2,0)))","v":""},{"$f":"IF(D44=\"\",\"\",(VLOOKUP(D44,'Membership #'!$A$1:$C$1005,3,0)))","v":""},null,null,""]
["","","",null,{"$f":"IF(D45=\"\",\"\",(VLOOKUP(D45,'Membership #'!$A$1:$C$1005,2,0)))","v":""},{"$f":"IF(D45=\"\",\"\",(VLOOKUP(D45,'Membership #'!$A$1:$C$1005,3,0)))","v":""},null,null,""]
["","","",null,{"$f":"IF(D46=\"\",\"\",(VLOOKUP(D46,'Membership #'!$A$1:$C$1005,2,0)))","v":""},{"$f":"IF(D46=\"\",\"\",(VLOOKUP(D46,'Membership #'!$A$1:$C$1005,3,0)))","v":""},null,null,""]
["","","",null,{"$f":"IF(D47=\"\",\"\",(VLOOKUP(D47,'Membership #'!$A$1:$C$1005,2,0)))","v":""},{"$f":"IF(D47=\"\",\"\",(VLOOKUP(D47,'Membership #'!$A$1:$C$1005,3,0)))","v":""},null,null,""]
["","","",null,{"$f":"IF(D48=\"\",\"\",(VLOOKUP(D48,'Membership #'!$A$1:$C$1005,2,0)))","v":""},{"$f":"IF(D48=\"\",\"\",(VLOOKUP(D48,'Membership #'!$A$1:$C$1005,3,0)))","v":""},null,null,""]
["","","",null,{"$f":"IF(D49=\"\",\"\",(VLOOKUP(D49,'Membership #'!$A$1:$C$1005,2,0)))","v":""},{"$f":"IF(D49=\"\",\"\",(VLOOKUP(D49,'Membership #'!$A$1:$C$1005,3,0)))","v":""},null,null,""]
["","","",null,{"$f":"IF(D50=\"\",\"\",(VLOOKUP(D50,'Membership #'!$A$1:$C$1005,2,0)))","v":""},{"$f":"IF(D50=\"\",\"\",(VLOOKUP(D50,'Membership #'!$A$1:$C$1005,3,0)))","v":""},null,null,""]
["","","",null,{"$f":"IF(D51=\"\",\"\",(VLOOKUP(D51,'Membership #'!$A$1:$C$1005,2,0)))","v":""},{"$f":"IF(D51=\"\",\"\",(VLOOKUP(D51,'Membership #'!$A$1:$C$1005,3,0)))","v":""},null,null,""]
["","","",null,{"$f":"IF(D52=\"\",\"\",(VLOOKUP(D52,'Membership #'!$A$1:$C$1005,2,0)))","v":""},{"$f":"IF(D52=\"\",\"\",(VLOOKUP(D52,'Membership #'!$A$1:$C$1005,3,0)))","v":""},null,null,""]
["","","",null,{"$f":"IF(D53=\"\",\"\",(VLOOKUP(D53,'Membership #'!$A$1:$C$1005,2,0)))","v":""},{"$f":"IF(D53=\"\",\"\",(VLOOKUP(D53,'Membership #'!$A$1:$C$1005,3,0)))","v":""},null,null,""]
["","","",null,{"$f":"IF(D54=\"\",\"\",(VLOOKUP(D54,'Membership #'!$A$1:$C$1005,2,0)))","v":""},{"$f":"IF(D54=\"\",\"\",(VLOOKUP(D54,'Membership #'!$A$1:$C$1005,3,0)))","v":""},null,null,""]
["","","",null,{"$f":"IF(D55=\"\",\"\",(VLOOKUP(D55,'Membership #'!$A$1:$C$1005,2,0)))","v":""},{"$f":"IF(D55=\"\",\"\",(VLOOKUP(D55,'Membership #'!$A$1:$C$1005,3,0)))","v":""},null,null,""]
["","","",null,{"$f":"IF(D56=\"\",\"\",(VLOOKUP(D56,'Membership #'!$A$1:$C$1005,2,0)))","v":""},{"$f":"IF(D56=\"\",\"\",(VLOOKUP(D56,'Membership #'!$A$1:$C$1005,3,0)))","v":""},null,null,""]
["","","",null,{"$f":"IF(D57=\"\",\"\",(VLOOKUP(D57,'Membership #'!$A$1:$C$1005,2,0)))","v":""},{"$f":"IF(D57=\"\",\"\",(VLOOKUP(D57,'Membership #'!$A$1:$C$1005,3,0)))","v":""},null,null,""]
["","","",null,{"$f":"IF(D58=\"\",\"\",(VLOOKUP(D58,'Membership #'!$A$1:$C$1005,2,0)))","v":""},{"$f":"IF(D58=\"\",\"\",(VLOOKUP(D58,'Membership #'!$A$1:$C$1005,3,0)))","v":""},null,null,""]
["","","",null,{"$f":"IF(D59=\"\",\"\",(VLOOKUP(D59,'Membership #'!$A$1:$C$1005,2,0)))","v":""},{"$f":"IF(D59=\"\",\"\",(VLOOKUP(D59,'Membership #'!$A$1:$C$1005,3,0)))","v":""},null,null,""]
["","","",null,{"$f":"IF(D60=\"\",\"\",(VLOOKUP(D60,'Membership #'!$A$1:$C$1005,2,0)))","v":""},{"$f":"IF(D60=\"\",\"\",(VLOOKUP(D60,'Membership #'!$A$1:$C$1005,3,0)))","v":""},null,null,""]
["","","",null,{"$f":"IF(D61=\"\",\"\",(VLOOKUP(D61,'Membership #'!$A$1:$C$1005,2,0)))","v":""},{"$f":"IF(D61=\"\",\"\",(VLOOKUP(D61,'Membership #'!$A$1:$C$1005,3,0)))","v":""},null,null,""]
["","","",null,{"$f":"IF(D62=\"\",\"\",(VLOOKUP(D62,'Membership #'!$A$1:$C$1005,2,0)))","v":""},{"$f":"IF(D62=\"\",\"\",(VLOOKUP(D62,'Membership #'!$A$1:$C$1005,3,0)))","v":""},null,null,""]
["","","",null,{"$f":"IF(D63=\"\",\"\",(VLOOKUP(D63,'Membership #'!$A$1:$C$1005,2,0)))","v":""},{"$f":"IF(D63=\"\",\"\",(VLOOKUP(D63,'Membership #'!$A$1:$C$1005,3,0)))","v":""},null,null,""]
["","","",null,{"$f":"IF(D64=\"\",\"\",(VLOOKUP(D64,'Membership #'!$A$1:$C$1005,2,0)))","v":""},{"$f":"IF(D64=\"\",\"\",(VLOOKUP(D64,'Membership #'!$A$1:$C$1005,3,0)))","v":""},null,null,""]
["","","",null,{"$f":"IF(D65=\"\",\"\",(VLOOKUP(D65,'Membership #'!$A$1:$C$1005,2,0)))","v":""},{"$f":"IF(D65=\"\",\"\",(VLOOKUP(D65,'Membership #'!$A$1:$C$1005,3,0)))","v":""},null,null,""]
["","","",null,{"$f":"IF(D66=\"\",\"\",(VLOOKUP(D66,'Membership #'!$A$1:$C$1005,2,0)))","v":""},{"$f":"IF(D66=\"\",\"\",(VLOOKUP(D66,'Membership #'!$A$1:$C$1005,3,0)))","v":""},null,null,""]
["","","",null,{"$f":"IF(D67=\"\",\"\",(VLOOKUP(D67,'Membership #'!$A$1:$C$1005,2,0)))","v":""},{"$f":"IF(D67=\"\",\"\",(VLOOKUP(D67,'Membership #'!$A$1:$C$1005,3,0)))","v":""},null,null,""]
["","","",null,{"$f":"IF(D68=\"\",\"\",(VLOOKUP(D68,'Membership #'!$A$1:$C$1005,2,0)))","v":""},{"$f":"IF(D68=\"\",\"\",(VLOOKUP(D68,'Membership #'!$A$1:$C$1005,3,0)))","v":""},null,null,""]
["","","",null,{"$f":"IF(D69=\"\",\"\",(VLOOKUP(D69,'Membership #'!$A$1:$C$1005,2,0)))","v":""},{"$f":"IF(D69=\"\",\"\",(VLOOKUP(D69,'Membership #'!$A$1:$C$1005,3,0)))","v":""},null,null,""]
["","","",null,{"$f":"IF(D70=\"\",\"\",(VLOOKUP(D70,'Membership #'!$A$1:$C$1005,2,0)))","v":""},{"$f":"IF(D70=\"\",\"\",(VLOOKUP(D70,'Membership #'!$A$1:$C$1005,3,0)))","v":""},null,null,""]
["","","",null,{"$f":"IF(D71=\"\",\"\",(VLOOKUP(D71,'Membership #'!$A$1:$C$1005,2,0)))","v":""},{"$f":"IF(D71=\"\",\"\",(VLOOKUP(D71,'Membership #'!$A$1:$C$1005,3,0)))","v":""},null,null,""]
[{"$f":"IF(D72<>\"\",RAND(),\"\")","v":""},{"$f":"IF(D72<>\"\",RANK(A72,A$8:A$101),\"\")","v":""},"",null,{"$f":"IF(D72=\"\",\"\",(VLOOKUP(D72,'Membership #'!$A$1:$C$1005,2,0)))","v":""},{"$f":"IF(D72=\"\",\"\",(VLOOKUP(D72,'Membership #'!$A$1:$C$1005,3,0)))","v":""},null,null,""]
["","","",null,{"$f":"IF(D73=\"\",\"\",(VLOOKUP(D73,'Membership #'!$A$1:$C$1005,2,0)))","v":""},{"$f":"IF(D73=\"\",\"\",(VLOOKUP(D73,'Membership #'!$A$1:$C$1005,3,0)))","v":""},null,null,{"$f":"IF(G73=\"n\",\"No Time\",IF(G73=\"x\",\"Scratch\",IF(G73<>\"\",SUM(G73+H73),\"\")))","v":""}]
["","","",null,{"$f":"IF(D74=\"\",\"\",(VLOOKUP(D74,'Membership #'!$A$1:$C$1005,2,0)))","v":""},{"$f":"IF(D74=\"\",\"\",(VLOOKUP(D74,'Membership #'!$A$1:$C$1005,3,0)))","v":""},null,null,""]
["","","",null,{"$f":"IF(D75=\"\",\"\",(VLOOKUP(D75,'Membership #'!$A$1:$C$1005,2,0)))","v":""},{"$f":"IF(D75=\"\",\"\",(VLOOKUP(D75,'Membership #'!$A$1:$C$1005,3,0)))","v":""},null,null,""]
["","","",null,{"$f":"IF(D76=\"\",\"\",(VLOOKUP(D76,'Membership #'!$A$1:$C$1005,2,0)))","v":""},{"$f":"IF(D76=\"\",\"\",(VLOOKUP(D76,'Membership #'!$A$1:$C$1005,3,0)))","v":""},null,null,""]
["","","",null,{"$f":"IF(D77=\"\",\"\",(VLOOKUP(D77,'Membership #'!$A$1:$C$1005,2,0)))","v":""},{"$f":"IF(D77=\"\",\"\",(VLOOKUP(D77,'Membership #'!$A$1:$C$1005,3,0)))","v":""},null,null,""]
["","","",null,{"$f":"IF(D78=\"\",\"\",(VLOOKUP(D78,'Membership #'!$A$1:$C$1005,2,0)))","v":""},{"$f":"IF(D78=\"\",\"\",(VLOOKUP(D78,'Membership #'!$A$1:$C$1005,3,0)))","v":""},null,null,""]
["","","",null,{"$f":"IF(D79=\"\",\"\",(VLOOKUP(D79,'Membership #'!$A$1:$C$1005,2,0)))","v":""},{"$f":"IF(D79=\"\",\"\",(VLOOKUP(D79,'Membership #'!$A$1:$C$1005,3,0)))","v":""},null,null,""]
["","","",null,{"$f":"IF(D80=\"\",\"\",(VLOOKUP(D80,'Membership #'!$A$1:$C$1005,2,0)))","v":""},{"$f":"IF(D80=\"\",\"\",(VLOOKUP(D80,'Membership #'!$A$1:$C$1005,3,0)))","v":""},null,null,""]
["","","",null,{"$f":"IF(D81=\"\",\"\",(VLOOKUP(D81,'Membership #'!$A$1:$C$1005,2,0)))","v":""},{"$f":"IF(D81=\"\",\"\",(VLOOKUP(D81,'Membership #'!$A$1:$C$1005,3,0)))","v":""},null,null,""]
["","","",null,{"$f":"IF(D82=\"\",\"\",(VLOOKUP(D82,'Membership #'!$A$1:$C$1005,2,0)))","v":""},{"$f":"IF(D82=\"\",\"\",(VLOOKUP(D82,'Membership #'!$A$1:$C$1005,3,0)))","v":""},null,null,""]
["","","",null,{"$f":"IF(D83=\"\",\"\",(VLOOKUP(D83,'Membership #'!$A$1:$C$1005,2,0)))","v":""},{"$f":"IF(D83=\"\",\"\",(VLOOKUP(D83,'Membership #'!$A$1:$C$1005,3,0)))","v":""},null,null,""]
["","","",null,{"$f":"IF(D84=\"\",\"\",(VLOOKUP(D84,'Membership #'!$A$1:$C$1005,2,0)))","v":""},{"$f":"IF(D84=\"\",\"\",(VLOOKUP(D84,'Membership #'!$A$1:$C$1005,3,0)))","v":""},null,null,""]
["","","",null,{"$f":"IF(D85=\"\",\"\",(VLOOKUP(D85,'Membership #'!$A$1:$C$1005,2,0)))","v":""},{"$f":"IF(D85=\"\",\"\",(VLOOKUP(D85,'Membership #'!$A$1:$C$1005,3,0)))","v":""},null,null,""]
["","","",null,{"$f":"IF(D86=\"\",\"\",(VLOOKUP(D86,'Membership #'!$A$1:$C$1005,2,0)))","v":""},{"$f":"IF(D86=\"\",\"\",(VLOOKUP(D86,'Membership #'!$A$1:$C$1005,3,0)))","v":""},null,null,""]
["","","",null,{"$f":"IF(D87=\"\",\"\",(VLOOKUP(D87,'Membership #'!$A$1:$C$1005,2,0)))","v":""},{"$f":"IF(D87=\"\",\"\",(VLOOKUP(D87,'Membership #'!$A$1:$C$1005,3,0)))","v":""},null,null,""]
["","","",null,{"$f":"IF(D88=\"\",\"\",(VLOOKUP(D88,'Membership #'!$A$1:$C$1005,2,0)))","v":""},{"$f":"IF(D88=\"\",\"\",(VLOOKUP(D88,'Membership #'!$A$1:$C$1005,3,0)))","v":""},null,null,""]
["","","",null,{"$f":"IF(D89=\"\",\"\",(VLOOKUP(D89,'Membership #'!$A$1:$C$1005,2,0)))","v":""},{"$f":"IF(D89=\"\",\"\",(VLOOKUP(D89,'Membership #'!$A$1:$C$1005,3,0)))","v":""},null,null,""]
["","","",null,{"$f":"IF(D90=\"\",\"\",(VLOOKUP(D90,'Membership #'!$A$1:$C$1005,2,0)))","v":""},{"$f":"IF(D90=\"\",\"\",(VLOOKUP(D90,'Membership #'!$A$1:$C$1005,3,0)))","v":""},null,null,""]
["","","",null,{"$f":"IF(D91=\"\",\"\",(VLOOKUP(D91,'Membership #'!$A$1:$C$1005,2,0)))","v":""},{"$f":"IF(D91=\"\",\"\",(VLOOKUP(D91,'Membership #'!$A$1:$C$1005,3,0)))","v":""},null,null,""]
["","","",null,{"$f":"IF(D92=\"\",\"\",(VLOOKUP(D92,'Membership #'!$A$1:$C$1005,2,0)))","v":""},{"$f":"IF(D92=\"\",\"\",(VLOOKUP(D92,'Membership #'!$A$1:$C$1005,3,0)))","v":""},null,null,""]
["","","",null,{"$f":"IF(D93=\"\",\"\",(VLOOKUP(D93,'Membership #'!$A$1:$C$1005,2,0)))","v":""},{"$f":"IF(D93=\"\",\"\",(VLOOKUP(D93,'Membership #'!$A$1:$C$1005,3,0)))","v":""},null,null,""]
["","","",null,{"$f":"IF(D94=\"\",\"\",(VLOOKUP(D94,'Membership #'!$A$1:$C$1005,2,0)))","v":""},{"$f":"IF(D94=\"\",\"\",(VLOOKUP(D94,'Membership #'!$A$1:$C$1005,3,0)))","v":""},null,null,""]
["","","",null,{"$f":"IF(D95=\"\",\"\",(VLOOKUP(D95,'Membership #'!$A$1:$C$1005,2,0)))","v":""},{"$f":"IF(D95=\"\",\"\",(VLOOKUP(D95,'Membership #'!$A$1:$C$1005,3,0)))","v":""},null,null,""]
["","","",null,{"$f":"IF(D96=\"\",\"\",(VLOOKUP(D96,'Membership #'!$A$1:$C$1005,2,0)))","v":""},{"$f":"IF(D96=\"\",\"\",(VLOOKUP(D96,'Membership #'!$A$1:$C$1005,3,0)))","v":""},null,null,""]
["","","",null,{"$f":"IF(D97=\"\",\"\",(VLOOKUP(D97,'Membership #'!$A$1:$C$1005,2,0)))","v":""},{"$f":"IF(D97=\"\",\"\",(VLOOKUP(D97,'Membership #'!$A$1:$C$1005,3,0)))","v":""},null,null,""]
["","","",null,{"$f":"IF(D98=\"\",\"\",(VLOOKUP(D98,'Membership #'!$A$1:$C$1005,2,0)))","v":""},{"$f":"IF(D98=\"\",\"\",(VLOOKUP(D98,'Membership #'!$A$1:$C$1005,3,0)))","v":""},null,null,""]
["","","",null,{"$f":"IF(D99=\"\",\"\",(VLOOKUP(D99,'Membership #'!$A$1:$C$1005,2,0)))","v":""},{"$f":"IF(D99=\"\",\"\",(VLOOKUP(D99,'Membership #'!$A$1:$C$1005,3,0)))","v":""},null,null,""]
["","","",null,{"$f":"IF(D100=\"\",\"\",(VLOOKUP(D100,'Membership #'!$A$1:$C$1005,2,0)))","v":""},{"$f":"IF(D100=\"\",\"\",(VLOOKUP(D100,'Membership #'!$A$1:$C$1005,3,0)))","v":""},null,null,""]
["","","",null,{"$f":"IF(D101=\"\",\"\",(VLOOKUP(D101,'Membership #'!$A$1:$C$1005,2,0)))","v":""},{"$f":"IF(D101=\"\",\"\",(VLOOKUP(D101,'Membership #'!$A$1:$C$1005,3,0)))","v":""},null,null,""]

{"sheet":"YOUTH BARRELS","index":10,"n_rows":42,"n_cols":26,"rows_kept":42,"cut":false,"hidden":false,"merged":[[3,6,6,6],[3,7,6,7],[3,8,6,8],[5,12,5,15],[0,0,0,10],[1,0,1,10],[2,0,2,3],[2,6,2,10],[3,0,6,0],[3,1,6,1],[3,2,6,2],[3,3,6,3],[3,4,6,4],[3,9,6,9],[3,10,6,10],[3,5,6,5]]}
["Tom Burt & Mark McGuire Memorial Jackpot Aug 22, 2021",null,null,null,null,null,null,null,null,null,null,null,"x=Scratch"]
["YOUTH BARRELS",null,null,null,null,null,null,null,null,null,null,null,"n=No Time"]
["# Enteries:",null,null,null,{"$f":"COUNTIF($D$8:$D$41,\">0\")","v":16},null,null,null,null,null,null,null,null,null,null,null,null,"Don't Erase these numbers below!!"]
["Rand Draw","Seed","Running Order","RING #      ","NAME","HORSE NAME","TIME","PENALTY ","TOTAL","PLACINGS","POINTS",null,null,null,null,null,null,{"$f":"IF(N9=2,7,IF(N9=3,6,IF(N9=4,5,IF(N9=5,4,IF(AND(N9>5,N11>600),3,IF(AND(N9>5,N11<600,N11>299.99),2,IF(AND(N9>5,N11<300),1,8)))))))","v":1},1,2,3,4,5,6,7,8]
[null,null,null,null,null,null,null,null,null,null,null,null,null,null,null,null,null,null,299,"$300-","$600 -"]
[null,null,null,null,null,null,null,null,null,null,null,null,"YOUTH BARRELS",null,null,null,null,null,"or less",599,"More","5 Entries","4 Entries","3 Entries","2 Entries"]
[null,null,null,null,null,null,null,null,null,null,null,null,null,null,null,null,null,"1st",0.32,0.27,0.24,0.35,0.4,0.46,0.6]
[{"$f":"IF(D8<>\"\",RAND(),\"\")","v":0.79315000750581499},{"$f":"IF(D8<>\"\",RANK(A8,A$8:A$100),\"\")","v":4},1,688,{"$f":"IF(D8=\"\",\"\",(VLOOKUP(D8,'Membership #'!$A$1:$C$1005,2,0)))","v":"Lenee Sampson"},{"$f":"IF(D8=\"\",\"\",(VLOOKUP(D8,'Membership #'!$A$1:$C$1005,3,0)))","v":"Six Dash Run"},15.154,null,{"$f":"IF(G8=\"n\",\"No Time\",IF(G8=\"x\",\"Scratch\",IF(G8<>\"\",SUM(G8+H8),\"\")))","v":15.154},1,10,null,"Added",25,null,null,null,"2nd",0.23,0.22,0.19,0.25,0.28000000000000003,0.34,0.4]
[0.59147217254134876,8,2,638,{"$f":"IF(D9=\"\",\"\",(VLOOKUP(D9,'Membership #'!$A$1:$C$1005,2,0)))","v":"Bella Peters"},{"$f":"IF(D9=\"\",\"\",(VLOOKUP(D9,'Membership #'!$A$1:$C$1005,3,0)))","v":"Super Star"},15.509,null,15.509,2,9,null,"Entries",15,null,5,"per head","3rd",0.15,0.18,0.16,0.17,0.18,0.2]
[7.5617589028128096E-2,16,3,815,{"$f":"IF(D10=\"\",\"\",(VLOOKUP(D10,'Membership #'!$A$1:$C$1005,2,0)))","v":"Brooke Kennedy"},{"$f":"IF(D10=\"\",\"\",(VLOOKUP(D10,'Membership #'!$A$1:$C$1005,3,0)))","v":"Tic Toc Teazer"},15.618,null,15.618,3,8,null,"Jackpot",{"$f":"P9*N9","v":75},null,0.85,"payback","4th",0.12,0.13,0.13,0.13,0.14000000000000001]
[0.31108062228172628,13,4,652,{"$f":"IF(D11=\"\",\"\",(VLOOKUP(D11,'Membership #'!$A$1:$C$1005,2,0)))","v":"Molly O'Grady"},{"$f":"IF(D11=\"\",\"\",(VLOOKUP(D11,'Membership #'!$A$1:$C$1005,3,0)))","v":"Teelano's Twister"},16.010999999999999,null,16.010999999999999,4,7,null,"Total Money",{"$f":"N8+(N10*P10)","v":88.75},null,{"$f":"N10*P10","v":63.75},"Jackpot","5th",0.1,0.09,0.08,0.1]
[0.68786324264584953,7,5,966,{"$f":"IF(D12=\"\",\"\",(VLOOKUP(D12,'Membership #'!$A$1:$C$1005,2,0)))","v":"Ava Anderson"},{"$f":"IF(D12=\"\",\"\",(VLOOKUP(D12,'Membership #'!$A$1:$C$1005,3,0)))","v":"Black Sass"},16.315999999999999,null,16.315999999999999,5,6,null,null,"Percentage","Money","Ring #",null,"6th",0.08,0.06,0.06]
[0.54374961450954951,9,6,867,{"$f":"IF(D13=\"\",\"\",(VLOOKUP(D13,'Membership #'!$A$1:$C$1005,2,0)))","v":"Layla MacEachem"},{"$f":"IF(D13=\"\",\"\",(VLOOKUP(D13,'Membership #'!$A$1:$C$1005,3,0)))","v":"Shes a gem"},17.521000000000001,null,17.521000000000001,6,5,null,"1st",0.32,{"$f":"IF(N13<>0,N$11*N13,\"\")","v":28.400000000000002},null,{"$f":"IF(P13=\"\",\"\",(VLOOKUP(P13,'Membership #'!$A$1:$C$1005,2,0)))","v":""},"7th",null,0.03,0.05]
[0.93290098320352677,2,7,973,{"$f":"IF(D14=\"\",\"\",(VLOOKUP(D14,'Membership #'!$A$1:$C$1005,2,0)))","v":"Sara Ivey"},{"$f":"IF(D14=\"\",\"\",(VLOOKUP(D14,'Membership #'!$A$1:$C$1005,3,0)))","v":"Ms Heavenly Gator"},18.321999999999999,null,18.321999999999999,null,null,null,"2nd",0.23,20.412500000000001,null,{"$f":"IF(P14=\"\",\"\",(VLOOKUP(P14,'Membership #'!$A$1:$C$1005,2,0)))","v":""},"8th",null,0.02,0.04]
[0.74646624040809173,5,8,636,{"$f":"IF(D15=\"\",\"\",(VLOOKUP(D15,'Membership #'!$A$1:$C$1005,2,0)))","v":"Ceilidh Gosse"},{"$f":"IF(D15=\"\",\"\",(VLOOKUP(D15,'Membership #'!$A$1:$C$1005,3,0)))","v":"ELM Silver Crime"},18.603999999999999,null,18.603999999999999,null,null,null,"3rd",0.15,13.3125,null,{"$f":"IF(P15=\"\",\"\",(VLOOKUP(P15,'Membership #'!$A$1:$C$1005,2,0)))","v":""},"9th",null,null,0.03]
[0.74533832562586344,6,9,918,{"$f":"IF(D16=\"\",\"\",(VLOOKUP(D16,'Membership #'!$A$1:$C$1005,2,0)))","v":"Keira Rose"},{"$f":"IF(D16=\"\",\"\",(VLOOKUP(D16,'Membership #'!$A$1:$C$1005,3,0)))","v":"LL Its All About Red"},15.442,5,20.442,null,null,null,"4th",0.12,10.65,null,{"$f":"IF(P16=\"\",\"\",(VLOOKUP(P16,'Membership #'!$A$1:$C$1005,2,0)))","v":""},"10th",null,null,0.02]
[0.32458155091367558,12,10,961,{"$f":"IF(D17=\"\",\"\",(VLOOKUP(D17,'Membership #'!$A$1:$C$1005,2,0)))","v":"Jacie Burke"},{"$f":"IF(D17=\"\",\"\",(VLOOKUP(D17,'Membership #'!$A$1:$C$1005,3,0)))","v":"She's Just That Sassy"},16.265000000000001,5,21.265000000000001,null,null,null,"5th",0.1,8.875,null,{"$f":"IF(P17=\"\",\"\",(VLOOKUP(P17,'Membership #'!$A$1:$C$1005,2,0)))","v":""}]
[0.88212301331464738,3,11,967,{"$f":"IF(D18=\"\",\"\",(VLOOKUP(D18,'Membership #'!$A$1:$C$1005,2,0)))","v":"Marissa Hillier"},{"$f":"IF(D18=\"\",\"\",(VLOOKUP(D18,'Membership #'!$A$1:$C$1005,3,0)))","v":"Notice Betty Boop"},21.571999999999999,null,21.571999999999999,null,null,null,"6th",0.08,7.1000000000000005,null,{"$f":"IF(P18=\"\",\"\",(VLOOKUP(P18,'Membership #'!$A$1:$C$1005,2,0)))","v":""}]
[0.23516020111263602,14,12,904,{"$f":"IF(D19=\"\",\"\",(VLOOKUP(D19,'Membership #'!$A$1:$C$1005,2,0)))","v":"Ella Cowley"},{"$f":"IF(D19=\"\",\"\",(VLOOKUP(D19,'Membership #'!$A$1:$C$1005,3,0)))","v":"Blazin Boots"},16.927,5,21.927,null,null,null,"7th",null,""]
[0.37943157928608506,11,13,753,{"$f":"IF(D20=\"\",\"\",(VLOOKUP(D20,'Membership #'!$A$1:$C$1005,2,0)))","v":"Kayla Boudreau"},{"$f":"IF(D20=\"\",\"\",(VLOOKUP(D20,'Membership #'!$A$1:$C$1005,3,0)))","v":"Lady Jane"},22.567,null,22.567,null,null,null,"8th",null,""]
[0.53931231249175793,10,14,941,{"$f":"IF(D21=\"\",\"\",(VLOOKUP(D21,'Membership #'!$A$1:$C$1005,2,0)))","v":"Taylor Hurley"},{"$f":"IF(D21=\"\",\"\",(VLOOKUP(D21,'Membership #'!$A$1:$C$1005,3,0)))","v":"Nacho Business"},"n",null,"No Time",null,null,null,"9th",null,""]
[0.94697305460667103,1,15,954,{"$f":"IF(D22=\"\",\"\",(VLOOKUP(D22,'Membership #'!$A$1:$C$1005,2,0)))","v":"Scotia MacEachern"},{"$f":"IF(D22=\"\",\"\",(VLOOKUP(D22,'Membership #'!$A$1:$C$1005,3,0)))","v":"Hick-a-Licious"},"n",null,"No Time",null,null,null,"10th",null,""]
[0.18030377406330245,15,"",666,{"$f":"IF(D23=\"\",\"\",(VLOOKUP(D23,'Membership #'!$A$1:$C$1005,2,0)))","v":"Summer Fraser"},{"$f":"IF(D23=\"\",\"\",(VLOOKUP(D23,'Membership #'!$A$1:$C$1005,3,0)))","v":"Sheza Smokin' Girl"},"x",null,"Scratch",null,null,null,"Total Money",null,{"$f":"SUM(O13:O22)","v":88.75}]
["","","",null,{"$f":"IF(D24=\"\",\"\",(VLOOKUP(D24,'Membership #'!$A$1:$C$1005,2,0)))","v":""},{"$f":"IF(D24=\"\",\"\",(VLOOKUP(D24,'Membership #'!$A$1:$C$1005,3,0)))","v":""},null,null,{"$f":"IF(G24=\"n\",\"No Time\",IF(G24=\"x\",\"Scratch\",IF(G24<>\"\",SUM(G24+H24),\"\")))","v":""}]
["","","",null,{"$f":"IF(D25=\"\",\"\",(VLOOKUP(D25,'Membership #'!$A$1:$C$1005,2,0)))","v":""},{"$f":"IF(D25=\"\",\"\",(VLOOKUP(D25,'Membership #'!$A$1:$C$1005,3,0)))","v":""},null,null,""]
["","","",null,{"$f":"IF(D26=\"\",\"\",(VLOOKUP(D26,'Membership #'!$A$1:$C$1005,2,0)))","v":""},{"$f":"IF(D26=\"\",\"\",(VLOOKUP(D26,'Membership #'!$A$1:$C$1005,3,0)))","v":""},null,null,""]
["","","",null,{"$f":"IF(D27=\"\",\"\",(VLOOKUP(D27,'Membership #'!$A$1:$C$1005,2,0)))","v":""},{"$f":"IF(D27=\"\",\"\",(VLOOKUP(D27,'Membership #'!$A$1:$C$1005,3,0)))","v":""},null,null,{"$f":"IF(G27=\"n\",\"No Time\",IF(G27=\"x\",\"Scratch\",IF(G27<>\"\",SUM(G27+H27),\"\")))","v":""}]
["","","",null,{"$f":"IF(D28=\"\",\"\",(VLOOKUP(D28,'Membership #'!$A$1:$C$1005,2,0)))","v":""},{"$f":"IF(D28=\"\",\"\",(VLOOKUP(D28,'Membership #'!$A$1:$C$1005,3,0)))","v":""},null,null,""]
["","","",null,{"$f":"IF(D29=\"\",\"\",(VLOOKUP(D29,'Membership #'!$A$1:$C$1005,2,0)))","v":""},{"$f":"IF(D29=\"\",\"\",(VLOOKUP(D29,'Membership #'!$A$1:$C$1005,3,0)))","v":""},null,null,{"$f":"IF(G29=\"n\",\"No Time\",IF(G29=\"x\",\"Scratch\",IF(G29<>\"\",SUM(G29+H29),\"\")))","v":""}]
["","","",null,{"$f":"IF(D30=\"\",\"\",(VLOOKUP(D30,'Membership #'!$A$1:$C$1005,2,0)))","v":""},{"$f":"IF(D30=\"\",\"\",(VLOOKUP(D30,'Membership #'!$A$1:$C$1005,3,0)))","v":""},null,null,""]
["","","",null,{"$f":"IF(D31=\"\",\"\",(VLOOKUP(D31,'Membership #'!$A$1:$C$1005,2,0)))","v":""},{"$f":"IF(D31=\"\",\"\",(VLOOKUP(D31,'Membership #'!$A$1:$C$1005,3,0)))","v":""},null,null,""]
["","","",null,{"$f":"IF(D32=\"\",\"\",(VLOOKUP(D32,'Membership #'!$A$1:$C$1005,2,0)))","v":""},{"$f":"IF(D32=\"\",\"\",(VLOOKUP(D32,'Membership #'!$A$1:$C$1005,3,0)))","v":""},null,null,""]
["","","",null,{"$f":"IF(D33=\"\",\"\",(VLOOKUP(D33,'Membership #'!$A$1:$C$1005,2,0)))","v":""},{"$f":"IF(D33=\"\",\"\",(VLOOKUP(D33,'Membership #'!$A$1:$C$1005,3,0)))","v":""},null,null,""]
[{"$f":"IF(D34<>\"\",RAND(),\"\")","v":""},"","",null,{"$f":"IF(D34=\"\",\"\",(VLOOKUP(D34,'Membership #'!$A$1:$C$1005,2,0)))","v":""},{"$f":"IF(D34=\"\",\"\",(VLOOKUP(D34,'Membership #'!$A$1:$C$1005,3,0)))","v":""},null,null,{"$f":"IF(G34=\"n\",\"No Time\",IF(G34=\"x\",\"Scratch\",IF(G34<>\"\",SUM(G34+H34),\"\")))","v":""}]
["","","",null,{"$f":"IF(D35=\"\",\"\",(VLOOKUP(D35,'Membership #'!$A$1:$C$1005,2,0)))","v":""},{"$f":"IF(D35=\"\",\"\",(VLOOKUP(D35,'Membership #'!$A$1:$C$1005,3,0)))","v":""},null,null,""]
["","","",null,{"$f":"IF(D36=\"\",\"\",(VLOOKUP(D36,'Membership #'!$A$1:$C$1005,2,0)))","v":""},{"$f":"IF(D36=\"\",\"\",(VLOOKUP(D36,'Membership #'!$A$1:$C$1005,3,0)))","v":""},null,null,""]
["","","",null,{"$f":"IF(D37=\"\",\"\",(VLOOKUP(D37,'Membership #'!$A$1:$C$1005,2,0)))","v":""},{"$f":"IF(D37=\"\",\"\",(VLOOKUP(D37,'Membership #'!$A$1:$C$1005,3,0)))","v":""},null,null,""]
["","","",null,{"$f":"IF(D38=\"\",\"\",(VLOOKUP(D38,'Membership #'!$A$1:$C$1005,2,0)))","v":""},{"$f":"IF(D38=\"\",\"\",(VLOOKUP(D38,'Membership #'!$A$1:$C$1005,3,0)))","v":""},null,null,""]
["","","",null,{"$f":"IF(D39=\"\",\"\",(VLOOKUP(D39,'Membership #'!$A$1:$C$1005,2,0)))","v":""},{"$f":"IF(D39=\"\",\"\",(VLOOKUP(D39,'Membership #'!$A$1:$C$1005,3,0)))","v":""},null,null,""]
["","","",null,{"$f":"IF(D40=\"\",\"\",(VLOOKUP(D40,'Membership #'!$A$1:$C$1005,2,0)))","v":""},{"$f":"IF(D40=\"\",\"\",(VLOOKUP(D40,'Membership #'!$A$1:$C$1005,3,0)))","v":""}]
["","","",null,{"$f":"IF(D41=\"\",\"\",(VLOOKUP(D41,'Membership #'!$A$1:$C$1005,2,0)))","v":""},{"$f":"IF(D41=\"\",\"\",(VLOOKUP(D41,'Membership #'!$A$1:$C$1005,3,0)))","v":""}]
[null,null,null,null,{"$f":"IF(D42=\"\",\"\",(VLOOKUP(D42,'Membership #'!$A$1:$C$1005,2,0)))","v":""},{"$f":"IF(D42=\"\",\"\",(VLOOKUP(D42,'Membership #'!$A$1:$C$1005,3,0)))","v":""}]

{"sheet":"YOUTH POLES","index":11,"n_rows":100,"n_cols":26,"rows_kept":100,"cut":false,"hidden":false,"merged":[[5,12,5,15],[0,0,0,10],[1,0,1,10],[2,0,2,3],[2,6,2,10],[3,0,6,0],[3,1,6,1],[3,2,6,2],[3,3,6,3],[3,4,6,4],[3,9,6,9],[3,10,6,10],[3,5,6,5],[3,6,6,6],[3,7,6,7],[3,8,6,8]]}
["Tom Burt & Mark McGuire Memorial Jackpot Aug 22, 2021",null,null,null,null,null,null,null,null,null,null,null,"x=Scratch"]
["YOUTH POLES",null,null,null,null,null,null,null,null,null,null,null,"n=No Time"]
["# Enteries:",null,null,null,{"$f":"COUNTIF($D$8:$D$99,\">0\")","v":15},null,null,null,null,null,null,null,null,null,null,null,null,"Don't Erase these numbers below!!"]
["Rand Draw","Seed","Running Order","RING #      ","NAME","HORSE NAME","TIME","PENALTY ","TOTAL","PLACINGS","POINTS",null,null,null,null,null,null,{"$f":"IF(N9=2,7,IF(N9=3,6,IF(N9=4,5,IF(N9=5,4,IF(AND(N9>5,N11>600),3,IF(AND(N9>5,N11<600,N11>299.99),2,IF(AND(N9>5,N11<300),1,8)))))))","v":1},1,2,3,4,5,6,7,8]
[null,null,null,null,null,null,null,null,null,null,null,null,null,null,null,null,null,null,299,"$300-","$600 -"]
[null,null,null,null,null,null,null,null,null,null,null,null,"YOUTH POLES",null,null,null,null,null,"or less",599,"More","5 Entries","4 Entries","3 Entries","2 Entries"]
[null,null,null,null,null,null,null,null,null,null,null,null,null,null,null,null,null,"1st",0.32,0.27,0.24,0.35,0.4,0.46,0.6]
[{"$f":"IF(D8<>\"\",RAND(),\"\")","v":8.7828993290761659E-2},{"$f":"IF(D8<>\"\",RANK(A8,A$8:A$100),\"\")","v":12},1,815,{"$f":"IF(D8=\"\",\"\",(VLOOKUP(D8,'Membership #'!$A$1:$C$1005,2,0)))","v":"Brooke Kennedy"},{"$f":"IF(D8=\"\",\"\",(VLOOKUP(D8,'Membership #'!$A$1:$C$1005,3,0)))","v":"Tic Toc Teazer"},23.058,null,{"$f":"IF(G8=\"n\",\"No Time\",IF(G8=\"x\",\"Scratch\",IF(G8<>\"\",SUM(G8+H8),\"\")))","v":23.058},null,null,null,"Added",25,null,null,null,"2nd",0.23,0.22,0.19,0.25,0.28000000000000003,0.34,0.4]
[{"$f":"IF(D9<>\"\",RAND(),\"\")","v":0.20750542996622101},{"$f":"IF(D9<>\"\",RANK(A9,A$8:A$100),\"\")","v":10},2,867,{"$f":"IF(D9=\"\",\"\",(VLOOKUP(D9,'Membership #'!$A$1:$C$1005,2,0)))","v":"Layla MacEachem"},{"$f":"IF(D9=\"\",\"\",(VLOOKUP(D9,'Membership #'!$A$1:$C$1005,3,0)))","v":"Shes a gem"},25.587,null,25.587,null,null,null,"Entries",15,null,5,"per head","3rd",0.15,0.18,0.16,0.17,0.18,0.2]
[7.9743313952732042E-2,13,3,638,{"$f":"IF(D10=\"\",\"\",(VLOOKUP(D10,'Membership #'!$A$1:$C$1005,2,0)))","v":"Bella Peters"},{"$f":"IF(D10=\"\",\"\",(VLOOKUP(D10,'Membership #'!$A$1:$C$1005,3,0)))","v":"Super Star"},21.123999999999999,5,26.123999999999999,null,null,null,"Jackpot",{"$f":"P9*N9","v":75},null,0.85,"payback","4th",0.12,0.13,0.13,0.13,0.14000000000000001]
[0.74193195748989582,1,4,954,{"$f":"IF(D11=\"\",\"\",(VLOOKUP(D11,'Membership #'!$A$1:$C$1005,2,0)))","v":"Scotia MacEachern"},{"$f":"IF(D11=\"\",\"\",(VLOOKUP(D11,'Membership #'!$A$1:$C$1005,3,0)))","v":"Hick-a-Licious"},26.995000000000001,null,26.995000000000001,null,null,null,"Total Money",{"$f":"N8+(N10*P10)","v":88.75},null,{"$f":"N10*P10","v":63.75},"Jackpot","5th",0.1,0.09,0.08,0.1]
[0.73902452977116129,2,5,636,{"$f":"IF(D12=\"\",\"\",(VLOOKUP(D12,'Membership #'!$A$1:$C$1005,2,0)))","v":"Ceilidh Gosse"},{"$f":"IF(D12=\"\",\"\",(VLOOKUP(D12,'Membership #'!$A$1:$C$1005,3,0)))","v":"ELM Silver Crime"},27.050999999999998,null,27.050999999999998,null,null,null,null,"Percentage","Money","Ring #",null,"6th",0.08,0.06,0.06]
[0.61907806557644296,4,6,973,{"$f":"IF(D13=\"\",\"\",(VLOOKUP(D13,'Membership #'!$A$1:$C$1005,2,0)))","v":"Sara Ivey"},{"$f":"IF(D13=\"\",\"\",(VLOOKUP(D13,'Membership #'!$A$1:$C$1005,3,0)))","v":"Ms Heavenly Gator"},28.681999999999999,null,28.681999999999999,null,null,null,"1st",0.32,{"$f":"IF(N13<>0,N$11*N13,\"\")","v":28.400000000000002},null,{"$f":"IF(P13=\"\",\"\",(VLOOKUP(P13,'Membership #'!$A$1:$C$1005,2,0)))","v":""},"7th",null,0.03,0.05]
[7.6058923760997432E-2,14,7,967,{"$f":"IF(D14=\"\",\"\",(VLOOKUP(D14,'Membership #'!$A$1:$C$1005,2,0)))","v":"Marissa Hillier"},{"$f":"IF(D14=\"\",\"\",(VLOOKUP(D14,'Membership #'!$A$1:$C$1005,3,0)))","v":"Notice Betty Boop"},33.531999999999996,null,33.531999999999996,null,null,null,"2nd",0.23,20.412500000000001,null,{"$f":"IF(P14=\"\",\"\",(VLOOKUP(P14,'Membership #'!$A$1:$C$1005,2,0)))","v":""},"8th",null,0.02,0.04]
[0.42066497950622062,8,8,652,{"$f":"IF(D15=\"\",\"\",(VLOOKUP(D15,'Membership #'!$A$1:$C$1005,2,0)))","v":"Molly O'Grady"},{"$f":"IF(D15=\"\",\"\",(VLOOKUP(D15,'Membership #'!$A$1:$C$1005,3,0)))","v":"Teelano's Twister"},32.344999999999999,5,37.344999999999999,null,null,null,"3rd",0.15,13.3125,null,{"$f":"IF(P15=\"\",\"\",(VLOOKUP(P15,'Membership #'!$A$1:$C$1005,2,0)))","v":""},"9th",null,null,0.03]
[0.50633579258854544,7,9,966,{"$f":"IF(D16=\"\",\"\",(VLOOKUP(D16,'Membership #'!$A$1:$C$1005,2,0)))","v":"Ava Anderson"},{"$f":"IF(D16=\"\",\"\",(VLOOKUP(D16,'Membership #'!$A$1:$C$1005,3,0)))","v":"Black Sass"},48.274000000000001,20,68.274000000000001,null,null,null,"4th",0.12,10.65,null,{"$f":"IF(P16=\"\",\"\",(VLOOKUP(P16,'Membership #'!$A$1:$C$1005,2,0)))","v":""},"10th",null,null,0.02]
[0.61319394845481812,5,10,941,{"$f":"IF(D17=\"\",\"\",(VLOOKUP(D17,'Membership #'!$A$1:$C$1005,2,0)))","v":"Taylor Hurley"},{"$f":"IF(D17=\"\",\"\",(VLOOKUP(D17,'Membership #'!$A$1:$C$1005,3,0)))","v":"Nacho Business"},"n",null,"No Time",null,null,null,"5th",0.1,8.875,null,{"$f":"IF(P17=\"\",\"\",(VLOOKUP(P17,'Membership #'!$A$1:$C$1005,2,0)))","v":""}]
[0.6532221364024462,3,11,904,{"$f":"IF(D18=\"\",\"\",(VLOOKUP(D18,'Membership #'!$A$1:$C$1005,2,0)))","v":"Ella Cowley"},{"$f":"IF(D18=\"\",\"\",(VLOOKUP(D18,'Membership #'!$A$1:$C$1005,3,0)))","v":"Blazin Boots"},"n",null,"No Time",null,null,null,"6th",0.08,7.1000000000000005,null,{"$f":"IF(P18=\"\",\"\",(VLOOKUP(P18,'Membership #'!$A$1:$C$1005,2,0)))","v":""}]
[0.56185431441319056,6,12,666,{"$f":"IF(D19=\"\",\"\",(VLOOKUP(D19,'Membership #'!$A$1:$C$1005,2,0)))","v":"Summer Fraser"},{"$f":"IF(D19=\"\",\"\",(VLOOKUP(D19,'Membership #'!$A$1:$C$1005,3,0)))","v":"Sheza Smokin' Girl"},"x",null,"Scratch",null,null,null,"7th",{"$f":"HLOOKUP($R$4,$S$4:$Z$17,10,0)","v":0},""]
[0.24538317650435038,9,13,961,{"$f":"IF(D20=\"\",\"\",(VLOOKUP(D20,'Membership #'!$A$1:$C$1005,2,0)))","v":"Jacie Burke"},{"$f":"IF(D20=\"\",\"\",(VLOOKUP(D20,'Membership #'!$A$1:$C$1005,3,0)))","v":"She's Just That Sassy"},"x",null,"Scratch",null,null,null,"8th",{"$f":"HLOOKUP($R$4,$S$4:$Z$17,11,0)","v":0},""]
[2.3781805444960891E-2,15,14,918,{"$f":"IF(D21=\"\",\"\",(VLOOKUP(D21,'Membership #'!$A$1:$C$1005,2,0)))","v":"Keira Rose"},{"$f":"IF(D21=\"\",\"\",(VLOOKUP(D21,'Membership #'!$A$1:$C$1005,3,0)))","v":"LL Its All About Red"},"x",null,"Scratch",null,null,null,"9th",{"$f":"HLOOKUP($R$4,$S$4:$Z$17,12,0)","v":0},""]
[0.14199025920171615,11,15,532,{"$f":"IF(D22=\"\",\"\",(VLOOKUP(D22,'Membership #'!$A$1:$C$1005,2,0)))","v":"Gracie MacLean"},{"$f":"IF(D22=\"\",\"\",(VLOOKUP(D22,'Membership #'!$A$1:$C$1005,3,0)))","v":"Secret"},"x",null,"Scratch",null,null,null,"10th",{"$f":"HLOOKUP($R$4,$S$4:$Z$17,13,0)","v":0},""]
["","","",null,{"$f":"IF(D23=\"\",\"\",(VLOOKUP(D23,'Membership #'!$A$1:$C$1005,2,0)))","v":""},{"$f":"IF(D23=\"\",\"\",(VLOOKUP(D23,'Membership #'!$A$1:$C$1005,3,0)))","v":""},null,null,{"$f":"IF(G23=\"n\",\"No Time\",IF(G23=\"x\",\"Scratch\",IF(G23<>\"\",SUM(G23+H23),\"\")))","v":""},null,null,null,"Total Money",null,{"$f":"SUM(O13:O22)","v":88.75}]
["","","",null,{"$f":"IF(D24=\"\",\"\",(VLOOKUP(D24,'Membership #'!$A$1:$C$1005,2,0)))","v":""},{"$f":"IF(D24=\"\",\"\",(VLOOKUP(D24,'Membership #'!$A$1:$C$1005,3,0)))","v":""},null,null,""]
["","","",null,{"$f":"IF(D25=\"\",\"\",(VLOOKUP(D25,'Membership #'!$A$1:$C$1005,2,0)))","v":""},{"$f":"IF(D25=\"\",\"\",(VLOOKUP(D25,'Membership #'!$A$1:$C$1005,3,0)))","v":""},null,null,""]
["","","",null,{"$f":"IF(D26=\"\",\"\",(VLOOKUP(D26,'Membership #'!$A$1:$C$1005,2,0)))","v":""},{"$f":"IF(D26=\"\",\"\",(VLOOKUP(D26,'Membership #'!$A$1:$C$1005,3,0)))","v":""},null,null,""]
["","","",null,{"$f":"IF(D27=\"\",\"\",(VLOOKUP(D27,'Membership #'!$A$1:$C$1005,2,0)))","v":""},{"$f":"IF(D27=\"\",\"\",(VLOOKUP(D27,'Membership #'!$A$1:$C$1005,3,0)))","v":""},null,null,""]
["","","",null,{"$f":"IF(D28=\"\",\"\",(VLOOKUP(D28,'Membership #'!$A$1:$C$1005,2,0)))","v":""},{"$f":"IF(D28=\"\",\"\",(VLOOKUP(D28,'Membership #'!$A$1:$C$1005,3,0)))","v":""},null,null,{"$f":"IF(G28=\"n\",\"No Time\",IF(G28=\"x\",\"Scratch\",IF(G28<>\"\",SUM(G28+H28),\"\")))","v":""}]
["","","",null,{"$f":"IF(D29=\"\",\"\",(VLOOKUP(D29,'Membership #'!$A$1:$C$1005,2,0)))","v":""},{"$f":"IF(D29=\"\",\"\",(VLOOKUP(D29,'Membership #'!$A$1:$C$1005,3,0)))","v":""},null,null,""]
["","","",null,{"$f":"IF(D30=\"\",\"\",(VLOOKUP(D30,'Membership #'!$A$1:$C$1005,2,0)))","v":""},{"$f":"IF(D30=\"\",\"\",(VLOOKUP(D30,'Membership #'!$A$1:$C$1005,3,0)))","v":""},null,null,""]
["","","",null,{"$f":"IF(D31=\"\",\"\",(VLOOKUP(D31,'Membership #'!$A$1:$C$1005,2,0)))","v":""},{"$f":"IF(D31=\"\",\"\",(VLOOKUP(D31,'Membership #'!$A$1:$C$1005,3,0)))","v":""},null,null,{"$f":"IF(G31=\"n\",\"No Time\",IF(G31=\"x\",\"Scratch\",IF(G31<>\"\",SUM(G31+H31),\"\")))","v":""}]
["","","",null,{"$f":"IF(D32=\"\",\"\",(VLOOKUP(D32,'Membership #'!$A$1:$C$1005,2,0)))","v":""},{"$f":"IF(D32=\"\",\"\",(VLOOKUP(D32,'Membership #'!$A$1:$C$1005,3,0)))","v":""},null,null,""]
["","","",null,{"$f":"IF(D33=\"\",\"\",(VLOOKUP(D33,'Membership #'!$A$1:$C$1005,2,0)))","v":""},{"$f":"IF(D33=\"\",\"\",(VLOOKUP(D33,'Membership #'!$A$1:$C$1005,3,0)))","v":""},null,null,""]
["","","",null,{"$f":"IF(D34=\"\",\"\",(VLOOKUP(D34,'Membership #'!$A$1:$C$1005,2,0)))","v":""},{"$f":"IF(D34=\"\",\"\",(VLOOKUP(D34,'Membership #'!$A$1:$C$1005,3,0)))","v":""},null,null,""]
["","","",null,{"$f":"IF(D35=\"\",\"\",(VLOOKUP(D35,'Membership #'!$A$1:$C$1005,2,0)))","v":""},{"$f":"IF(D35=\"\",\"\",(VLOOKUP(D35,'Membership #'!$A$1:$C$1005,3,0)))","v":""},null,null,""]
["","","",null,{"$f":"IF(D36=\"\",\"\",(VLOOKUP(D36,'Membership #'!$A$1:$C$1005,2,0)))","v":""},{"$f":"IF(D36=\"\",\"\",(VLOOKUP(D36,'Membership #'!$A$1:$C$1005,3,0)))","v":""},null,null,{"$f":"IF(G36=\"n\",\"No Time\",IF(G36=\"x\",\"Scratch\",IF(G36<>\"\",SUM(G36+H36),\"\")))","v":""}]
["","","",null,{"$f":"IF(D37=\"\",\"\",(VLOOKUP(D37,'Membership #'!$A$1:$C$1005,2,0)))","v":""},{"$f":"IF(D37=\"\",\"\",(VLOOKUP(D37,'Membership #'!$A$1:$C$1005,3,0)))","v":""},null,null,""]
["","","",null,{"$f":"IF(D38=\"\",\"\",(VLOOKUP(D38,'Membership #'!$A$1:$C$1005,2,0)))","v":""},{"$f":"IF(D38=\"\",\"\",(VLOOKUP(D38,'Membership #'!$A$1:$C$1005,3,0)))","v":""},null,null,""]
["","","",null,{"$f":"IF(D39=\"\",\"\",(VLOOKUP(D39,'Membership #'!$A$1:$C$1005,2,0)))","v":""},{"$f":"IF(D39=\"\",\"\",(VLOOKUP(D39,'Membership #'!$A$1:$C$1005,3,0)))","v":""},null,null,""]
["","","",null,{"$f":"IF(D40=\"\",\"\",(VLOOKUP(D40,'Membership #'!$A$1:$C$1005,2,0)))","v":""},{"$f":"IF(D40=\"\",\"\",(VLOOKUP(D40,'Membership #'!$A$1:$C$1005,3,0)))","v":""},null,null,""]
["","","",null,{"$f":"IF(D41=\"\",\"\",(VLOOKUP(D41,'Membership #'!$A$1:$C$1005,2,0)))","v":""},{"$f":"IF(D41=\"\",\"\",(VLOOKUP(D41,'Membership #'!$A$1:$C$1005,3,0)))","v":""},null,null,""]
["","","",null,{"$f":"IF(D42=\"\",\"\",(VLOOKUP(D42,'Membership #'!$A$1:$C$1005,2,0)))","v":""},{"$f":"IF(D42=\"\",\"\",(VLOOKUP(D42,'Membership #'!$A$1:$C$1005,3,0)))","v":""},null,null,""]
["","","",null,{"$f":"IF(D43=\"\",\"\",(VLOOKUP(D43,'Membership #'!$A$1:$C$1005,2,0)))","v":""},{"$f":"IF(D43=\"\",\"\",(VLOOKUP(D43,'Membership #'!$A$1:$C$1005,3,0)))","v":""},null,null,""]
["","","",null,{"$f":"IF(D44=\"\",\"\",(VLOOKUP(D44,'Membership #'!$A$1:$C$1005,2,0)))","v":""},{"$f":"IF(D44=\"\",\"\",(VLOOKUP(D44,'Membership #'!$A$1:$C$1005,3,0)))","v":""},null,null,""]
["","","",null,{"$f":"IF(D45=\"\",\"\",(VLOOKUP(D45,'Membership #'!$A$1:$C$1005,2,0)))","v":""},{"$f":"IF(D45=\"\",\"\",(VLOOKUP(D45,'Membership #'!$A$1:$C$1005,3,0)))","v":""},null,null,""]
["","","",null,{"$f":"IF(D46=\"\",\"\",(VLOOKUP(D46,'Membership #'!$A$1:$C$1005,2,0)))","v":""},{"$f":"IF(D46=\"\",\"\",(VLOOKUP(D46,'Membership #'!$A$1:$C$1005,3,0)))","v":""},null,null,""]
["","","",null,{"$f":"IF(D47=\"\",\"\",(VLOOKUP(D47,'Membership #'!$A$1:$C$1005,2,0)))","v":""},{"$f":"IF(D47=\"\",\"\",(VLOOKUP(D47,'Membership #'!$A$1:$C$1005,3,0)))","v":""},null,null,""]
["","","",null,{"$f":"IF(D48=\"\",\"\",(VLOOKUP(D48,'Membership #'!$A$1:$C$1005,2,0)))","v":""},{"$f":"IF(D48=\"\",\"\",(VLOOKUP(D48,'Membership #'!$A$1:$C$1005,3,0)))","v":""},null,null,""]
["","","",null,{"$f":"IF(D49=\"\",\"\",(VLOOKUP(D49,'Membership #'!$A$1:$C$1005,2,0)))","v":""},{"$f":"IF(D49=\"\",\"\",(VLOOKUP(D49,'Membership #'!$A$1:$C$1005,3,0)))","v":""},null,null,""]
["","","",null,{"$f":"IF(D50=\"\",\"\",(VLOOKUP(D50,'Membership #'!$A$1:$C$1005,2,0)))","v":""},{"$f":"IF(D50=\"\",\"\",(VLOOKUP(D50,'Membership #'!$A$1:$C$1005,3,0)))","v":""},null,null,""]
["","","",null,{"$f":"IF(D51=\"\",\"\",(VLOOKUP(D51,'Membership #'!$A$1:$C$1005,2,0)))","v":""},{"$f":"IF(D51=\"\",\"\",(VLOOKUP(D51,'Membership #'!$A$1:$C$1005,3,0)))","v":""},null,null,""]
["","","",null,{"$f":"IF(D52=\"\",\"\",(VLOOKUP(D52,'Membership #'!$A$1:$C$1005,2,0)))","v":""},{"$f":"IF(D52=\"\",\"\",(VLOOKUP(D52,'Membership #'!$A$1:$C$1005,3,0)))","v":""},null,null,""]
["","","",null,{"$f":"IF(D53=\"\",\"\",(VLOOKUP(D53,'Membership #'!$A$1:$C$1005,2,0)))","v":""},{"$f":"IF(D53=\"\",\"\",(VLOOKUP(D53,'Membership #'!$A$1:$C$1005,3,0)))","v":""},null,null,""]
["","","",null,{"$f":"IF(D54=\"\",\"\",(VLOOKUP(D54,'Membership #'!$A$1:$C$1005,2,0)))","v":""},{"$f":"IF(D54=\"\",\"\",(VLOOKUP(D54,'Membership #'!$A$1:$C$1005,3,0)))","v":""},null,null,""]
["","","",null,{"$f":"IF(D55=\"\",\"\",(VLOOKUP(D55,'Membership #'!$A$1:$C$1005,2,0)))","v":""},{"$f":"IF(D55=\"\",\"\",(VLOOKUP(D55,'Membership #'!$A$1:$C$1005,3,0)))","v":""},null,null,""]
["","","",null,{"$f":"IF(D56=\"\",\"\",(VLOOKUP(D56,'Membership #'!$A$1:$C$1005,2,0)))","v":""},{"$f":"IF(D56=\"\",\"\",(VLOOKUP(D56,'Membership #'!$A$1:$C$1005,3,0)))","v":""},null,null,""]
["","","",null,{"$f":"IF(D57=\"\",\"\",(VLOOKUP(D57,'Membership #'!$A$1:$C$1005,2,0)))","v":""},{"$f":"IF(D57=\"\",\"\",(VLOOKUP(D57,'Membership #'!$A$1:$C$1005,3,0)))","v":""},null,null,""]
["","","",null,{"$f":"IF(D58=\"\",\"\",(VLOOKUP(D58,'Membership #'!$A$1:$C$1005,2,0)))","v":""},{"$f":"IF(D58=\"\",\"\",(VLOOKUP(D58,'Membership #'!$A$1:$C$1005,3,0)))","v":""},null,null,""]
["","","",null,{"$f":"IF(D59=\"\",\"\",(VLOOKUP(D59,'Membership #'!$A$1:$C$1005,2,0)))","v":""},{"$f":"IF(D59=\"\",\"\",(VLOOKUP(D59,'Membership #'!$A$1:$C$1005,3,0)))","v":""},null,null,""]
["","","",null,{"$f":"IF(D60=\"\",\"\",(VLOOKUP(D60,'Membership #'!$A$1:$C$1005,2,0)))","v":""},{"$f":"IF(D60=\"\",\"\",(VLOOKUP(D60,'Membership #'!$A$1:$C$1005,3,0)))","v":""},null,null,""]
["","","",null,{"$f":"IF(D61=\"\",\"\",(VLOOKUP(D61,'Membership #'!$A$1:$C$1005,2,0)))","v":""},{"$f":"IF(D61=\"\",\"\",(VLOOKUP(D61,'Membership #'!$A$1:$C$1005,3,0)))","v":""},null,null,""]
["","","",null,{"$f":"IF(D62=\"\",\"\",(VLOOKUP(D62,'Membership #'!$A$1:$C$1005,2,0)))","v":""},{"$f":"IF(D62=\"\",\"\",(VLOOKUP(D62,'Membership #'!$A$1:$C$1005,3,0)))","v":""},null,null,""]
["","","",null,{"$f":"IF(D63=\"\",\"\",(VLOOKUP(D63,'Membership #'!$A$1:$C$1005,2,0)))","v":""},{"$f":"IF(D63=\"\",\"\",(VLOOKUP(D63,'Membership #'!$A$1:$C$1005,3,0)))","v":""},null,null,""]
["","","",null,{"$f":"IF(D64=\"\",\"\",(VLOOKUP(D64,'Membership #'!$A$1:$C$1005,2,0)))","v":""},{"$f":"IF(D64=\"\",\"\",(VLOOKUP(D64,'Membership #'!$A$1:$C$1005,3,0)))","v":""},null,null,""]
["","","",null,{"$f":"IF(D65=\"\",\"\",(VLOOKUP(D65,'Membership #'!$A$1:$C$1005,2,0)))","v":""},{"$f":"IF(D65=\"\",\"\",(VLOOKUP(D65,'Membership #'!$A$1:$C$1005,3,0)))","v":""},null,null,""]
["","","",null,{"$f":"IF(D66=\"\",\"\",(VLOOKUP(D66,'Membership #'!$A$1:$C$1005,2,0)))","v":""},{"$f":"IF(D66=\"\",\"\",(VLOOKUP(D66,'Membership #'!$A$1:$C$1005,3,0)))","v":""},null,null,""]
["","","",null,{"$f":"IF(D67=\"\",\"\",(VLOOKUP(D67,'Membership #'!$A$1:$C$1005,2,0)))","v":""},{"$f":"IF(D67=\"\",\"\",(VLOOKUP(D67,'Membership #'!$A$1:$C$1005,3,0)))","v":""},null,null,""]
["","","",null,{"$f":"IF(D68=\"\",\"\",(VLOOKUP(D68,'Membership #'!$A$1:$C$1005,2,0)))","v":""},{"$f":"IF(D68=\"\",\"\",(VLOOKUP(D68,'Membership #'!$A$1:$C$1005,3,0)))","v":""},null,null,""]
["","","",null,{"$f":"IF(D69=\"\",\"\",(VLOOKUP(D69,'Membership #'!$A$1:$C$1005,2,0)))","v":""},{"$f":"IF(D69=\"\",\"\",(VLOOKUP(D69,'Membership #'!$A$1:$C$1005,3,0)))","v":""},null,null,""]
["","","",null,{"$f":"IF(D70=\"\",\"\",(VLOOKUP(D70,'Membership #'!$A$1:$C$1005,2,0)))","v":""},{"$f":"IF(D70=\"\",\"\",(VLOOKUP(D70,'Membership #'!$A$1:$C$1005,3,0)))","v":""},null,null,""]
["","","",null,{"$f":"IF(D71=\"\",\"\",(VLOOKUP(D71,'Membership #'!$A$1:$C$1005,2,0)))","v":""},{"$f":"IF(D71=\"\",\"\",(VLOOKUP(D71,'Membership #'!$A$1:$C$1005,3,0)))","v":""},null,null,""]
["","","",null,{"$f":"IF(D72=\"\",\"\",(VLOOKUP(D72,'Membership #'!$A$1:$C$1005,2,0)))","v":""},{"$f":"IF(D72=\"\",\"\",(VLOOKUP(D72,'Membership #'!$A$1:$C$1005,3,0)))","v":""},null,null,{"$f":"IF(G72=\"n\",\"No Time\",IF(G72=\"x\",\"Scratch\",IF(G72<>\"\",SUM(G72+H72),\"\")))","v":""}]
[{"$f":"IF(D73<>\"\",RAND(),\"\")","v":""},{"$f":"IF(D73<>\"\",RANK(A73,A$8:A$100),\"\")","v":""},"",null,{"$f":"IF(D73=\"\",\"\",(VLOOKUP(D73,'Membership #'!$A$1:$C$1005,2,0)))","v":""},{"$f":"IF(D73=\"\",\"\",(VLOOKUP(D73,'Membership #'!$A$1:$C$1005,3,0)))","v":""},null,null,""]
["","","",null,{"$f":"IF(D74=\"\",\"\",(VLOOKUP(D74,'Membership #'!$A$1:$C$1005,2,0)))","v":""},{"$f":"IF(D74=\"\",\"\",(VLOOKUP(D74,'Membership #'!$A$1:$C$1005,3,0)))","v":""},null,null,""]
["","","",null,{"$f":"IF(D75=\"\",\"\",(VLOOKUP(D75,'Membership #'!$A$1:$C$1005,2,0)))","v":""},{"$f":"IF(D75=\"\",\"\",(VLOOKUP(D75,'Membership #'!$A$1:$C$1005,3,0)))","v":""},null,null,""]
["","","",null,{"$f":"IF(D76=\"\",\"\",(VLOOKUP(D76,'Membership #'!$A$1:$C$1005,2,0)))","v":""},{"$f":"IF(D76=\"\",\"\",(VLOOKUP(D76,'Membership #'!$A$1:$C$1005,3,0)))","v":""},null,null,""]
["","","",null,{"$f":"IF(D77=\"\",\"\",(VLOOKUP(D77,'Membership #'!$A$1:$C$1005,2,0)))","v":""},{"$f":"IF(D77=\"\",\"\",(VLOOKUP(D77,'Membership #'!$A$1:$C$1005,3,0)))","v":""},null,null,""]
["","","",null,{"$f":"IF(D78=\"\",\"\",(VLOOKUP(D78,'Membership #'!$A$1:$C$1005,2,0)))","v":""},{"$f":"IF(D78=\"\",\"\",(VLOOKUP(D78,'Membership #'!$A$1:$C$1005,3,0)))","v":""},null,null,""]
["","","",null,{"$f":"IF(D79=\"\",\"\",(VLOOKUP(D79,'Membership #'!$A$1:$C$1005,2,0)))","v":""},{"$f":"IF(D79=\"\",\"\",(VLOOKUP(D79,'Membership #'!$A$1:$C$1005,3,0)))","v":""},null,null,""]
["","","",null,{"$f":"IF(D80=\"\",\"\",(VLOOKUP(D80,'Membership #'!$A$1:$C$1005,2,0)))","v":""},{"$f":"IF(D80=\"\",\"\",(VLOOKUP(D80,'Membership #'!$A$1:$C$1005,3,0)))","v":""},null,null,""]
["","","",null,{"$f":"IF(D81=\"\",\"\",(VLOOKUP(D81,'Membership #'!$A$1:$C$1005,2,0)))","v":""},{"$f":"IF(D81=\"\",\"\",(VLOOKUP(D81,'Membership #'!$A$1:$C$1005,3,0)))","v":""},null,null,""]
["","","",null,{"$f":"IF(D82=\"\",\"\",(VLOOKUP(D82,'Membership #'!$A$1:$C$1005,2,0)))","v":""},{"$f":"IF(D82=\"\",\"\",(VLOOKUP(D82,'Membership #'!$A$1:$C$1005,3,0)))","v":""},null,null,""]
["","","",null,{"$f":"IF(D83=\"\",\"\",(VLOOKUP(D83,'Membership #'!$A$1:$C$1005,2,0)))","v":""},{"$f":"IF(D83=\"\",\"\",(VLOOKUP(D83,'Membership #'!$A$1:$C$1005,3,0)))","v":""},null,null,""]
["","","",null,{"$f":"IF(D84=\"\",\"\",(VLOOKUP(D84,'Membership #'!$A$1:$C$1005,2,0)))","v":""},{"$f":"IF(D84=\"\",\"\",(VLOOKUP(D84,'Membership #'!$A$1:$C$1005,3,0)))","v":""},null,null,""]
["","","",null,{"$f":"IF(D85=\"\",\"\",(VLOOKUP(D85,'Membership #'!$A$1:$C$1005,2,0)))","v":""},{"$f":"IF(D85=\"\",\"\",(VLOOKUP(D85,'Membership #'!$A$1:$C$1005,3,0)))","v":""},null,null,""]
["","","",null,{"$f":"IF(D86=\"\",\"\",(VLOOKUP(D86,'Membership #'!$A$1:$C$1005,2,0)))","v":""},{"$f":"IF(D86=\"\",\"\",(VLOOKUP(D86,'Membership #'!$A$1:$C$1005,3,0)))","v":""},null,null,""]
["","","",null,{"$f":"IF(D87=\"\",\"\",(VLOOKUP(D87,'Membership #'!$A$1:$C$1005,2,0)))","v":""},{"$f":"IF(D87=\"\",\"\",(VLOOKUP(D87,'Membership #'!$A$1:$C$1005,3,0)))","v":""},null,null,""]
["","","",null,{"$f":"IF(D88=\"\",\"\",(VLOOKUP(D88,'Membership #'!$A$1:$C$1005,2,0)))","v":""},{"$f":"IF(D88=\"\",\"\",(VLOOKUP(D88,'Membership #'!$A$1:$C$1005,3,0)))","v":""},null,null,""]
["","","",null,{"$f":"IF(D89=\"\",\"\",(VLOOKUP(D89,'Membership #'!$A$1:$C$1005,2,0)))","v":""},{"$f":"IF(D89=\"\",\"\",(VLOOKUP(D89,'Membership #'!$A$1:$C$1005,3,0)))","v":""},null,null,""]
["","","",null,{"$f":"IF(D90=\"\",\"\",(VLOOKUP(D90,'Membership #'!$A$1:$C$1005,2,0)))","v":""},{"$f":"IF(D90=\"\",\"\",(VLOOKUP(D90,'Membership #'!$A$1:$C$1005,3,0)))","v":""},null,null,""]
["","","",null,{"$f":"IF(D91=\"\",\"\",(VLOOKUP(D91,'Membership #'!$A$1:$C$1005,2,0)))","v":""},{"$f":"IF(D91=\"\",\"\",(VLOOKUP(D91,'Membership #'!$A$1:$C$1005,3,0)))","v":""},null,null,""]
["","","",null,{"$f":"IF(D92=\"\",\"\",(VLOOKUP(D92,'Membership #'!$A$1:$C$1005,2,0)))","v":""},{"$f":"IF(D92=\"\",\"\",(VLOOKUP(D92,'Membership #'!$A$1:$C$1005,3,0)))","v":""},null,null,""]
["","","",null,{"$f":"IF(D93=\"\",\"\",(VLOOKUP(D93,'Membership #'!$A$1:$C$1005,2,0)))","v":""},{"$f":"IF(D93=\"\",\"\",(VLOOKUP(D93,'Membership #'!$A$1:$C$1005,3,0)))","v":""},null,null,""]
["","","",null,{"$f":"IF(D94=\"\",\"\",(VLOOKUP(D94,'Membership #'!$A$1:$C$1005,2,0)))","v":""},{"$f":"IF(D94=\"\",\"\",(VLOOKUP(D94,'Membership #'!$A$1:$C$1005,3,0)))","v":""},null,null,""]
["","","",null,{"$f":"IF(D95=\"\",\"\",(VLOOKUP(D95,'Membership #'!$A$1:$C$1005,2,0)))","v":""},{"$f":"IF(D95=\"\",\"\",(VLOOKUP(D95,'Membership #'!$A$1:$C$1005,3,0)))","v":""},null,null,""]
["","","",null,{"$f":"IF(D96=\"\",\"\",(VLOOKUP(D96,'Membership #'!$A$1:$C$1005,2,0)))","v":""},{"$f":"IF(D96=\"\",\"\",(VLOOKUP(D96,'Membership #'!$A$1:$C$1005,3,0)))","v":""},null,null,""]
["","","",null,{"$f":"IF(D97=\"\",\"\",(VLOOKUP(D97,'Membership #'!$A$1:$C$1005,2,0)))","v":""},{"$f":"IF(D97=\"\",\"\",(VLOOKUP(D97,'Membership #'!$A$1:$C$1005,3,0)))","v":""},null,null,""]
["","","",null,{"$f":"IF(D98=\"\",\"\",(VLOOKUP(D98,'Membership #'!$A$1:$C$1005,2,0)))","v":""},{"$f":"IF(D98=\"\",\"\",(VLOOKUP(D98,'Membership #'!$A$1:$C$1005,3,0)))","v":""},null,null,""]
["","","",null,{"$f":"IF(D99=\"\",\"\",(VLOOKUP(D99,'Membership #'!$A$1:$C$1005,2,0)))","v":""},{"$f":"IF(D99=\"\",\"\",(VLOOKUP(D99,'Membership #'!$A$1:$C$1005,3,0)))","v":""},null,null,""]
["","","",null,{"$f":"IF(D100=\"\",\"\",(VLOOKUP(D100,'Membership #'!$A$1:$C$1005,2,0)))","v":""},{"$f":"IF(D100=\"\",\"\",(VLOOKUP(D100,'Membership #'!$A$1:$C$1005,3,0)))","v":""},null,null,""]

{"sheet":"NOVICE BARRELS","index":12,"n_rows":100,"n_cols":26,"rows_kept":100,"cut":false,"hidden":false,"merged":[[5,12,5,15],[0,0,0,10],[1,0,1,10],[2,0,2,3],[2,6,2,10],[3,0,6,0],[3,1,6,1],[3,2,6,2],[3,3,6,3],[3,4,6,4],[3,9,6,9],[3,10,6,10],[3,5,6,5],[3,6,6,6],[3,7,6,7],[3,8,6,8]]}
["Tom Burt & Mark McGuire Memorial Jackpot Aug 22, 2021",null,null,null,null,null,null,null,null,null,null,null,"x=Scratch"]
["NOVICE BARRELS",null,null,null,null,null,null,null,null,null,null,null,"n=No Time"]
["# Enteries:",null,null,null,{"$f":"COUNTIF($D$8:$D$99,\">0\")","v":26},null,null,null,null,null,null,null,null,null,null,null,null,"Don't Erase these numbers below!!"]
["Rand Draw","Seed","Running Order","RING #      ","NAME","HORSE NAME","TIME","PENALTY ","TOTAL","PLACINGS","POINTS",null,null,null,null,null,null,{"$f":"IF(N9=2,7,IF(N9=3,6,IF(N9=4,5,IF(N9=5,4,IF(AND(N9>5,N11>600),3,IF(AND(N9>5,N11<600,N11>299.99),2,IF(AND(N9>5,N11<300),1,8)))))))","v":1},1,2,3,4,5,6,7,8]
[null,null,null,null,null,null,null,null,null,null,null,null,null,null,null,null,null,null,299,"$300-","$600 -"]
[null,null,null,null,null,null,null,null,null,null,null,null,"NOVICE BARRELS",null,null,null,null,null,"or less",599,"More","5 Entries","4 Entries","3 Entries","2 Entries"]
[null,null,null,null,null,null,null,null,null,null,null,null,null,null,null,null,null,"1st",0.32,0.27,0.24,0.35,0.4,0.46,0.6]
[{"$f":"IF(D8<>\"\",RAND(),\"\")","v":0.99285752400011218},{"$f":"IF(D8<>\"\",RANK(A8,A$8:A$100),\"\")","v":1},1,918,{"$f":"IF(D8=\"\",\"\",(VLOOKUP(D8,'Membership #'!$A$1:$C$1005,2,0)))","v":"Keira Rose"},{"$f":"IF(D8=\"\",\"\",(VLOOKUP(D8,'Membership #'!$A$1:$C$1005,3,0)))","v":"LL Its All About Red"},15.471,null,{"$f":"IF(G8=\"n\",\"No Time\",IF(G8=\"x\",\"Scratch\",IF(G8<>\"\",SUM(G8+H8),\"\")))","v":15.471},null,null,null,"Added",75,null,null,null,"2nd",0.23,0.22,0.19,0.25,0.28000000000000003,0.34,0.4]
[{"$f":"IF(D9<>\"\",RAND(),\"\")","v":0.95409932434470268},3,2,652,{"$f":"IF(D9=\"\",\"\",(VLOOKUP(D9,'Membership #'!$A$1:$C$1005,2,0)))","v":"Molly O'Grady"},{"$f":"IF(D9=\"\",\"\",(VLOOKUP(D9,'Membership #'!$A$1:$C$1005,3,0)))","v":"Teelano's Twister"},15.848000000000001,null,15.848000000000001,null,null,null,"Entries",25,null,10,"per head","3rd",0.15,0.18,0.16,0.17,0.18,0.2]
[0.85287835737663875,5,3,914,{"$f":"IF(D10=\"\",\"\",(VLOOKUP(D10,'Membership #'!$A$1:$C$1005,2,0)))","v":"Shelby MacPherson"},{"$f":"IF(D10=\"\",\"\",(VLOOKUP(D10,'Membership #'!$A$1:$C$1005,3,0)))","v":"Shelbys Badger Bar"},16.047000000000001,null,16.047000000000001,null,null,null,"Jackpot",{"$f":"P9*N9","v":250},null,0.85,"payback","4th",0.12,0.13,0.13,0.13,0.14000000000000001]
[0.99148436423283115,2,4,699,{"$f":"IF(D11=\"\",\"\",(VLOOKUP(D11,'Membership #'!$A$1:$C$1005,2,0)))","v":"Laura Morrison"},{"$f":"IF(D11=\"\",\"\",(VLOOKUP(D11,'Membership #'!$A$1:$C$1005,3,0)))","v":"MDC Dark Revelation"},16.079999999999998,null,16.079999999999998,null,null,null,"Total Money",{"$f":"N8+(N10*P10)","v":287.5},null,{"$f":"N10*P10","v":212.5},"Jackpot","5th",0.1,0.09,0.08,0.1]
[0.35018954566822957,18,5,904,{"$f":"IF(D12=\"\",\"\",(VLOOKUP(D12,'Membership #'!$A$1:$C$1005,2,0)))","v":"Ella Cowley"},{"$f":"IF(D12=\"\",\"\",(VLOOKUP(D12,'Membership #'!$A$1:$C$1005,3,0)))","v":"Blazin Boots"},16.372,null,16.372,null,null,null,null,"Percentage","Money","Ring #",null,"6th",0.08,0.06,0.06]
[0.76702736404808258,9,6,655,{"$f":"IF(D13=\"\",\"\",(VLOOKUP(D13,'Membership #'!$A$1:$C$1005,2,0)))","v":"Julia Parker"},{"$f":"IF(D13=\"\",\"\",(VLOOKUP(D13,'Membership #'!$A$1:$C$1005,3,0)))","v":"Boons Feature Star"},16.655999999999999,null,16.655999999999999,null,null,null,"1st",{"$f":"HLOOKUP($R$4,$S$4:$Z$17,4,0)","v":0.32},{"$f":"IF(N13<>0,N$11*N13,\"\")","v":92},null,{"$f":"IF(P13=\"\",\"\",(VLOOKUP(P13,'Membership #'!$A$1:$C$1005,2,0)))","v":""},"7th",null,0.03,0.05]
[0.26182044964931506,20,7,518,{"$f":"IF(D14=\"\",\"\",(VLOOKUP(D14,'Membership #'!$A$1:$C$1005,2,0)))","v":"Sylvester Weatherbie"},{"$f":"IF(D14=\"\",\"\",(VLOOKUP(D14,'Membership #'!$A$1:$C$1005,3,0)))","v":"J.R."},16.681000000000001,null,16.681000000000001,null,null,null,"2nd",{"$f":"HLOOKUP($R$4,$S$4:$Z$17,5,0)","v":0.23},66.125,null,{"$f":"IF(P14=\"\",\"\",(VLOOKUP(P14,'Membership #'!$A$1:$C$1005,2,0)))","v":""},"8th",null,0.02,0.04]
[0.65129896674253152,12,8,966,{"$f":"IF(D15=\"\",\"\",(VLOOKUP(D15,'Membership #'!$A$1:$C$1005,2,0)))","v":"Ava Anderson"},{"$f":"IF(D15=\"\",\"\",(VLOOKUP(D15,'Membership #'!$A$1:$C$1005,3,0)))","v":"Black Sass"},16.753,null,16.753,null,null,null,"3rd",{"$f":"HLOOKUP($R$4,$S$4:$Z$17,6,0)","v":0.15},43.125,null,{"$f":"IF(P15=\"\",\"\",(VLOOKUP(P15,'Membership #'!$A$1:$C$1005,2,0)))","v":""},"9th",null,null,0.03]
[0.50153269690646918,14,9,732,{"$f":"IF(D16=\"\",\"\",(VLOOKUP(D16,'Membership #'!$A$1:$C$1005,2,0)))","v":"Brenna Carrigan"},{"$f":"IF(D16=\"\",\"\",(VLOOKUP(D16,'Membership #'!$A$1:$C$1005,3,0)))","v":"Carlos"},16.818000000000001,null,16.818000000000001,null,null,null,"4th",{"$f":"HLOOKUP($R$4,$S$4:$Z$17,7,0)","v":0.12},34.5,null,{"$f":"IF(P16=\"\",\"\",(VLOOKUP(P16,'Membership #'!$A$1:$C$1005,2,0)))","v":""},"10th",null,null,0.02]
[7.9137492569226309E-2,25,10,855,{"$f":"IF(D17=\"\",\"\",(VLOOKUP(D17,'Membership #'!$A$1:$C$1005,2,0)))","v":"Jenelle Collier"},{"$f":"IF(D17=\"\",\"\",(VLOOKUP(D17,'Membership #'!$A$1:$C$1005,3,0)))","v":"Peppy Sans Surprise"},16.890999999999998,null,16.890999999999998,null,null,null,"5th",{"$f":"HLOOKUP($R$4,$S$4:$Z$17,8,0)","v":0.1},28.75,null,{"$f":"IF(P17=\"\",\"\",(VLOOKUP(P17,'Membership #'!$A$1:$C$1005,2,0)))","v":""}]
[0.7951576499103401,8,11,591,{"$f":"IF(D18=\"\",\"\",(VLOOKUP(D18,'Membership #'!$A$1:$C$1005,2,0)))","v":"Wendy MacLean"},{"$f":"IF(D18=\"\",\"\",(VLOOKUP(D18,'Membership #'!$A$1:$C$1005,3,0)))","v":"White Sox N Flyin"},17.056999999999999,null,17.056999999999999,null,null,null,"6th",{"$f":"HLOOKUP($R$4,$S$4:$Z$17,9,0)","v":0.08},23,null,{"$f":"IF(P18=\"\",\"\",(VLOOKUP(P18,'Membership #'!$A$1:$C$1005,2,0)))","v":""}]
[0.22932336868664871,21,12,909,{"$f":"IF(D19=\"\",\"\",(VLOOKUP(D19,'Membership #'!$A$1:$C$1005,2,0)))","v":"Rebecca Gillis"},{"$f":"IF(D19=\"\",\"\",(VLOOKUP(D19,'Membership #'!$A$1:$C$1005,3,0)))","v":"Martha's Tivio Moon"},17.123999999999999,null,17.123999999999999,null,null,null,"7th",{"$f":"HLOOKUP($R$4,$S$4:$Z$17,10,0)","v":0},"",null,{"$f":"IF(P19=\"\",\"\",(VLOOKUP(P19,'Membership #'!$A$1:$C$1005,2,0)))","v":""}]
[0.76104180520147713,10,13,600,{"$f":"IF(D20=\"\",\"\",(VLOOKUP(D20,'Membership #'!$A$1:$C$1005,2,0)))","v":"Stan Brown"},{"$f":"IF(D20=\"\",\"\",(VLOOKUP(D20,'Membership #'!$A$1:$C$1005,3,0)))","v":"A Perty Sure Thing"},17.535,null,17.535,null,null,null,"8th",{"$f":"HLOOKUP($R$4,$S$4:$Z$17,11,0)","v":0},"",null,{"$f":"IF(P20=\"\",\"\",(VLOOKUP(P20,'Membership #'!$A$1:$C$1005,2,0)))","v":""}]
[0.5444906714179214,13,14,753,{"$f":"IF(D21=\"\",\"\",(VLOOKUP(D21,'Membership #'!$A$1:$C$1005,2,0)))","v":"Kayla Boudreau"},{"$f":"IF(D21=\"\",\"\",(VLOOKUP(D21,'Membership #'!$A$1:$C$1005,3,0)))","v":"Lady Jane"},17.611999999999998,null,17.611999999999998,null,null,null,"9th",{"$f":"HLOOKUP($R$4,$S$4:$Z$17,12,0)","v":0},"",null,{"$f":"IF(P21=\"\",\"\",(VLOOKUP(P21,'Membership #'!$A$1:$C$1005,2,0)))","v":""}]
[0.6636433602390871,11,15,954,{"$f":"IF(D22=\"\",\"\",(VLOOKUP(D22,'Membership #'!$A$1:$C$1005,2,0)))","v":"Scotia MacEachern"},{"$f":"IF(D22=\"\",\"\",(VLOOKUP(D22,'Membership #'!$A$1:$C$1005,3,0)))","v":"Hick-a-Licious"},17.739000000000001,null,17.739000000000001,null,null,null,"10th",{"$f":"HLOOKUP($R$4,$S$4:$Z$17,13,0)","v":0},"",null,{"$f":"IF(P22=\"\",\"\",(VLOOKUP(P22,'Membership #'!$A$1:$C$1005,2,0)))","v":""}]
[0.38900491535636217,16,16,716,{"$f":"IF(D23=\"\",\"\",(VLOOKUP(D23,'Membership #'!$A$1:$C$1005,2,0)))","v":"Kayla Martin"},{"$f":"IF(D23=\"\",\"\",(VLOOKUP(D23,'Membership #'!$A$1:$C$1005,3,0)))","v":"Dash Ta Home"},18.166,null,18.166,null,null,null,"Total Money",null,{"$f":"SUM(O13:O22)","v":287.5}]
[0.10853606234236868,23,17,973,{"$f":"IF(D24=\"\",\"\",(VLOOKUP(D24,'Membership #'!$A$1:$C$1005,2,0)))","v":"Sara Ivey"},{"$f":"IF(D24=\"\",\"\",(VLOOKUP(D24,'Membership #'!$A$1:$C$1005,3,0)))","v":"Ms Heavenly Gator"},19,null,19]
[8.395076849174743E-2,24,18,971,{"$f":"IF(D25=\"\",\"\",(VLOOKUP(D25,'Membership #'!$A$1:$C$1005,2,0)))","v":"Arielle Burke"},{"$f":"IF(D25=\"\",\"\",(VLOOKUP(D25,'Membership #'!$A$1:$C$1005,3,0)))","v":"Elm Sally"},22.838999999999999,null,22.838999999999999]
[0.1781058243206346,22,19,768,{"$f":"IF(D26=\"\",\"\",(VLOOKUP(D26,'Membership #'!$A$1:$C$1005,2,0)))","v":"Tracey Higgins"},{"$f":"IF(D26=\"\",\"\",(VLOOKUP(D26,'Membership #'!$A$1:$C$1005,3,0)))","v":"Iza Wicked Wind"},18.067,5,23.067]
[3.1554766261363665E-2,26,20,746,{"$f":"IF(D27=\"\",\"\",(VLOOKUP(D27,'Membership #'!$A$1:$C$1005,2,0)))","v":"Cassie MacDonald"},{"$f":"IF(D27=\"\",\"\",(VLOOKUP(D27,'Membership #'!$A$1:$C$1005,3,0)))","v":"Sandy Dew"},23.545999999999999,null,23.545999999999999]
[0.30682759519313707,19,21,514,{"$f":"IF(D28=\"\",\"\",(VLOOKUP(D28,'Membership #'!$A$1:$C$1005,2,0)))","v":"Heather Morrison"},{"$f":"IF(D28=\"\",\"\",(VLOOKUP(D28,'Membership #'!$A$1:$C$1005,3,0)))","v":"Black Fire Dash"},"n",null,"No Time"]
[0.80320804742152563,7,22,537,{"$f":"IF(D29=\"\",\"\",(VLOOKUP(D29,'Membership #'!$A$1:$C$1005,2,0)))","v":"Alka Virick"},{"$f":"IF(D29=\"\",\"\",(VLOOKUP(D29,'Membership #'!$A$1:$C$1005,3,0)))","v":"Corona Identity"},"n",null,"No Time"]
[0.88162332215195671,4,23,968,{"$f":"IF(D30=\"\",\"\",(VLOOKUP(D30,'Membership #'!$A$1:$C$1005,2,0)))","v":"Madison Pelly"},{"$f":"IF(D30=\"\",\"\",(VLOOKUP(D30,'Membership #'!$A$1:$C$1005,3,0)))","v":"Westin"},"x",null,"Scratch"]
[0.39346747087275646,15,24,889,{"$f":"IF(D31=\"\",\"\",(VLOOKUP(D31,'Membership #'!$A$1:$C$1005,2,0)))","v":"Adelaine Cowley"},{"$f":"IF(D31=\"\",\"\",(VLOOKUP(D31,'Membership #'!$A$1:$C$1005,3,0)))","v":"Frenchman's Promise"},"x",null,"Scratch"]
[0.81690799131425307,6,25,78,{"$f":"IF(D32=\"\",\"\",(VLOOKUP(D32,'Membership #'!$A$1:$C$1005,2,0)))","v":"Stephanie Rich"},{"$f":"IF(D32=\"\",\"\",(VLOOKUP(D32,'Membership #'!$A$1:$C$1005,3,0)))","v":"Texas Mickey"},"x",null,"Scratch"]
[0.35298293572988804,17,"",928,{"$f":"IF(D33=\"\",\"\",(VLOOKUP(D33,'Membership #'!$A$1:$C$1005,2,0)))","v":"Tessa Dicks"},{"$f":"IF(D33=\"\",\"\",(VLOOKUP(D33,'Membership #'!$A$1:$C$1005,3,0)))","v":"ELM Dash of Crime"},"Out of novice",null,{"$error":"#VALUE!"}]
["","","",null,{"$f":"IF(D34=\"\",\"\",(VLOOKUP(D34,'Membership #'!$A$1:$C$1005,2,0)))","v":""},{"$f":"IF(D34=\"\",\"\",(VLOOKUP(D34,'Membership #'!$A$1:$C$1005,3,0)))","v":""},null,null,{"$f":"IF(G34=\"n\",\"No Time\",IF(G34=\"x\",\"Scratch\",IF(G34<>\"\",SUM(G34+H34),\"\")))","v":""}]
["","","",null,{"$f":"IF(D35=\"\",\"\",(VLOOKUP(D35,'Membership #'!$A$1:$C$1005,2,0)))","v":""},{"$f":"IF(D35=\"\",\"\",(VLOOKUP(D35,'Membership #'!$A$1:$C$1005,3,0)))","v":""},null,null,""]
["","","",null,{"$f":"IF(D36=\"\",\"\",(VLOOKUP(D36,'Membership #'!$A$1:$C$1005,2,0)))","v":""},{"$f":"IF(D36=\"\",\"\",(VLOOKUP(D36,'Membership #'!$A$1:$C$1005,3,0)))","v":""},null,null,""]
["","","",null,{"$f":"IF(D37=\"\",\"\",(VLOOKUP(D37,'Membership #'!$A$1:$C$1005,2,0)))","v":""},{"$f":"IF(D37=\"\",\"\",(VLOOKUP(D37,'Membership #'!$A$1:$C$1005,3,0)))","v":""},null,null,""]
["","","",null,{"$f":"IF(D38=\"\",\"\",(VLOOKUP(D38,'Membership #'!$A$1:$C$1005,2,0)))","v":""},{"$f":"IF(D38=\"\",\"\",(VLOOKUP(D38,'Membership #'!$A$1:$C$1005,3,0)))","v":""},null,null,""]
["","","",null,{"$f":"IF(D39=\"\",\"\",(VLOOKUP(D39,'Membership #'!$A$1:$C$1005,2,0)))","v":""},{"$f":"IF(D39=\"\",\"\",(VLOOKUP(D39,'Membership #'!$A$1:$C$1005,3,0)))","v":""},null,null,""]
["",{"$f":"IF(D40<>\"\",RANK(A40,A$8:A$100),\"\")","v":""},"",null,{"$f":"IF(D40=\"\",\"\",(VLOOKUP(D40,'Membership #'!$A$1:$C$1005,2,0)))","v":""},{"$f":"IF(D40=\"\",\"\",(VLOOKUP(D40,'Membership #'!$A$1:$C$1005,3,0)))","v":""},null,null,""]
["","","",null,{"$f":"IF(D41=\"\",\"\",(VLOOKUP(D41,'Membership #'!$A$1:$C$1005,2,0)))","v":""},{"$f":"IF(D41=\"\",\"\",(VLOOKUP(D41,'Membership #'!$A$1:$C$1005,3,0)))","v":""},null,null,""]
["","","",null,{"$f":"IF(D42=\"\",\"\",(VLOOKUP(D42,'Membership #'!$A$1:$C$1005,2,0)))","v":""},{"$f":"IF(D42=\"\",\"\",(VLOOKUP(D42,'Membership #'!$A$1:$C$1005,3,0)))","v":""},null,null,""]
["","","",null,{"$f":"IF(D43=\"\",\"\",(VLOOKUP(D43,'Membership #'!$A$1:$C$1005,2,0)))","v":""},{"$f":"IF(D43=\"\",\"\",(VLOOKUP(D43,'Membership #'!$A$1:$C$1005,3,0)))","v":""},null,null,""]
["","","",null,{"$f":"IF(D44=\"\",\"\",(VLOOKUP(D44,'Membership #'!$A$1:$C$1005,2,0)))","v":""},{"$f":"IF(D44=\"\",\"\",(VLOOKUP(D44,'Membership #'!$A$1:$C$1005,3,0)))","v":""},null,null,""]
["","","",null,{"$f":"IF(D45=\"\",\"\",(VLOOKUP(D45,'Membership #'!$A$1:$C$1005,2,0)))","v":""},{"$f":"IF(D45=\"\",\"\",(VLOOKUP(D45,'Membership #'!$A$1:$C$1005,3,0)))","v":""},null,null,""]
["","","",null,{"$f":"IF(D46=\"\",\"\",(VLOOKUP(D46,'Membership #'!$A$1:$C$1005,2,0)))","v":""},{"$f":"IF(D46=\"\",\"\",(VLOOKUP(D46,'Membership #'!$A$1:$C$1005,3,0)))","v":""},null,null,""]
["","","",null,{"$f":"IF(D47=\"\",\"\",(VLOOKUP(D47,'Membership #'!$A$1:$C$1005,2,0)))","v":""},{"$f":"IF(D47=\"\",\"\",(VLOOKUP(D47,'Membership #'!$A$1:$C$1005,3,0)))","v":""},null,null,{"$f":"IF(G47=\"n\",\"No Time\",IF(G47=\"x\",\"Scratch\",IF(G47<>\"\",SUM(G47+H47),\"\")))","v":""}]
["","","",null,{"$f":"IF(D48=\"\",\"\",(VLOOKUP(D48,'Membership #'!$A$1:$C$1005,2,0)))","v":""},{"$f":"IF(D48=\"\",\"\",(VLOOKUP(D48,'Membership #'!$A$1:$C$1005,3,0)))","v":""},null,null,""]
["","","",null,{"$f":"IF(D49=\"\",\"\",(VLOOKUP(D49,'Membership #'!$A$1:$C$1005,2,0)))","v":""},{"$f":"IF(D49=\"\",\"\",(VLOOKUP(D49,'Membership #'!$A$1:$C$1005,3,0)))","v":""},null,null,""]
["","","",null,{"$f":"IF(D50=\"\",\"\",(VLOOKUP(D50,'Membership #'!$A$1:$C$1005,2,0)))","v":""},{"$f":"IF(D50=\"\",\"\",(VLOOKUP(D50,'Membership #'!$A$1:$C$1005,3,0)))","v":""},null,null,""]
["","","",null,{"$f":"IF(D51=\"\",\"\",(VLOOKUP(D51,'Membership #'!$A$1:$C$1005,2,0)))","v":""},{"$f":"IF(D51=\"\",\"\",(VLOOKUP(D51,'Membership #'!$A$1:$C$1005,3,0)))","v":""},null,null,{"$f":"IF(G51=\"n\",\"No Time\",IF(G51=\"x\",\"Scratch\",IF(G51<>\"\",SUM(G51+H51),\"\")))","v":""}]
["","","",null,{"$f":"IF(D52=\"\",\"\",(VLOOKUP(D52,'Membership #'!$A$1:$C$1005,2,0)))","v":""},{"$f":"IF(D52=\"\",\"\",(VLOOKUP(D52,'Membership #'!$A$1:$C$1005,3,0)))","v":""},null,null,""]
["","","",null,{"$f":"IF(D53=\"\",\"\",(VLOOKUP(D53,'Membership #'!$A$1:$C$1005,2,0)))","v":""},{"$f":"IF(D53=\"\",\"\",(VLOOKUP(D53,'Membership #'!$A$1:$C$1005,3,0)))","v":""}]
["","","",null,{"$f":"IF(D54=\"\",\"\",(VLOOKUP(D54,'Membership #'!$A$1:$C$1005,2,0)))","v":""},{"$f":"IF(D54=\"\",\"\",(VLOOKUP(D54,'Membership #'!$A$1:$C$1005,3,0)))","v":""}]
["","","",null,{"$f":"IF(D55=\"\",\"\",(VLOOKUP(D55,'Membership #'!$A$1:$C$1005,2,0)))","v":""},{"$f":"IF(D55=\"\",\"\",(VLOOKUP(D55,'Membership #'!$A$1:$C$1005,3,0)))","v":""},null,null,{"$f":"IF(G55=\"n\",\"No Time\",IF(G55=\"x\",\"Scratch\",IF(G55<>\"\",SUM(G55+H55),\"\")))","v":""}]
["","","",null,{"$f":"IF(D56=\"\",\"\",(VLOOKUP(D56,'Membership #'!$A$1:$C$1005,2,0)))","v":""},{"$f":"IF(D56=\"\",\"\",(VLOOKUP(D56,'Membership #'!$A$1:$C$1005,3,0)))","v":""},null,null,""]
["","","",null,{"$f":"IF(D57=\"\",\"\",(VLOOKUP(D57,'Membership #'!$A$1:$C$1005,2,0)))","v":""},{"$f":"IF(D57=\"\",\"\",(VLOOKUP(D57,'Membership #'!$A$1:$C$1005,3,0)))","v":""},null,null,""]
["","","",null,{"$f":"IF(D58=\"\",\"\",(VLOOKUP(D58,'Membership #'!$A$1:$C$1005,2,0)))","v":""},{"$f":"IF(D58=\"\",\"\",(VLOOKUP(D58,'Membership #'!$A$1:$C$1005,3,0)))","v":""},null,null,""]
["","","",null,{"$f":"IF(D59=\"\",\"\",(VLOOKUP(D59,'Membership #'!$A$1:$C$1005,2,0)))","v":""},{"$f":"IF(D59=\"\",\"\",(VLOOKUP(D59,'Membership #'!$A$1:$C$1005,3,0)))","v":""},null,null,""]
["","","",null,{"$f":"IF(D60=\"\",\"\",(VLOOKUP(D60,'Membership #'!$A$1:$C$1005,2,0)))","v":""},{"$f":"IF(D60=\"\",\"\",(VLOOKUP(D60,'Membership #'!$A$1:$C$1005,3,0)))","v":""},null,null,""]
["","","",null,{"$f":"IF(D61=\"\",\"\",(VLOOKUP(D61,'Membership #'!$A$1:$C$1005,2,0)))","v":""},{"$f":"IF(D61=\"\",\"\",(VLOOKUP(D61,'Membership #'!$A$1:$C$1005,3,0)))","v":""},null,null,""]
["","","",null,{"$f":"IF(D62=\"\",\"\",(VLOOKUP(D62,'Membership #'!$A$1:$C$1005,2,0)))","v":""},{"$f":"IF(D62=\"\",\"\",(VLOOKUP(D62,'Membership #'!$A$1:$C$1005,3,0)))","v":""},null,null,""]
["","","",null,{"$f":"IF(D63=\"\",\"\",(VLOOKUP(D63,'Membership #'!$A$1:$C$1005,2,0)))","v":""},{"$f":"IF(D63=\"\",\"\",(VLOOKUP(D63,'Membership #'!$A$1:$C$1005,3,0)))","v":""},null,null,""]
["","","",null,{"$f":"IF(D64=\"\",\"\",(VLOOKUP(D64,'Membership #'!$A$1:$C$1005,2,0)))","v":""},{"$f":"IF(D64=\"\",\"\",(VLOOKUP(D64,'Membership #'!$A$1:$C$1005,3,0)))","v":""},null,null,""]
["","","",null,{"$f":"IF(D65=\"\",\"\",(VLOOKUP(D65,'Membership #'!$A$1:$C$1005,2,0)))","v":""},{"$f":"IF(D65=\"\",\"\",(VLOOKUP(D65,'Membership #'!$A$1:$C$1005,3,0)))","v":""},null,null,""]
["","","",null,{"$f":"IF(D66=\"\",\"\",(VLOOKUP(D66,'Membership #'!$A$1:$C$1005,2,0)))","v":""},{"$f":"IF(D66=\"\",\"\",(VLOOKUP(D66,'Membership #'!$A$1:$C$1005,3,0)))","v":""},null,null,""]
["","","",null,{"$f":"IF(D67=\"\",\"\",(VLOOKUP(D67,'Membership #'!$A$1:$C$1005,2,0)))","v":""},{"$f":"IF(D67=\"\",\"\",(VLOOKUP(D67,'Membership #'!$A$1:$C$1005,3,0)))","v":""},null,null,""]
["","","",null,{"$f":"IF(D68=\"\",\"\",(VLOOKUP(D68,'Membership #'!$A$1:$C$1005,2,0)))","v":""},{"$f":"IF(D68=\"\",\"\",(VLOOKUP(D68,'Membership #'!$A$1:$C$1005,3,0)))","v":""},null,null,""]
["","","",null,{"$f":"IF(D69=\"\",\"\",(VLOOKUP(D69,'Membership #'!$A$1:$C$1005,2,0)))","v":""},{"$f":"IF(D69=\"\",\"\",(VLOOKUP(D69,'Membership #'!$A$1:$C$1005,3,0)))","v":""},null,null,""]
["","","",null,{"$f":"IF(D70=\"\",\"\",(VLOOKUP(D70,'Membership #'!$A$1:$C$1005,2,0)))","v":""},{"$f":"IF(D70=\"\",\"\",(VLOOKUP(D70,'Membership #'!$A$1:$C$1005,3,0)))","v":""},null,null,""]
["","","",null,{"$f":"IF(D71=\"\",\"\",(VLOOKUP(D71,'Membership #'!$A$1:$C$1005,2,0)))","v":""},{"$f":"IF(D71=\"\",\"\",(VLOOKUP(D71,'Membership #'!$A$1:$C$1005,3,0)))","v":""},null,null,""]
["",{"$f":"IF(D72<>\"\",RANK(A72,A$8:A$100),\"\")","v":""},"",null,{"$f":"IF(D72=\"\",\"\",(VLOOKUP(D72,'Membership #'!$A$1:$C$1005,2,0)))","v":""},{"$f":"IF(D72=\"\",\"\",(VLOOKUP(D72,'Membership #'!$A$1:$C$1005,3,0)))","v":""},null,null,{"$f":"IF(G72=\"n\",\"No Time\",IF(G72=\"x\",\"Scratch\",IF(G72<>\"\",SUM(G72+H72),\"\")))","v":""}]
[{"$f":"IF(D73<>\"\",RAND(),\"\")","v":""},"","",null,{"$f":"IF(D73=\"\",\"\",(VLOOKUP(D73,'Membership #'!$A$1:$C$1005,2,0)))","v":""},{"$f":"IF(D73=\"\",\"\",(VLOOKUP(D73,'Membership #'!$A$1:$C$1005,3,0)))","v":""},null,null,""]
["","","",null,{"$f":"IF(D74=\"\",\"\",(VLOOKUP(D74,'Membership #'!$A$1:$C$1005,2,0)))","v":""},{"$f":"IF(D74=\"\",\"\",(VLOOKUP(D74,'Membership #'!$A$1:$C$1005,3,0)))","v":""},null,null,""]
["","","",null,{"$f":"IF(D75=\"\",\"\",(VLOOKUP(D75,'Membership #'!$A$1:$C$1005,2,0)))","v":""},{"$f":"IF(D75=\"\",\"\",(VLOOKUP(D75,'Membership #'!$A$1:$C$1005,3,0)))","v":""},null,null,""]
["","","",null,{"$f":"IF(D76=\"\",\"\",(VLOOKUP(D76,'Membership #'!$A$1:$C$1005,2,0)))","v":""},{"$f":"IF(D76=\"\",\"\",(VLOOKUP(D76,'Membership #'!$A$1:$C$1005,3,0)))","v":""},null,null,""]
["","","",null,{"$f":"IF(D77=\"\",\"\",(VLOOKUP(D77,'Membership #'!$A$1:$C$1005,2,0)))","v":""},{"$f":"IF(D77=\"\",\"\",(VLOOKUP(D77,'Membership #'!$A$1:$C$1005,3,0)))","v":""},null,null,""]
["","","",null,{"$f":"IF(D78=\"\",\"\",(VLOOKUP(D78,'Membership #'!$A$1:$C$1005,2,0)))","v":""},{"$f":"IF(D78=\"\",\"\",(VLOOKUP(D78,'Membership #'!$A$1:$C$1005,3,0)))","v":""},null,null,""]
["","","",null,{"$f":"IF(D79=\"\",\"\",(VLOOKUP(D79,'Membership #'!$A$1:$C$1005,2,0)))","v":""},{"$f":"IF(D79=\"\",\"\",(VLOOKUP(D79,'Membership #'!$A$1:$C$1005,3,0)))","v":""},null,null,""]
["","","",null,{"$f":"IF(D80=\"\",\"\",(VLOOKUP(D80,'Membership #'!$A$1:$C$1005,2,0)))","v":""},{"$f":"IF(D80=\"\",\"\",(VLOOKUP(D80,'Membership #'!$A$1:$C$1005,3,0)))","v":""},null,null,""]
["","","",null,{"$f":"IF(D81=\"\",\"\",(VLOOKUP(D81,'Membership #'!$A$1:$C$1005,2,0)))","v":""},{"$f":"IF(D81=\"\",\"\",(VLOOKUP(D81,'Membership #'!$A$1:$C$1005,3,0)))","v":""},null,null,""]
["","","",null,{"$f":"IF(D82=\"\",\"\",(VLOOKUP(D82,'Membership #'!$A$1:$C$1005,2,0)))","v":""},{"$f":"IF(D82=\"\",\"\",(VLOOKUP(D82,'Membership #'!$A$1:$C$1005,3,0)))","v":""},null,null,""]
["","","",null,{"$f":"IF(D83=\"\",\"\",(VLOOKUP(D83,'Membership #'!$A$1:$C$1005,2,0)))","v":""},{"$f":"IF(D83=\"\",\"\",(VLOOKUP(D83,'Membership #'!$A$1:$C$1005,3,0)))","v":""},null,null,""]
["","","",null,{"$f":"IF(D84=\"\",\"\",(VLOOKUP(D84,'Membership #'!$A$1:$C$1005,2,0)))","v":""},{"$f":"IF(D84=\"\",\"\",(VLOOKUP(D84,'Membership #'!$A$1:$C$1005,3,0)))","v":""},null,null,""]
["","","",null,{"$f":"IF(D85=\"\",\"\",(VLOOKUP(D85,'Membership #'!$A$1:$C$1005,2,0)))","v":""},{"$f":"IF(D85=\"\",\"\",(VLOOKUP(D85,'Membership #'!$A$1:$C$1005,3,0)))","v":""},null,null,""]
["","","",null,{"$f":"IF(D86=\"\",\"\",(VLOOKUP(D86,'Membership #'!$A$1:$C$1005,2,0)))","v":""},{"$f":"IF(D86=\"\",\"\",(VLOOKUP(D86,'Membership #'!$A$1:$C$1005,3,0)))","v":""},null,null,""]
["","","",null,{"$f":"IF(D87=\"\",\"\",(VLOOKUP(D87,'Membership #'!$A$1:$C$1005,2,0)))","v":""},{"$f":"IF(D87=\"\",\"\",(VLOOKUP(D87,'Membership #'!$A$1:$C$1005,3,0)))","v":""},null,null,""]
["","","",null,{"$f":"IF(D88=\"\",\"\",(VLOOKUP(D88,'Membership #'!$A$1:$C$1005,2,0)))","v":""},{"$f":"IF(D88=\"\",\"\",(VLOOKUP(D88,'Membership #'!$A$1:$C$1005,3,0)))","v":""},null,null,""]
["","","",null,{"$f":"IF(D89=\"\",\"\",(VLOOKUP(D89,'Membership #'!$A$1:$C$1005,2,0)))","v":""},{"$f":"IF(D89=\"\",\"\",(VLOOKUP(D89,'Membership #'!$A$1:$C$1005,3,0)))","v":""},null,null,""]
["","","",null,{"$f":"IF(D90=\"\",\"\",(VLOOKUP(D90,'Membership #'!$A$1:$C$1005,2,0)))","v":""},{"$f":"IF(D90=\"\",\"\",(VLOOKUP(D90,'Membership #'!$A$1:$C$1005,3,0)))","v":""},null,null,""]
["","","",null,{"$f":"IF(D91=\"\",\"\",(VLOOKUP(D91,'Membership #'!$A$1:$C$1005,2,0)))","v":""},{"$f":"IF(D91=\"\",\"\",(VLOOKUP(D91,'Membership #'!$A$1:$C$1005,3,0)))","v":""},null,null,""]
["","","",null,{"$f":"IF(D92=\"\",\"\",(VLOOKUP(D92,'Membership #'!$A$1:$C$1005,2,0)))","v":""},{"$f":"IF(D92=\"\",\"\",(VLOOKUP(D92,'Membership #'!$A$1:$C$1005,3,0)))","v":""},null,null,""]
["","","",null,{"$f":"IF(D93=\"\",\"\",(VLOOKUP(D93,'Membership #'!$A$1:$C$1005,2,0)))","v":""},{"$f":"IF(D93=\"\",\"\",(VLOOKUP(D93,'Membership #'!$A$1:$C$1005,3,0)))","v":""},null,null,""]
["","","",null,{"$f":"IF(D94=\"\",\"\",(VLOOKUP(D94,'Membership #'!$A$1:$C$1005,2,0)))","v":""},{"$f":"IF(D94=\"\",\"\",(VLOOKUP(D94,'Membership #'!$A$1:$C$1005,3,0)))","v":""},null,null,""]
["","","",null,{"$f":"IF(D95=\"\",\"\",(VLOOKUP(D95,'Membership #'!$A$1:$C$1005,2,0)))","v":""},{"$f":"IF(D95=\"\",\"\",(VLOOKUP(D95,'Membership #'!$A$1:$C$1005,3,0)))","v":""},null,null,""]
["","","",null,{"$f":"IF(D96=\"\",\"\",(VLOOKUP(D96,'Membership #'!$A$1:$C$1005,2,0)))","v":""},{"$f":"IF(D96=\"\",\"\",(VLOOKUP(D96,'Membership #'!$A$1:$C$1005,3,0)))","v":""},null,null,""]
["","","",null,{"$f":"IF(D97=\"\",\"\",(VLOOKUP(D97,'Membership #'!$A$1:$C$1005,2,0)))","v":""},{"$f":"IF(D97=\"\",\"\",(VLOOKUP(D97,'Membership #'!$A$1:$C$1005,3,0)))","v":""},null,null,""]
["","","",null,{"$f":"IF(D98=\"\",\"\",(VLOOKUP(D98,'Membership #'!$A$1:$C$1005,2,0)))","v":""},{"$f":"IF(D98=\"\",\"\",(VLOOKUP(D98,'Membership #'!$A$1:$C$1005,3,0)))","v":""},null,null,""]
["","","",null,{"$f":"IF(D99=\"\",\"\",(VLOOKUP(D99,'Membership #'!$A$1:$C$1005,2,0)))","v":""},{"$f":"IF(D99=\"\",\"\",(VLOOKUP(D99,'Membership #'!$A$1:$C$1005,3,0)))","v":""},null,null,""]
["","","",null,{"$f":"IF(D100=\"\",\"\",(VLOOKUP(D100,'Membership #'!$A$1:$C$1005,2,0)))","v":""},{"$f":"IF(D100=\"\",\"\",(VLOOKUP(D100,'Membership #'!$A$1:$C$1005,3,0)))","v":""},null,null,""]

{"sheet":"OPEN BARRELS","index":13,"n_rows":96,"n_cols":26,"rows_kept":96,"cut":false,"hidden":false,"merged":[[5,12,5,15],[0,0,0,10],[1,0,1,10],[2,0,2,3],[2,6,2,10],[3,0,6,0],[3,1,6,1],[3,2,6,2],[3,3,6,3],[3,4,6,4],[3,9,6,9],[3,10,6,10],[3,5,6,5],[3,6,6,6],[3,7,6,7],[3,8,6,8]]}
["Tom Burt & Mark McGuire Memorial Jackpot Aug 22, 2021",null,null,null,null,null,null,null,null,null,null,null,"x=Scratch"]
["OPEN BARRELS",null,null,null,null,null,null,null,null,null,null,null,"n=No Time"]
["# Enteries:",null,null,null,{"$f":"COUNTIF($D$8:$D$95,\">0\")","v":28},null,null,null,null,null,null,null,"Sponsored by Clarence Farm Services",null,null,null,null,"Don't Erase these numbers below!!"]
["Rand Draw","Seed",null,"RING #      ","NAME","HORSE NAME","TIME","PENALTY ","TOTAL","PLACINGS","POINTS",null,null,null,null,null,null,{"$f":"IF(N9=2,7,IF(N9=3,6,IF(N9=4,5,IF(N9=5,4,IF(AND(N9>5,N11>600),3,IF(AND(N9>5,N11<600,N11>299.99),2,IF(AND(N9>5,N11<300),1,8)))))))","v":3},1,2,3,4,5,6,7,8]
[null,null,null,null,null,null,null,null,null,null,null,null,null,null,null,null,null,null,299,"$300-","$600 -"]
[null,null,null,null,null,null,null,null,null,null,null,null,"OPEN BARRELS",null,null,null,null,null,"or less",599,"More","5 Entries","4 Entries","3 Entries","2 Entries"]
[null,null,null,null,null,null,null,null,null,null,null,null,null,null,null,null,null,"1st",0.32,0.27,0.24,0.35,0.4,0.46,0.6]
[{"$f":"IF(D8<>\"\",RAND(),\"\")","v":0.87521540915158036},{"$f":"IF(D8<>\"\",RANK(A8,A$8:A$96),\"\")","v":6},1,703,{"$f":"IF(D8=\"\",\"\",(VLOOKUP(D8,'Membership #'!$A$1:$C$1005,2,0)))","v":"Chris Baker"},{"$f":"IF(D8=\"\",\"\",(VLOOKUP(D8,'Membership #'!$A$1:$C$1005,3,0)))","v":"Jamer All Fired Up"},14.845000000000001,null,{"$f":"IF(G8=\"n\",\"No Time\",IF(G8=\"x\",\"Scratch\",IF(G8<>\"\",SUM(G8+H8),\"\")))","v":14.845000000000001},null,null,null,"Added",150,null,null,null,"2nd",0.23,0.22,0.19,0.25,0.28000000000000003,0.34,0.4]
[0.40446760403370208,17,2,534,{"$f":"IF(D9=\"\",\"\",(VLOOKUP(D9,'Membership #'!$A$1:$C$1005,2,0)))","v":"Mary Lou Rankin Dentin"},{"$f":"IF(D9=\"\",\"\",(VLOOKUP(D9,'Membership #'!$A$1:$C$1005,3,0)))","v":"Brandy's Chocolena"},15.089,null,15.089,null,null,null,"Entries",27,null,20,"per head","3rd",0.15,0.18,0.16,0.17,0.18,0.2]
[0.4133283015466499,16,3,698,{"$f":"IF(D10=\"\",\"\",(VLOOKUP(D10,'Membership #'!$A$1:$C$1005,2,0)))","v":"Kaleigh Denton"},{"$f":"IF(D10=\"\",\"\",(VLOOKUP(D10,'Membership #'!$A$1:$C$1005,3,0)))","v":"Coleasaki"},15.202,null,15.202,null,null,null,"Jackpot",{"$f":"P9*N9","v":540},null,0.85,"payback","4th",0.12,0.13,0.13,0.13,0.14000000000000001]
[0.95767885285519239,2,4,700,{"$f":"IF(D11=\"\",\"\",(VLOOKUP(D11,'Membership #'!$A$1:$C$1005,2,0)))","v":"Lindsay Baker"},{"$f":"IF(D11=\"\",\"\",(VLOOKUP(D11,'Membership #'!$A$1:$C$1005,3,0)))","v":"Boons Laughing Boy"},15.272,null,15.272,null,null,null,"Total Money",{"$f":"N8+(N10*P10)","v":609},null,{"$f":"N10*P10","v":459},"Jackpot","5th",0.1,0.09,0.08,0.1]
[0.44775128798153574,15,5,657,{"$f":"IF(D12=\"\",\"\",(VLOOKUP(D12,'Membership #'!$A$1:$C$1005,2,0)))","v":"Laura Morrison"},{"$f":"IF(D12=\"\",\"\",(VLOOKUP(D12,'Membership #'!$A$1:$C$1005,3,0)))","v":"Steal Ta Fame"},15.452,null,15.452,null,null,null,null,"Percentage","Money","Ring #",null,"6th",0.08,0.06,0.06]
[0.82459653259040833,7,6,922,{"$f":"IF(D13=\"\",\"\",(VLOOKUP(D13,'Membership #'!$A$1:$C$1005,2,0)))","v":"Stevi Jardine"},{"$f":"IF(D13=\"\",\"\",(VLOOKUP(D13,'Membership #'!$A$1:$C$1005,3,0)))","v":"Paytons Pretty Cool"},15.5,null,15.5,null,null,null,"1st",0.24,{"$f":"IF(N13<>0,N$11*N13,\"\")","v":146.16},null,{"$f":"IF(P13=\"\",\"\",(VLOOKUP(P13,'Membership #'!$A$1:$C$1005,2,0)))","v":""},"7th",null,0.03,0.05]
[0.27174268368560783,19,7,777,{"$f":"IF(D14=\"\",\"\",(VLOOKUP(D14,'Membership #'!$A$1:$C$1005,2,0)))","v":"Julia Parker"},{"$f":"IF(D14=\"\",\"\",(VLOOKUP(D14,'Membership #'!$A$1:$C$1005,3,0)))","v":"Doc's Spirit Prairie"},15.504,null,15.504,null,null,null,"2nd",0.19,115.71000000000001,null,{"$f":"IF(P14=\"\",\"\",(VLOOKUP(P14,'Membership #'!$A$1:$C$1005,2,0)))","v":""},"8th",null,0.02,0.04]
[0.55282797003941464,13,8,695,{"$f":"IF(D15=\"\",\"\",(VLOOKUP(D15,'Membership #'!$A$1:$C$1005,2,0)))","v":"Tessa Dicks"},{"$f":"IF(D15=\"\",\"\",(VLOOKUP(D15,'Membership #'!$A$1:$C$1005,3,0)))","v":"Charge's Dusty Luck"},15.526999999999999,null,15.526999999999999,null,null,null,"3rd",0.16,97.44,null,{"$f":"IF(P15=\"\",\"\",(VLOOKUP(P15,'Membership #'!$A$1:$C$1005,2,0)))","v":""},"9th",null,null,0.03]
[0.19986418324406041,23,9,892,{"$f":"IF(D16=\"\",\"\",(VLOOKUP(D16,'Membership #'!$A$1:$C$1005,2,0)))","v":"Donnie MacNeil"},{"$f":"IF(D16=\"\",\"\",(VLOOKUP(D16,'Membership #'!$A$1:$C$1005,3,0)))","v":"Gifted Go Gold"},15.548999999999999,null,15.548999999999999,null,null,null,"4th",0.13,79.17,null,{"$f":"IF(P16=\"\",\"\",(VLOOKUP(P16,'Membership #'!$A$1:$C$1005,2,0)))","v":""},"10th",null,null,0.02]
[0.89269226699801141,5,10,556,{"$f":"IF(D17=\"\",\"\",(VLOOKUP(D17,'Membership #'!$A$1:$C$1005,2,0)))","v":"Stephaine Clark"},{"$f":"IF(D17=\"\",\"\",(VLOOKUP(D17,'Membership #'!$A$1:$C$1005,3,0)))","v":"Perks A Flyin"},15.558,null,15.558,null,null,null,"5th",0.08,48.72,null,{"$f":"IF(P17=\"\",\"\",(VLOOKUP(P17,'Membership #'!$A$1:$C$1005,2,0)))","v":""}]
[0.82194203789242171,8,11,684,{"$f":"IF(D18=\"\",\"\",(VLOOKUP(D18,'Membership #'!$A$1:$C$1005,2,0)))","v":"Shann Cox"},{"$f":"IF(D18=\"\",\"\",(VLOOKUP(D18,'Membership #'!$A$1:$C$1005,3,0)))","v":"Jags Cash Flow"},15.561999999999999,null,15.561999999999999,null,null,null,"6th",0.06,36.54,null,{"$f":"IF(P18=\"\",\"\",(VLOOKUP(P18,'Membership #'!$A$1:$C$1005,2,0)))","v":""}]
[0.14006368459857754,27,12,750,{"$f":"IF(D19=\"\",\"\",(VLOOKUP(D19,'Membership #'!$A$1:$C$1005,2,0)))","v":"Tanya Kennedy"},{"$f":"IF(D19=\"\",\"\",(VLOOKUP(D19,'Membership #'!$A$1:$C$1005,3,0)))","v":"Old Stations Pride"},15.693,null,15.693,null,null,null,"7th",0.05,30.450000000000003,null,{"$f":"IF(P19=\"\",\"\",(VLOOKUP(P19,'Membership #'!$A$1:$C$1005,2,0)))","v":""}]
[0.24502707994306561,21,13,928,{"$f":"IF(D20=\"\",\"\",(VLOOKUP(D20,'Membership #'!$A$1:$C$1005,2,0)))","v":"Tessa Dicks"},{"$f":"IF(D20=\"\",\"\",(VLOOKUP(D20,'Membership #'!$A$1:$C$1005,3,0)))","v":"ELM Dash of Crime"},15.722,null,15.722,null,null,null,"8th",0.04,24.36,null,{"$f":"IF(P20=\"\",\"\",(VLOOKUP(P20,'Membership #'!$A$1:$C$1005,2,0)))","v":""}]
[0.14796801531506565,26,14,914,{"$f":"IF(D21=\"\",\"\",(VLOOKUP(D21,'Membership #'!$A$1:$C$1005,2,0)))","v":"Shelby MacPherson"},{"$f":"IF(D21=\"\",\"\",(VLOOKUP(D21,'Membership #'!$A$1:$C$1005,3,0)))","v":"Shelbys Badger Bar"},15.842000000000001,null,15.842000000000001,null,null,null,"9th",0.03,18.27,null,{"$f":"IF(P21=\"\",\"\",(VLOOKUP(P21,'Membership #'!$A$1:$C$1005,2,0)))","v":""}]
[0.12934907759448777,28,15,655,{"$f":"IF(D22=\"\",\"\",(VLOOKUP(D22,'Membership #'!$A$1:$C$1005,2,0)))","v":"Julia Parker"},{"$f":"IF(D22=\"\",\"\",(VLOOKUP(D22,'Membership #'!$A$1:$C$1005,3,0)))","v":"Boons Feature Star"},15.904999999999999,null,15.904999999999999,null,null,null,"10th",0.02,12.18,null,{"$f":"IF(P22=\"\",\"\",(VLOOKUP(P22,'Membership #'!$A$1:$C$1005,2,0)))","v":""}]
[0.29151271901137954,18,16,966,{"$f":"IF(D23=\"\",\"\",(VLOOKUP(D23,'Membership #'!$A$1:$C$1005,2,0)))","v":"Ava Anderson"},{"$f":"IF(D23=\"\",\"\",(VLOOKUP(D23,'Membership #'!$A$1:$C$1005,3,0)))","v":"Black Sass"},16.536999999999999,null,16.536999999999999,null,null,null,"Total Money",null,{"$f":"SUM(O13:O22)","v":609}]
[0.61037492806953741,12,17,904,{"$f":"IF(D24=\"\",\"\",(VLOOKUP(D24,'Membership #'!$A$1:$C$1005,2,0)))","v":"Ella Cowley"},{"$f":"IF(D24=\"\",\"\",(VLOOKUP(D24,'Membership #'!$A$1:$C$1005,3,0)))","v":"Blazin Boots"},16.562999999999999,null,16.562999999999999]
[0.71980902636978383,11,18,732,{"$f":"IF(D25=\"\",\"\",(VLOOKUP(D25,'Membership #'!$A$1:$C$1005,2,0)))","v":"Brenna Carrigan"},{"$f":"IF(D25=\"\",\"\",(VLOOKUP(D25,'Membership #'!$A$1:$C$1005,3,0)))","v":"Carlos"},16.774000000000001,null,16.774000000000001,null,null,null,null,{"$f":"IF(M25=\"\",\"\",(VLOOKUP(M25,'Membership #'!$A$1:$C$1005,2,0)))","v":""},{"$f":"IF(M25=\"\",\"\",(VLOOKUP(M25,'Membership #'!$A$1:$C$1005,3,0)))","v":""}]
[0.17282239811443512,24,19,516,{"$f":"IF(D26=\"\",\"\",(VLOOKUP(D26,'Membership #'!$A$1:$C$1005,2,0)))","v":"Laurie Don Reginato"},{"$f":"IF(D26=\"\",\"\",(VLOOKUP(D26,'Membership #'!$A$1:$C$1005,3,0)))","v":"TCR Gold Runny"},15.266999999999999,5,20.266999999999999,null,null,null,null,{"$f":"IF(M26=\"\",\"\",(VLOOKUP(M26,'Membership #'!$A$1:$C$1005,2,0)))","v":""},{"$f":"IF(M26=\"\",\"\",(VLOOKUP(M26,'Membership #'!$A$1:$C$1005,3,0)))","v":""}]
[0.20027140123836662,22,20,688,{"$f":"IF(D27=\"\",\"\",(VLOOKUP(D27,'Membership #'!$A$1:$C$1005,2,0)))","v":"Lenee Sampson"},{"$f":"IF(D27=\"\",\"\",(VLOOKUP(D27,'Membership #'!$A$1:$C$1005,3,0)))","v":"Six Dash Run"},15.726000000000001,5,20.725999999999999,null,null,null,null,{"$f":"IF(M27=\"\",\"\",(VLOOKUP(M27,'Membership #'!$A$1:$C$1005,2,0)))","v":""},{"$f":"IF(M27=\"\",\"\",(VLOOKUP(M27,'Membership #'!$A$1:$C$1005,3,0)))","v":""}]
[0.731200337571559,10,21,616,{"$f":"IF(D28=\"\",\"\",(VLOOKUP(D28,'Membership #'!$A$1:$C$1005,2,0)))","v":"Judy Bateman"},{"$f":"IF(D28=\"\",\"\",(VLOOKUP(D28,'Membership #'!$A$1:$C$1005,3,0)))","v":"HM HollywoodRockstar"},16.04,5,21.04]
[0.76645187733527809,9,22,537,{"$f":"IF(D29=\"\",\"\",(VLOOKUP(D29,'Membership #'!$A$1:$C$1005,2,0)))","v":"Alka Virick"},{"$f":"IF(D29=\"\",\"\",(VLOOKUP(D29,'Membership #'!$A$1:$C$1005,3,0)))","v":"Corona Identity"},24.187000000000001,null,24.187000000000001,null,null,null,null,null,{"$f":"IF(N29=\"\",\"\",(VLOOKUP(N29,'Membership #'!$A$1:$C$1005,2,0)))","v":""},{"$f":"IF(N29=\"\",\"\",(VLOOKUP(N29,'Membership #'!$A$1:$C$1005,3,0)))","v":""}]
[0.98425341761465779,1,23,971,{"$f":"IF(D30=\"\",\"\",(VLOOKUP(D30,'Membership #'!$A$1:$C$1005,2,0)))","v":"Arielle Burke"},{"$f":"IF(D30=\"\",\"\",(VLOOKUP(D30,'Membership #'!$A$1:$C$1005,3,0)))","v":"Elm Sally"},42.758000000000003,null,42.758000000000003]
[0.50846308871749513,14,24,647,{"$f":"IF(D31=\"\",\"\",(VLOOKUP(D31,'Membership #'!$A$1:$C$1005,2,0)))","v":"Courtney Parker"},{"$f":"IF(D31=\"\",\"\",(VLOOKUP(D31,'Membership #'!$A$1:$C$1005,3,0)))","v":"BW Rare Kinda Love"},"n",null,"No Time"]
[0.92276058272168626,4,25,674,{"$f":"IF(D32=\"\",\"\",(VLOOKUP(D32,'Membership #'!$A$1:$C$1005,2,0)))","v":"Kyle Beaton"},{"$f":"IF(D32=\"\",\"\",(VLOOKUP(D32,'Membership #'!$A$1:$C$1005,3,0)))","v":"Jus For Kicks"},"x",null,"Scratch"]
[0.16001781842748553,25,26,530,{"$f":"IF(D33=\"\",\"\",(VLOOKUP(D33,'Membership #'!$A$1:$C$1005,2,0)))","v":"Joan Grant"},{"$f":"IF(D33=\"\",\"\",(VLOOKUP(D33,'Membership #'!$A$1:$C$1005,3,0)))","v":"SLS Dash to Holland"},"x",null,"Scratch"]
[0.26503529353074173,20,27,973,{"$f":"IF(D34=\"\",\"\",(VLOOKUP(D34,'Membership #'!$A$1:$C$1005,2,0)))","v":"Sara Ivey"},{"$f":"IF(D34=\"\",\"\",(VLOOKUP(D34,'Membership #'!$A$1:$C$1005,3,0)))","v":"Ms Heavenly Gator"},"x",null,"Scratch"]
[0.95013966538608052,3,"",78,{"$f":"IF(D35=\"\",\"\",(VLOOKUP(D35,'Membership #'!$A$1:$C$1005,2,0)))","v":"Stephanie Rich"},{"$f":"IF(D35=\"\",\"\",(VLOOKUP(D35,'Membership #'!$A$1:$C$1005,3,0)))","v":"Texas Mickey"},"x",null,"Scratch"]
["","","",null,{"$f":"IF(D36=\"\",\"\",(VLOOKUP(D36,'Membership #'!$A$1:$C$1005,2,0)))","v":""},{"$f":"IF(D36=\"\",\"\",(VLOOKUP(D36,'Membership #'!$A$1:$C$1005,3,0)))","v":""},null,null,{"$f":"IF(G36=\"n\",\"No Time\",IF(G36=\"x\",\"Scratch\",IF(G36<>\"\",SUM(G36+H36),\"\")))","v":""}]
["","","",null,{"$f":"IF(D37=\"\",\"\",(VLOOKUP(D37,'Membership #'!$A$1:$C$1005,2,0)))","v":""},{"$f":"IF(D37=\"\",\"\",(VLOOKUP(D37,'Membership #'!$A$1:$C$1005,3,0)))","v":""},null,null,{"$f":"IF(G37=\"n\",\"No Time\",IF(G37=\"x\",\"Scratch\",IF(G37<>\"\",SUM(G37+H37),\"\")))","v":""}]
["","","",null,{"$f":"IF(D38=\"\",\"\",(VLOOKUP(D38,'Membership #'!$A$1:$C$1005,2,0)))","v":""},{"$f":"IF(D38=\"\",\"\",(VLOOKUP(D38,'Membership #'!$A$1:$C$1005,3,0)))","v":""},null,null,""]
["","","",null,{"$f":"IF(D39=\"\",\"\",(VLOOKUP(D39,'Membership #'!$A$1:$C$1005,2,0)))","v":""},{"$f":"IF(D39=\"\",\"\",(VLOOKUP(D39,'Membership #'!$A$1:$C$1005,3,0)))","v":""},null,null,""]
[{"$f":"IF(D40<>\"\",RAND(),\"\")","v":""},{"$f":"IF(D40<>\"\",RANK(A40,A$8:A$96),\"\")","v":""},"",null,{"$f":"IF(D40=\"\",\"\",(VLOOKUP(D40,'Membership #'!$A$1:$C$1005,2,0)))","v":""},{"$f":"IF(D40=\"\",\"\",(VLOOKUP(D40,'Membership #'!$A$1:$C$1005,3,0)))","v":""},null,null,""]
["","","",null,{"$f":"IF(D41=\"\",\"\",(VLOOKUP(D41,'Membership #'!$A$1:$C$1005,2,0)))","v":""},{"$f":"IF(D41=\"\",\"\",(VLOOKUP(D41,'Membership #'!$A$1:$C$1005,3,0)))","v":""},null,null,""]
["","","",null,{"$f":"IF(D42=\"\",\"\",(VLOOKUP(D42,'Membership #'!$A$1:$C$1005,2,0)))","v":""},{"$f":"IF(D42=\"\",\"\",(VLOOKUP(D42,'Membership #'!$A$1:$C$1005,3,0)))","v":""},null,null,""]
["","","",null,{"$f":"IF(D43=\"\",\"\",(VLOOKUP(D43,'Membership #'!$A$1:$C$1005,2,0)))","v":""},{"$f":"IF(D43=\"\",\"\",(VLOOKUP(D43,'Membership #'!$A$1:$C$1005,3,0)))","v":""},null,null,""]
["","","",null,{"$f":"IF(D44=\"\",\"\",(VLOOKUP(D44,'Membership #'!$A$1:$C$1005,2,0)))","v":""},{"$f":"IF(D44=\"\",\"\",(VLOOKUP(D44,'Membership #'!$A$1:$C$1005,3,0)))","v":""},null,null,""]
["","","",null,{"$f":"IF(D45=\"\",\"\",(VLOOKUP(D45,'Membership #'!$A$1:$C$1005,2,0)))","v":""},{"$f":"IF(D45=\"\",\"\",(VLOOKUP(D45,'Membership #'!$A$1:$C$1005,3,0)))","v":""},null,null,""]
["","","",null,{"$f":"IF(D46=\"\",\"\",(VLOOKUP(D46,'Membership #'!$A$1:$C$1005,2,0)))","v":""},{"$f":"IF(D46=\"\",\"\",(VLOOKUP(D46,'Membership #'!$A$1:$C$1005,3,0)))","v":""},null,null,""]
["","","",null,{"$f":"IF(D47=\"\",\"\",(VLOOKUP(D47,'Membership #'!$A$1:$C$1005,2,0)))","v":""},{"$f":"IF(D47=\"\",\"\",(VLOOKUP(D47,'Membership #'!$A$1:$C$1005,3,0)))","v":""},null,null,""]
["","","",null,{"$f":"IF(D48=\"\",\"\",(VLOOKUP(D48,'Membership #'!$A$1:$C$1005,2,0)))","v":""},{"$f":"IF(D48=\"\",\"\",(VLOOKUP(D48,'Membership #'!$A$1:$C$1005,3,0)))","v":""},null,null,""]
["","","",null,{"$f":"IF(D49=\"\",\"\",(VLOOKUP(D49,'Membership #'!$A$1:$C$1005,2,0)))","v":""},{"$f":"IF(D49=\"\",\"\",(VLOOKUP(D49,'Membership #'!$A$1:$C$1005,3,0)))","v":""},null,null,""]
["","","",null,{"$f":"IF(D50=\"\",\"\",(VLOOKUP(D50,'Membership #'!$A$1:$C$1005,2,0)))","v":""},{"$f":"IF(D50=\"\",\"\",(VLOOKUP(D50,'Membership #'!$A$1:$C$1005,3,0)))","v":""},null,null,""]
["","","",null,{"$f":"IF(D51=\"\",\"\",(VLOOKUP(D51,'Membership #'!$A$1:$C$1005,2,0)))","v":""},{"$f":"IF(D51=\"\",\"\",(VLOOKUP(D51,'Membership #'!$A$1:$C$1005,3,0)))","v":""},null,null,""]
["","","",null,{"$f":"IF(D52=\"\",\"\",(VLOOKUP(D52,'Membership #'!$A$1:$C$1005,2,0)))","v":""},{"$f":"IF(D52=\"\",\"\",(VLOOKUP(D52,'Membership #'!$A$1:$C$1005,3,0)))","v":""},null,null,""]
["","","",null,{"$f":"IF(D53=\"\",\"\",(VLOOKUP(D53,'Membership #'!$A$1:$C$1005,2,0)))","v":""},{"$f":"IF(D53=\"\",\"\",(VLOOKUP(D53,'Membership #'!$A$1:$C$1005,3,0)))","v":""},null,null,""]
["","","",null,{"$f":"IF(D54=\"\",\"\",(VLOOKUP(D54,'Membership #'!$A$1:$C$1005,2,0)))","v":""},{"$f":"IF(D54=\"\",\"\",(VLOOKUP(D54,'Membership #'!$A$1:$C$1005,3,0)))","v":""},null,null,""]
["","","",null,{"$f":"IF(D55=\"\",\"\",(VLOOKUP(D55,'Membership #'!$A$1:$C$1005,2,0)))","v":""},{"$f":"IF(D55=\"\",\"\",(VLOOKUP(D55,'Membership #'!$A$1:$C$1005,3,0)))","v":""},null,null,""]
["","","",null,{"$f":"IF(D56=\"\",\"\",(VLOOKUP(D56,'Membership #'!$A$1:$C$1005,2,0)))","v":""},{"$f":"IF(D56=\"\",\"\",(VLOOKUP(D56,'Membership #'!$A$1:$C$1005,3,0)))","v":""},null,null,{"$f":"IF(G56=\"n\",\"No Time\",IF(G56=\"x\",\"Scratch\",IF(G56<>\"\",SUM(G56+H56),\"\")))","v":""}]
["","","",null,{"$f":"IF(D57=\"\",\"\",(VLOOKUP(D57,'Membership #'!$A$1:$C$1005,2,0)))","v":""},{"$f":"IF(D57=\"\",\"\",(VLOOKUP(D57,'Membership #'!$A$1:$C$1005,3,0)))","v":""},null,null,""]
["","","",null,{"$f":"IF(D58=\"\",\"\",(VLOOKUP(D58,'Membership #'!$A$1:$C$1005,2,0)))","v":""},{"$f":"IF(D58=\"\",\"\",(VLOOKUP(D58,'Membership #'!$A$1:$C$1005,3,0)))","v":""},null,null,""]
["","","",null,{"$f":"IF(D59=\"\",\"\",(VLOOKUP(D59,'Membership #'!$A$1:$C$1005,2,0)))","v":""},{"$f":"IF(D59=\"\",\"\",(VLOOKUP(D59,'Membership #'!$A$1:$C$1005,3,0)))","v":""},null,null,{"$f":"IF(G59=\"n\",\"No Time\",IF(G59=\"x\",\"Scratch\",IF(G59<>\"\",SUM(G59+H59),\"\")))","v":""}]
["","","",null,{"$f":"IF(D60=\"\",\"\",(VLOOKUP(D60,'Membership #'!$A$1:$C$1005,2,0)))","v":""},{"$f":"IF(D60=\"\",\"\",(VLOOKUP(D60,'Membership #'!$A$1:$C$1005,3,0)))","v":""},null,null,""]
["","","",null,{"$f":"IF(D61=\"\",\"\",(VLOOKUP(D61,'Membership #'!$A$1:$C$1005,2,0)))","v":""},{"$f":"IF(D61=\"\",\"\",(VLOOKUP(D61,'Membership #'!$A$1:$C$1005,3,0)))","v":""},null,null,""]
["","","",null,{"$f":"IF(D62=\"\",\"\",(VLOOKUP(D62,'Membership #'!$A$1:$C$1005,2,0)))","v":""},{"$f":"IF(D62=\"\",\"\",(VLOOKUP(D62,'Membership #'!$A$1:$C$1005,3,0)))","v":""},null,null,""]
["","","",null,{"$f":"IF(D63=\"\",\"\",(VLOOKUP(D63,'Membership #'!$A$1:$C$1005,2,0)))","v":""},{"$f":"IF(D63=\"\",\"\",(VLOOKUP(D63,'Membership #'!$A$1:$C$1005,3,0)))","v":""},null,null,""]
["","","",null,{"$f":"IF(D64=\"\",\"\",(VLOOKUP(D64,'Membership #'!$A$1:$C$1005,2,0)))","v":""},{"$f":"IF(D64=\"\",\"\",(VLOOKUP(D64,'Membership #'!$A$1:$C$1005,3,0)))","v":""},null,null,""]
["","","",null,{"$f":"IF(D65=\"\",\"\",(VLOOKUP(D65,'Membership #'!$A$1:$C$1005,2,0)))","v":""},{"$f":"IF(D65=\"\",\"\",(VLOOKUP(D65,'Membership #'!$A$1:$C$1005,3,0)))","v":""},null,null,""]
["","","",null,{"$f":"IF(D66=\"\",\"\",(VLOOKUP(D66,'Membership #'!$A$1:$C$1005,2,0)))","v":""},{"$f":"IF(D66=\"\",\"\",(VLOOKUP(D66,'Membership #'!$A$1:$C$1005,3,0)))","v":""},null,null,""]
[{"$f":"IF(D67<>\"\",RAND(),\"\")","v":""},"","",null,{"$f":"IF(D67=\"\",\"\",(VLOOKUP(D67,'Membership #'!$A$1:$C$1005,2,0)))","v":""},{"$f":"IF(D67=\"\",\"\",(VLOOKUP(D67,'Membership #'!$A$1:$C$1005,3,0)))","v":""},null,null,""]
["","","",null,{"$f":"IF(D68=\"\",\"\",(VLOOKUP(D68,'Membership #'!$A$1:$C$1005,2,0)))","v":""},{"$f":"IF(D68=\"\",\"\",(VLOOKUP(D68,'Membership #'!$A$1:$C$1005,3,0)))","v":""},null,null,{"$f":"IF(G68=\"n\",\"No Time\",IF(G68=\"x\",\"Scratch\",IF(G68<>\"\",SUM(G68+H68),\"\")))","v":""}]
["","","",null,{"$f":"IF(D69=\"\",\"\",(VLOOKUP(D69,'Membership #'!$A$1:$C$1005,2,0)))","v":""},{"$f":"IF(D69=\"\",\"\",(VLOOKUP(D69,'Membership #'!$A$1:$C$1005,3,0)))","v":""},null,null,""]
["","","",null,{"$f":"IF(D70=\"\",\"\",(VLOOKUP(D70,'Membership #'!$A$1:$C$1005,2,0)))","v":""},{"$f":"IF(D70=\"\",\"\",(VLOOKUP(D70,'Membership #'!$A$1:$C$1005,3,0)))","v":""},null,null,""]
["","","",null,{"$f":"IF(D71=\"\",\"\",(VLOOKUP(D71,'Membership #'!$A$1:$C$1005,2,0)))","v":""},{"$f":"IF(D71=\"\",\"\",(VLOOKUP(D71,'Membership #'!$A$1:$C$1005,3,0)))","v":""},null,null,""]
["",{"$f":"IF(D72<>\"\",RANK(A72,A$8:A$96),\"\")","v":""},"",null,{"$f":"IF(D72=\"\",\"\",(VLOOKUP(D72,'Membership #'!$A$1:$C$1005,2,0)))","v":""},{"$f":"IF(D72=\"\",\"\",(VLOOKUP(D72,'Membership #'!$A$1:$C$1005,3,0)))","v":""},null,null,""]
["","","",null,{"$f":"IF(D73=\"\",\"\",(VLOOKUP(D73,'Membership #'!$A$1:$C$1005,2,0)))","v":""},{"$f":"IF(D73=\"\",\"\",(VLOOKUP(D73,'Membership #'!$A$1:$C$1005,3,0)))","v":""},null,null,""]
["","","",null,{"$f":"IF(D74=\"\",\"\",(VLOOKUP(D74,'Membership #'!$A$1:$C$1005,2,0)))","v":""},{"$f":"IF(D74=\"\",\"\",(VLOOKUP(D74,'Membership #'!$A$1:$C$1005,3,0)))","v":""},null,null,""]
["","","",null,{"$f":"IF(D75=\"\",\"\",(VLOOKUP(D75,'Membership #'!$A$1:$C$1005,2,0)))","v":""},{"$f":"IF(D75=\"\",\"\",(VLOOKUP(D75,'Membership #'!$A$1:$C$1005,3,0)))","v":""},null,null,""]
["","","",null,{"$f":"IF(D76=\"\",\"\",(VLOOKUP(D76,'Membership #'!$A$1:$C$1005,2,0)))","v":""},{"$f":"IF(D76=\"\",\"\",(VLOOKUP(D76,'Membership #'!$A$1:$C$1005,3,0)))","v":""},null,null,""]
["","","",null,{"$f":"IF(D77=\"\",\"\",(VLOOKUP(D77,'Membership #'!$A$1:$C$1005,2,0)))","v":""},{"$f":"IF(D77=\"\",\"\",(VLOOKUP(D77,'Membership #'!$A$1:$C$1005,3,0)))","v":""},null,null,""]
["","","",null,{"$f":"IF(D78=\"\",\"\",(VLOOKUP(D78,'Membership #'!$A$1:$C$1005,2,0)))","v":""},{"$f":"IF(D78=\"\",\"\",(VLOOKUP(D78,'Membership #'!$A$1:$C$1005,3,0)))","v":""},null,null,""]
["","","",null,{"$f":"IF(D79=\"\",\"\",(VLOOKUP(D79,'Membership #'!$A$1:$C$1005,2,0)))","v":""},{"$f":"IF(D79=\"\",\"\",(VLOOKUP(D79,'Membership #'!$A$1:$C$1005,3,0)))","v":""},null,null,""]
["","","",null,{"$f":"IF(D80=\"\",\"\",(VLOOKUP(D80,'Membership #'!$A$1:$C$1005,2,0)))","v":""},{"$f":"IF(D80=\"\",\"\",(VLOOKUP(D80,'Membership #'!$A$1:$C$1005,3,0)))","v":""},null,null,""]
["","","",null,{"$f":"IF(D81=\"\",\"\",(VLOOKUP(D81,'Membership #'!$A$1:$C$1005,2,0)))","v":""},{"$f":"IF(D81=\"\",\"\",(VLOOKUP(D81,'Membership #'!$A$1:$C$1005,3,0)))","v":""},null,null,""]
["","","",null,{"$f":"IF(D82=\"\",\"\",(VLOOKUP(D82,'Membership #'!$A$1:$C$1005,2,0)))","v":""},{"$f":"IF(D82=\"\",\"\",(VLOOKUP(D82,'Membership #'!$A$1:$C$1005,3,0)))","v":""},null,null,""]
["","","",null,{"$f":"IF(D83=\"\",\"\",(VLOOKUP(D83,'Membership #'!$A$1:$C$1005,2,0)))","v":""},{"$f":"IF(D83=\"\",\"\",(VLOOKUP(D83,'Membership #'!$A$1:$C$1005,3,0)))","v":""},null,null,""]
["","","",null,{"$f":"IF(D84=\"\",\"\",(VLOOKUP(D84,'Membership #'!$A$1:$C$1005,2,0)))","v":""},{"$f":"IF(D84=\"\",\"\",(VLOOKUP(D84,'Membership #'!$A$1:$C$1005,3,0)))","v":""},null,null,""]
["","","",null,{"$f":"IF(D85=\"\",\"\",(VLOOKUP(D85,'Membership #'!$A$1:$C$1005,2,0)))","v":""},{"$f":"IF(D85=\"\",\"\",(VLOOKUP(D85,'Membership #'!$A$1:$C$1005,3,0)))","v":""},null,null,""]
["","","",null,{"$f":"IF(D86=\"\",\"\",(VLOOKUP(D86,'Membership #'!$A$1:$C$1005,2,0)))","v":""},{"$f":"IF(D86=\"\",\"\",(VLOOKUP(D86,'Membership #'!$A$1:$C$1005,3,0)))","v":""},null,null,""]
["","","",null,{"$f":"IF(D87=\"\",\"\",(VLOOKUP(D87,'Membership #'!$A$1:$C$1005,2,0)))","v":""},{"$f":"IF(D87=\"\",\"\",(VLOOKUP(D87,'Membership #'!$A$1:$C$1005,3,0)))","v":""},null,null,""]
["","","",null,{"$f":"IF(D88=\"\",\"\",(VLOOKUP(D88,'Membership #'!$A$1:$C$1005,2,0)))","v":""},{"$f":"IF(D88=\"\",\"\",(VLOOKUP(D88,'Membership #'!$A$1:$C$1005,3,0)))","v":""},null,null,""]
["","","",null,{"$f":"IF(D89=\"\",\"\",(VLOOKUP(D89,'Membership #'!$A$1:$C$1005,2,0)))","v":""},{"$f":"IF(D89=\"\",\"\",(VLOOKUP(D89,'Membership #'!$A$1:$C$1005,3,0)))","v":""},null,null,""]
["","","",null,{"$f":"IF(D90=\"\",\"\",(VLOOKUP(D90,'Membership #'!$A$1:$C$1005,2,0)))","v":""},{"$f":"IF(D90=\"\",\"\",(VLOOKUP(D90,'Membership #'!$A$1:$C$1005,3,0)))","v":""},null,null,""]
["","","",null,{"$f":"IF(D91=\"\",\"\",(VLOOKUP(D91,'Membership #'!$A$1:$C$1005,2,0)))","v":""},{"$f":"IF(D91=\"\",\"\",(VLOOKUP(D91,'Membership #'!$A$1:$C$1005,3,0)))","v":""},null,null,""]
["","","",null,{"$f":"IF(D92=\"\",\"\",(VLOOKUP(D92,'Membership #'!$A$1:$C$1005,2,0)))","v":""},{"$f":"IF(D92=\"\",\"\",(VLOOKUP(D92,'Membership #'!$A$1:$C$1005,3,0)))","v":""},null,null,""]
["","","",null,{"$f":"IF(D93=\"\",\"\",(VLOOKUP(D93,'Membership #'!$A$1:$C$1005,2,0)))","v":""},{"$f":"IF(D93=\"\",\"\",(VLOOKUP(D93,'Membership #'!$A$1:$C$1005,3,0)))","v":""},null,null,""]
["","","",null,{"$f":"IF(D94=\"\",\"\",(VLOOKUP(D94,'Membership #'!$A$1:$C$1005,2,0)))","v":""},{"$f":"IF(D94=\"\",\"\",(VLOOKUP(D94,'Membership #'!$A$1:$C$1005,3,0)))","v":""},null,null,""]
["","","",null,{"$f":"IF(D95=\"\",\"\",(VLOOKUP(D95,'Membership #'!$A$1:$C$1005,2,0)))","v":""},{"$f":"IF(D95=\"\",\"\",(VLOOKUP(D95,'Membership #'!$A$1:$C$1005,3,0)))","v":""},null,null,""]
["","","",null,{"$f":"IF(D96=\"\",\"\",(VLOOKUP(D96,'Membership #'!$A$1:$C$1005,2,0)))","v":""},{"$f":"IF(D96=\"\",\"\",(VLOOKUP(D96,'Membership #'!$A$1:$C$1005,3,0)))","v":""},null,null,""]

{"sheet":"NOVICE POLES","index":14,"n_rows":98,"n_cols":26,"rows_kept":98,"cut":false,"hidden":false,"merged":[[5,12,5,15],[0,0,0,10],[1,0,1,10],[2,0,2,3],[2,6,2,10],[3,0,6,0],[3,1,6,1],[3,2,6,2],[3,3,6,3],[3,4,6,4],[3,9,6,9],[3,10,6,10],[3,5,6,5],[3,6,6,6],[3,7,6,7],[3,8,6,8]]}
["Tom Burt & Mark McGuire Memorial Jackpot Aug 22, 2021",null,null,null,null,null,null,null,null,null,null,null,"x=Scratch"]
["NOVICE POLES",null,null,null,null,null,null,null,null,null,null,null,"n=No Time"]
["# Enteries:",null,null,null,{"$f":"COUNTIF($D$8:$D$97,\">0\")","v":19},null,null,null,null,null,null,null,null,null,null,null,null,"Don't Erase these numbers below!!"]
["Rand Draw","Seed","Running Order","RING #      ","NAME","HORSE NAME","TIME","PENALTY ","TOTAL","PLACINGS","POINTS",null,null,null,null,null,null,{"$f":"IF(N9=2,7,IF(N9=3,6,IF(N9=4,5,IF(N9=5,4,IF(AND(N9>5,N11>600),3,IF(AND(N9>5,N11<600,N11>299.99),2,IF(AND(N9>5,N11<300),1,8)))))))","v":1},1,2,3,4,5,6,7,8]
[null,null,null,null,null,null,null,null,null,null,null,null,null,null,null,null,null,null,299,"$300-","$600 -"]
[null,null,null,null,null,null,null,null,null,null,null,null,"NOVICE POLES",null,null,null,null,null,"or less",599,"More","5 Entries","4 Entries","3 Entries","2 Entries"]
[null,null,null,null,null,null,null,null,null,null,null,null,null,null,null,null,null,"1st",0.32,0.27,0.24,0.35,0.4,0.46,0.6]
[{"$f":"IF(D8<>\"\",RAND(),\"\")","v":0.7670164831353109},{"$f":"IF(D8<>\"\",RANK(A8,A$8:A$98),\"\")","v":4},1,556,{"$f":"IF(D8=\"\",\"\",(VLOOKUP(D8,'Membership #'!$A$1:$C$1005,2,0)))","v":"Stephaine Clark"},{"$f":"IF(D8=\"\",\"\",(VLOOKUP(D8,'Membership #'!$A$1:$C$1005,3,0)))","v":"Perks A Flyin"},23.029,null,{"$f":"IF(G8=\"n\",\"No Time\",IF(G8=\"x\",\"Scratch\",IF(G8<>\"\",SUM(G8+H8),\"\")))","v":23.029},null,null,null,"Added",75,null,null,null,"2nd",0.23,0.22,0.19,0.25,0.28000000000000003,0.34,0.4]
[3.7293670372362864E-2,18,2,750,{"$f":"IF(D9=\"\",\"\",(VLOOKUP(D9,'Membership #'!$A$1:$C$1005,2,0)))","v":"Tanya Kennedy"},{"$f":"IF(D9=\"\",\"\",(VLOOKUP(D9,'Membership #'!$A$1:$C$1005,3,0)))","v":"Old Stations Pride"},23.096,null,23.096,null,null,null,"Entries",19,null,10,"per head","3rd",0.15,0.18,0.16,0.17,0.18,0.2]
[0.45216314607128649,9,3,909,{"$f":"IF(D10=\"\",\"\",(VLOOKUP(D10,'Membership #'!$A$1:$C$1005,2,0)))","v":"Rebecca Gillis"},{"$f":"IF(D10=\"\",\"\",(VLOOKUP(D10,'Membership #'!$A$1:$C$1005,3,0)))","v":"Martha's Tivio Moon"},23.579000000000001,null,23.579000000000001,null,null,null,"Jackpot",{"$f":"P9*N9","v":190},null,0.85,"payback","4th",0.12,0.13,0.13,0.13,0.14000000000000001]
[0.22885061304918219,14,4,928,{"$f":"IF(D11=\"\",\"\",(VLOOKUP(D11,'Membership #'!$A$1:$C$1005,2,0)))","v":"Tessa Dicks"},{"$f":"IF(D11=\"\",\"\",(VLOOKUP(D11,'Membership #'!$A$1:$C$1005,3,0)))","v":"ELM Dash of Crime"},25.134,null,25.134,null,null,null,"Total Money",{"$f":"N8+(N10*P10)","v":236.5},null,{"$f":"N10*P10","v":161.5},"Jackpot","5th",0.1,0.09,0.08,0.1]
[0.39669341356021548,12,5,904,{"$f":"IF(D12=\"\",\"\",(VLOOKUP(D12,'Membership #'!$A$1:$C$1005,2,0)))","v":"Ella Cowley"},{"$f":"IF(D12=\"\",\"\",(VLOOKUP(D12,'Membership #'!$A$1:$C$1005,3,0)))","v":"Blazin Boots"},26.748000000000001,null,26.748000000000001,null,null,null,null,"Percentage","Money","Ring #",null,"6th",0.08,0.06,0.06]
[5.0029401190975431E-2,17,6,600,{"$f":"IF(D13=\"\",\"\",(VLOOKUP(D13,'Membership #'!$A$1:$C$1005,2,0)))","v":"Stan Brown"},{"$f":"IF(D13=\"\",\"\",(VLOOKUP(D13,'Membership #'!$A$1:$C$1005,3,0)))","v":"A Perty Sure Thing"},27.312000000000001,null,27.312000000000001,null,null,null,"1st",{"$f":"HLOOKUP($R$4,$S$4:$Z$17,4,0)","v":0.32},{"$f":"IF(N13<>0,N$11*N13,\"\")","v":75.680000000000007},null,{"$f":"IF(P13=\"\",\"\",(VLOOKUP(P13,'Membership #'!$A$1:$C$1005,2,0)))","v":""},"7th",null,0.03,0.05]
[0.95329133158010393,2,7,973,{"$f":"IF(D14=\"\",\"\",(VLOOKUP(D14,'Membership #'!$A$1:$C$1005,2,0)))","v":"Sara Ivey"},{"$f":"IF(D14=\"\",\"\",(VLOOKUP(D14,'Membership #'!$A$1:$C$1005,3,0)))","v":"Ms Heavenly Gator"},27.821000000000002,null,27.821000000000002,null,null,null,"2nd",{"$f":"HLOOKUP($R$4,$S$4:$Z$17,5,0)","v":0.23},54.395000000000003,null,{"$f":"IF(P14=\"\",\"\",(VLOOKUP(P14,'Membership #'!$A$1:$C$1005,2,0)))","v":""},"8th",null,0.02,0.04]
[0.4742773219075902,8,8,954,{"$f":"IF(D15=\"\",\"\",(VLOOKUP(D15,'Membership #'!$A$1:$C$1005,2,0)))","v":"Scotia MacEachern"},{"$f":"IF(D15=\"\",\"\",(VLOOKUP(D15,'Membership #'!$A$1:$C$1005,3,0)))","v":"Hick-a-Licious"},28.007999999999999,null,28.007999999999999,null,null,null,"3rd",{"$f":"HLOOKUP($R$4,$S$4:$Z$17,6,0)","v":0.15},35.475000000000001,null,{"$f":"IF(P15=\"\",\"\",(VLOOKUP(P15,'Membership #'!$A$1:$C$1005,2,0)))","v":""},"9th",null,null,0.03]
[8.0600150055918474E-2,16,9,966,{"$f":"IF(D16=\"\",\"\",(VLOOKUP(D16,'Membership #'!$A$1:$C$1005,2,0)))","v":"Ava Anderson"},{"$f":"IF(D16=\"\",\"\",(VLOOKUP(D16,'Membership #'!$A$1:$C$1005,3,0)))","v":"Black Sass"},29.093,null,29.093,null,null,null,"4th",{"$f":"HLOOKUP($R$4,$S$4:$Z$17,7,0)","v":0.12},28.38,null,{"$f":"IF(P16=\"\",\"\",(VLOOKUP(P16,'Membership #'!$A$1:$C$1005,2,0)))","v":""},"10th",null,null,0.02]
[0.25406183447082986,13,10,753,{"$f":"IF(D17=\"\",\"\",(VLOOKUP(D17,'Membership #'!$A$1:$C$1005,2,0)))","v":"Kayla Boudreau"},{"$f":"IF(D17=\"\",\"\",(VLOOKUP(D17,'Membership #'!$A$1:$C$1005,3,0)))","v":"Lady Jane"},30.347000000000001,null,30.347000000000001,null,null,null,"5th",{"$f":"HLOOKUP($R$4,$S$4:$Z$17,8,0)","v":0.1},23.650000000000002,null,{"$f":"IF(P17=\"\",\"\",(VLOOKUP(P17,'Membership #'!$A$1:$C$1005,2,0)))","v":""}]
[0.55391110241435815,7,11,855,{"$f":"IF(D18=\"\",\"\",(VLOOKUP(D18,'Membership #'!$A$1:$C$1005,2,0)))","v":"Jenelle Collier"},{"$f":"IF(D18=\"\",\"\",(VLOOKUP(D18,'Membership #'!$A$1:$C$1005,3,0)))","v":"Peppy Sans Surprise"},28.132999999999999,10,38.132999999999996,null,null,null,"6th",{"$f":"HLOOKUP($R$4,$S$4:$Z$17,9,0)","v":0.08},18.920000000000002,null,{"$f":"IF(P18=\"\",\"\",(VLOOKUP(P18,'Membership #'!$A$1:$C$1005,2,0)))","v":""}]
[0.66909881044976738,5,12,892,{"$f":"IF(D19=\"\",\"\",(VLOOKUP(D19,'Membership #'!$A$1:$C$1005,2,0)))","v":"Donnie MacNeil"},{"$f":"IF(D19=\"\",\"\",(VLOOKUP(D19,'Membership #'!$A$1:$C$1005,3,0)))","v":"Gifted Go Gold"},24.611000000000001,15,39.611000000000004,null,null,null,"7th",{"$f":"HLOOKUP($R$4,$S$4:$Z$17,10,0)","v":0},"",null,{"$f":"IF(P19=\"\",\"\",(VLOOKUP(P19,'Membership #'!$A$1:$C$1005,2,0)))","v":""}]
[2.7910730475400714E-2,19,13,652,{"$f":"IF(D20=\"\",\"\",(VLOOKUP(D20,'Membership #'!$A$1:$C$1005,2,0)))","v":"Molly O'Grady"},{"$f":"IF(D20=\"\",\"\",(VLOOKUP(D20,'Membership #'!$A$1:$C$1005,3,0)))","v":"Teelano's Twister"},37.494999999999997,10,47.494999999999997,null,null,null,"8th",{"$f":"HLOOKUP($R$4,$S$4:$Z$17,11,0)","v":0},"",null,{"$f":"IF(P20=\"\",\"\",(VLOOKUP(P20,'Membership #'!$A$1:$C$1005,2,0)))","v":""}]
[0.42536836431898528,10,14,732,{"$f":"IF(D21=\"\",\"\",(VLOOKUP(D21,'Membership #'!$A$1:$C$1005,2,0)))","v":"Brenna Carrigan"},{"$f":"IF(D21=\"\",\"\",(VLOOKUP(D21,'Membership #'!$A$1:$C$1005,3,0)))","v":"Carlos"},45.548000000000002,5,50.548000000000002,null,null,null,"9th",{"$f":"HLOOKUP($R$4,$S$4:$Z$17,12,0)","v":0},"",null,{"$f":"IF(P21=\"\",\"\",(VLOOKUP(P21,'Membership #'!$A$1:$C$1005,2,0)))","v":""}]
[0.96019286768644196,1,15,716,{"$f":"IF(D22=\"\",\"\",(VLOOKUP(D22,'Membership #'!$A$1:$C$1005,2,0)))","v":"Kayla Martin"},{"$f":"IF(D22=\"\",\"\",(VLOOKUP(D22,'Membership #'!$A$1:$C$1005,3,0)))","v":"Dash Ta Home"},"n",null,"No Time",null,null,null,"10th",{"$f":"HLOOKUP($R$4,$S$4:$Z$17,13,0)","v":0},""]
[0.5663681624566469,6,16,78,{"$f":"IF(D23=\"\",\"\",(VLOOKUP(D23,'Membership #'!$A$1:$C$1005,2,0)))","v":"Stephanie Rich"},{"$f":"IF(D23=\"\",\"\",(VLOOKUP(D23,'Membership #'!$A$1:$C$1005,3,0)))","v":"Texas Mickey"},"x",null,"Scratch",null,null,null,"Total Money",null,{"$f":"SUM(O13:O22)","v":236.5}]
[0.10599563863356387,15,17,889,{"$f":"IF(D24=\"\",\"\",(VLOOKUP(D24,'Membership #'!$A$1:$C$1005,2,0)))","v":"Adelaine Cowley"},{"$f":"IF(D24=\"\",\"\",(VLOOKUP(D24,'Membership #'!$A$1:$C$1005,3,0)))","v":"Frenchman's Promise"},"x",null,"Scratch"]
[0.95135165992801263,3,18,971,{"$f":"IF(D25=\"\",\"\",(VLOOKUP(D25,'Membership #'!$A$1:$C$1005,2,0)))","v":"Arielle Burke"},{"$f":"IF(D25=\"\",\"\",(VLOOKUP(D25,'Membership #'!$A$1:$C$1005,3,0)))","v":"Elm Sally"},"x",null,"Scratch",null,null,null,null,null,{"$f":"IF(M25=\"\",\"\",(VLOOKUP(M25,'Membership #'!$A$1:$C$1005,3,0)))","v":""}]
[0.40872536145004634,11,19,746,{"$f":"IF(D26=\"\",\"\",(VLOOKUP(D26,'Membership #'!$A$1:$C$1005,2,0)))","v":"Cassie MacDonald"},{"$f":"IF(D26=\"\",\"\",(VLOOKUP(D26,'Membership #'!$A$1:$C$1005,3,0)))","v":"Sandy Dew"},"x",null,"Scratch"]
["","","",null,{"$f":"IF(D27=\"\",\"\",(VLOOKUP(D27,'Membership #'!$A$1:$C$1005,2,0)))","v":""},{"$f":"IF(D27=\"\",\"\",(VLOOKUP(D27,'Membership #'!$A$1:$C$1005,3,0)))","v":""},null,null,{"$f":"IF(G27=\"n\",\"No Time\",IF(G27=\"x\",\"Scratch\",IF(G27<>\"\",SUM(G27+H27),\"\")))","v":""}]
["","","",null,{"$f":"IF(D28=\"\",\"\",(VLOOKUP(D28,'Membership #'!$A$1:$C$1005,2,0)))","v":""},{"$f":"IF(D28=\"\",\"\",(VLOOKUP(D28,'Membership #'!$A$1:$C$1005,3,0)))","v":""},null,null,""]
["","","",null,{"$f":"IF(D29=\"\",\"\",(VLOOKUP(D29,'Membership #'!$A$1:$C$1005,2,0)))","v":""},{"$f":"IF(D29=\"\",\"\",(VLOOKUP(D29,'Membership #'!$A$1:$C$1005,3,0)))","v":""},null,null,""]
["","","",null,{"$f":"IF(D30=\"\",\"\",(VLOOKUP(D30,'Membership #'!$A$1:$C$1005,2,0)))","v":""},{"$f":"IF(D30=\"\",\"\",(VLOOKUP(D30,'Membership #'!$A$1:$C$1005,3,0)))","v":""},null,null,""]
["","","",null,{"$f":"IF(D31=\"\",\"\",(VLOOKUP(D31,'Membership #'!$A$1:$C$1005,2,0)))","v":""},{"$f":"IF(D31=\"\",\"\",(VLOOKUP(D31,'Membership #'!$A$1:$C$1005,3,0)))","v":""},null,null,""]
["","","",null,{"$f":"IF(D32=\"\",\"\",(VLOOKUP(D32,'Membership #'!$A$1:$C$1005,2,0)))","v":""},{"$f":"IF(D32=\"\",\"\",(VLOOKUP(D32,'Membership #'!$A$1:$C$1005,3,0)))","v":""},null,null,""]
["","","",null,{"$f":"IF(D33=\"\",\"\",(VLOOKUP(D33,'Membership #'!$A$1:$C$1005,2,0)))","v":""},{"$f":"IF(D33=\"\",\"\",(VLOOKUP(D33,'Membership #'!$A$1:$C$1005,3,0)))","v":""},null,null,""]
["","","",null,{"$f":"IF(D34=\"\",\"\",(VLOOKUP(D34,'Membership #'!$A$1:$C$1005,2,0)))","v":""},{"$f":"IF(D34=\"\",\"\",(VLOOKUP(D34,'Membership #'!$A$1:$C$1005,3,0)))","v":""},null,null,{"$f":"IF(G34=\"n\",\"No Time\",IF(G34=\"x\",\"Scratch\",IF(G34<>\"\",SUM(G34+H34),\"\")))","v":""}]
["","","",null,{"$f":"IF(D35=\"\",\"\",(VLOOKUP(D35,'Membership #'!$A$1:$C$1005,2,0)))","v":""},{"$f":"IF(D35=\"\",\"\",(VLOOKUP(D35,'Membership #'!$A$1:$C$1005,3,0)))","v":""},null,null,""]
["","","",null,{"$f":"IF(D36=\"\",\"\",(VLOOKUP(D36,'Membership #'!$A$1:$C$1005,2,0)))","v":""},{"$f":"IF(D36=\"\",\"\",(VLOOKUP(D36,'Membership #'!$A$1:$C$1005,3,0)))","v":""},null,null,""]
["","","",null,{"$f":"IF(D37=\"\",\"\",(VLOOKUP(D37,'Membership #'!$A$1:$C$1005,2,0)))","v":""},{"$f":"IF(D37=\"\",\"\",(VLOOKUP(D37,'Membership #'!$A$1:$C$1005,3,0)))","v":""},null,null,""]
["","","",null,{"$f":"IF(D38=\"\",\"\",(VLOOKUP(D38,'Membership #'!$A$1:$C$1005,2,0)))","v":""},{"$f":"IF(D38=\"\",\"\",(VLOOKUP(D38,'Membership #'!$A$1:$C$1005,3,0)))","v":""},null,null,{"$f":"IF(G38=\"n\",\"No Time\",IF(G38=\"x\",\"Scratch\",IF(G38<>\"\",SUM(G38+H38),\"\")))","v":""}]
["","","",null,{"$f":"IF(D39=\"\",\"\",(VLOOKUP(D39,'Membership #'!$A$1:$C$1005,2,0)))","v":""},{"$f":"IF(D39=\"\",\"\",(VLOOKUP(D39,'Membership #'!$A$1:$C$1005,3,0)))","v":""},null,null,""]
["",{"$f":"IF(D40<>\"\",RANK(A40,A$8:A$98),\"\")","v":""},"",null,{"$f":"IF(D40=\"\",\"\",(VLOOKUP(D40,'Membership #'!$A$1:$C$1005,2,0)))","v":""},{"$f":"IF(D40=\"\",\"\",(VLOOKUP(D40,'Membership #'!$A$1:$C$1005,3,0)))","v":""},null,null,""]
["","","",null,{"$f":"IF(D41=\"\",\"\",(VLOOKUP(D41,'Membership #'!$A$1:$C$1005,2,0)))","v":""},{"$f":"IF(D41=\"\",\"\",(VLOOKUP(D41,'Membership #'!$A$1:$C$1005,3,0)))","v":""},null,null,""]
["","","",null,{"$f":"IF(D42=\"\",\"\",(VLOOKUP(D42,'Membership #'!$A$1:$C$1005,2,0)))","v":""},{"$f":"IF(D42=\"\",\"\",(VLOOKUP(D42,'Membership #'!$A$1:$C$1005,3,0)))","v":""},null,null,""]
["","","",null,{"$f":"IF(D43=\"\",\"\",(VLOOKUP(D43,'Membership #'!$A$1:$C$1005,2,0)))","v":""},{"$f":"IF(D43=\"\",\"\",(VLOOKUP(D43,'Membership #'!$A$1:$C$1005,3,0)))","v":""},null,null,""]
["","","",null,{"$f":"IF(D44=\"\",\"\",(VLOOKUP(D44,'Membership #'!$A$1:$C$1005,2,0)))","v":""},{"$f":"IF(D44=\"\",\"\",(VLOOKUP(D44,'Membership #'!$A$1:$C$1005,3,0)))","v":""},null,null,""]
["","","",null,{"$f":"IF(D45=\"\",\"\",(VLOOKUP(D45,'Membership #'!$A$1:$C$1005,2,0)))","v":""},{"$f":"IF(D45=\"\",\"\",(VLOOKUP(D45,'Membership #'!$A$1:$C$1005,3,0)))","v":""},null,null,""]
["","","",null,{"$f":"IF(D46=\"\",\"\",(VLOOKUP(D46,'Membership #'!$A$1:$C$1005,2,0)))","v":""},{"$f":"IF(D46=\"\",\"\",(VLOOKUP(D46,'Membership #'!$A$1:$C$1005,3,0)))","v":""},null,null,""]
["","","",null,{"$f":"IF(D47=\"\",\"\",(VLOOKUP(D47,'Membership #'!$A$1:$C$1005,2,0)))","v":""},{"$f":"IF(D47=\"\",\"\",(VLOOKUP(D47,'Membership #'!$A$1:$C$1005,3,0)))","v":""},null,null,""]
["","","",null,{"$f":"IF(D48=\"\",\"\",(VLOOKUP(D48,'Membership #'!$A$1:$C$1005,2,0)))","v":""},{"$f":"IF(D48=\"\",\"\",(VLOOKUP(D48,'Membership #'!$A$1:$C$1005,3,0)))","v":""},null,null,""]
["","","",null,{"$f":"IF(D49=\"\",\"\",(VLOOKUP(D49,'Membership #'!$A$1:$C$1005,2,0)))","v":""},{"$f":"IF(D49=\"\",\"\",(VLOOKUP(D49,'Membership #'!$A$1:$C$1005,3,0)))","v":""},null,null,""]
["","","",null,{"$f":"IF(D50=\"\",\"\",(VLOOKUP(D50,'Membership #'!$A$1:$C$1005,2,0)))","v":""},{"$f":"IF(D50=\"\",\"\",(VLOOKUP(D50,'Membership #'!$A$1:$C$1005,3,0)))","v":""},null,null,""]
["","","",null,{"$f":"IF(D51=\"\",\"\",(VLOOKUP(D51,'Membership #'!$A$1:$C$1005,2,0)))","v":""},{"$f":"IF(D51=\"\",\"\",(VLOOKUP(D51,'Membership #'!$A$1:$C$1005,3,0)))","v":""},null,null,""]
["","","",null,{"$f":"IF(D52=\"\",\"\",(VLOOKUP(D52,'Membership #'!$A$1:$C$1005,2,0)))","v":""},{"$f":"IF(D52=\"\",\"\",(VLOOKUP(D52,'Membership #'!$A$1:$C$1005,3,0)))","v":""},null,null,""]
["","","",null,{"$f":"IF(D53=\"\",\"\",(VLOOKUP(D53,'Membership #'!$A$1:$C$1005,2,0)))","v":""},{"$f":"IF(D53=\"\",\"\",(VLOOKUP(D53,'Membership #'!$A$1:$C$1005,3,0)))","v":""},null,null,""]
["","","",null,{"$f":"IF(D54=\"\",\"\",(VLOOKUP(D54,'Membership #'!$A$1:$C$1005,2,0)))","v":""},{"$f":"IF(D54=\"\",\"\",(VLOOKUP(D54,'Membership #'!$A$1:$C$1005,3,0)))","v":""},null,null,""]
["","","",null,{"$f":"IF(D55=\"\",\"\",(VLOOKUP(D55,'Membership #'!$A$1:$C$1005,2,0)))","v":""},{"$f":"IF(D55=\"\",\"\",(VLOOKUP(D55,'Membership #'!$A$1:$C$1005,3,0)))","v":""},null,null,""]
["","","",null,{"$f":"IF(D56=\"\",\"\",(VLOOKUP(D56,'Membership #'!$A$1:$C$1005,2,0)))","v":""},{"$f":"IF(D56=\"\",\"\",(VLOOKUP(D56,'Membership #'!$A$1:$C$1005,3,0)))","v":""},null,null,""]
["","","",null,{"$f":"IF(D57=\"\",\"\",(VLOOKUP(D57,'Membership #'!$A$1:$C$1005,2,0)))","v":""},{"$f":"IF(D57=\"\",\"\",(VLOOKUP(D57,'Membership #'!$A$1:$C$1005,3,0)))","v":""},null,null,""]
["","","",null,{"$f":"IF(D58=\"\",\"\",(VLOOKUP(D58,'Membership #'!$A$1:$C$1005,2,0)))","v":""},{"$f":"IF(D58=\"\",\"\",(VLOOKUP(D58,'Membership #'!$A$1:$C$1005,3,0)))","v":""},null,null,""]
["","","",null,{"$f":"IF(D59=\"\",\"\",(VLOOKUP(D59,'Membership #'!$A$1:$C$1005,2,0)))","v":""},{"$f":"IF(D59=\"\",\"\",(VLOOKUP(D59,'Membership #'!$A$1:$C$1005,3,0)))","v":""},null,null,""]
["","","",null,{"$f":"IF(D60=\"\",\"\",(VLOOKUP(D60,'Membership #'!$A$1:$C$1005,2,0)))","v":""},{"$f":"IF(D60=\"\",\"\",(VLOOKUP(D60,'Membership #'!$A$1:$C$1005,3,0)))","v":""},null,null,""]
["","","",null,{"$f":"IF(D61=\"\",\"\",(VLOOKUP(D61,'Membership #'!$A$1:$C$1005,2,0)))","v":""},{"$f":"IF(D61=\"\",\"\",(VLOOKUP(D61,'Membership #'!$A$1:$C$1005,3,0)))","v":""},null,null,""]
["","","",null,{"$f":"IF(D62=\"\",\"\",(VLOOKUP(D62,'Membership #'!$A$1:$C$1005,2,0)))","v":""},{"$f":"IF(D62=\"\",\"\",(VLOOKUP(D62,'Membership #'!$A$1:$C$1005,3,0)))","v":""},null,null,""]
["","","",null,{"$f":"IF(D63=\"\",\"\",(VLOOKUP(D63,'Membership #'!$A$1:$C$1005,2,0)))","v":""},{"$f":"IF(D63=\"\",\"\",(VLOOKUP(D63,'Membership #'!$A$1:$C$1005,3,0)))","v":""},null,null,""]
["","","",null,{"$f":"IF(D64=\"\",\"\",(VLOOKUP(D64,'Membership #'!$A$1:$C$1005,2,0)))","v":""},{"$f":"IF(D64=\"\",\"\",(VLOOKUP(D64,'Membership #'!$A$1:$C$1005,3,0)))","v":""},null,null,""]
["","","",null,{"$f":"IF(D65=\"\",\"\",(VLOOKUP(D65,'Membership #'!$A$1:$C$1005,2,0)))","v":""},{"$f":"IF(D65=\"\",\"\",(VLOOKUP(D65,'Membership #'!$A$1:$C$1005,3,0)))","v":""},null,null,""]
["","","",null,{"$f":"IF(D66=\"\",\"\",(VLOOKUP(D66,'Membership #'!$A$1:$C$1005,2,0)))","v":""},{"$f":"IF(D66=\"\",\"\",(VLOOKUP(D66,'Membership #'!$A$1:$C$1005,3,0)))","v":""},null,null,""]
["","","",null,{"$f":"IF(D67=\"\",\"\",(VLOOKUP(D67,'Membership #'!$A$1:$C$1005,2,0)))","v":""},{"$f":"IF(D67=\"\",\"\",(VLOOKUP(D67,'Membership #'!$A$1:$C$1005,3,0)))","v":""},null,null,""]
["","","",null,{"$f":"IF(D68=\"\",\"\",(VLOOKUP(D68,'Membership #'!$A$1:$C$1005,2,0)))","v":""},{"$f":"IF(D68=\"\",\"\",(VLOOKUP(D68,'Membership #'!$A$1:$C$1005,3,0)))","v":""},null,null,""]
[{"$f":"IF(D69<>\"\",RAND(),\"\")","v":""},"","",null,{"$f":"IF(D69=\"\",\"\",(VLOOKUP(D69,'Membership #'!$A$1:$C$1005,2,0)))","v":""},{"$f":"IF(D69=\"\",\"\",(VLOOKUP(D69,'Membership #'!$A$1:$C$1005,3,0)))","v":""},null,null,""]
["","","",null,{"$f":"IF(D70=\"\",\"\",(VLOOKUP(D70,'Membership #'!$A$1:$C$1005,2,0)))","v":""},{"$f":"IF(D70=\"\",\"\",(VLOOKUP(D70,'Membership #'!$A$1:$C$1005,3,0)))","v":""},null,null,{"$f":"IF(G70=\"n\",\"No Time\",IF(G70=\"x\",\"Scratch\",IF(G70<>\"\",SUM(G70+H70),\"\")))","v":""}]
["","","",null,{"$f":"IF(D71=\"\",\"\",(VLOOKUP(D71,'Membership #'!$A$1:$C$1005,2,0)))","v":""},{"$f":"IF(D71=\"\",\"\",(VLOOKUP(D71,'Membership #'!$A$1:$C$1005,3,0)))","v":""},null,null,""]
["",{"$f":"IF(D72<>\"\",RANK(A72,A$8:A$98),\"\")","v":""},"",null,{"$f":"IF(D72=\"\",\"\",(VLOOKUP(D72,'Membership #'!$A$1:$C$1005,2,0)))","v":""},{"$f":"IF(D72=\"\",\"\",(VLOOKUP(D72,'Membership #'!$A$1:$C$1005,3,0)))","v":""},null,null,""]
["","","",null,{"$f":"IF(D73=\"\",\"\",(VLOOKUP(D73,'Membership #'!$A$1:$C$1005,2,0)))","v":""},{"$f":"IF(D73=\"\",\"\",(VLOOKUP(D73,'Membership #'!$A$1:$C$1005,3,0)))","v":""},null,null,""]
["","","",null,{"$f":"IF(D74=\"\",\"\",(VLOOKUP(D74,'Membership #'!$A$1:$C$1005,2,0)))","v":""},{"$f":"IF(D74=\"\",\"\",(VLOOKUP(D74,'Membership #'!$A$1:$C$1005,3,0)))","v":""},null,null,""]
["","","",null,{"$f":"IF(D75=\"\",\"\",(VLOOKUP(D75,'Membership #'!$A$1:$C$1005,2,0)))","v":""},{"$f":"IF(D75=\"\",\"\",(VLOOKUP(D75,'Membership #'!$A$1:$C$1005,3,0)))","v":""},null,null,""]
["","","",null,{"$f":"IF(D76=\"\",\"\",(VLOOKUP(D76,'Membership #'!$A$1:$C$1005,2,0)))","v":""},{"$f":"IF(D76=\"\",\"\",(VLOOKUP(D76,'Membership #'!$A$1:$C$1005,3,0)))","v":""},null,null,""]
["","","",null,{"$f":"IF(D77=\"\",\"\",(VLOOKUP(D77,'Membership #'!$A$1:$C$1005,2,0)))","v":""},{"$f":"IF(D77=\"\",\"\",(VLOOKUP(D77,'Membership #'!$A$1:$C$1005,3,0)))","v":""},null,null,""]
["","","",null,{"$f":"IF(D78=\"\",\"\",(VLOOKUP(D78,'Membership #'!$A$1:$C$1005,2,0)))","v":""},{"$f":"IF(D78=\"\",\"\",(VLOOKUP(D78,'Membership #'!$A$1:$C$1005,3,0)))","v":""},null,null,""]
["","","",null,{"$f":"IF(D79=\"\",\"\",(VLOOKUP(D79,'Membership #'!$A$1:$C$1005,2,0)))","v":""},{"$f":"IF(D79=\"\",\"\",(VLOOKUP(D79,'Membership #'!$A$1:$C$1005,3,0)))","v":""},null,null,""]
["","","",null,{"$f":"IF(D80=\"\",\"\",(VLOOKUP(D80,'Membership #'!$A$1:$C$1005,2,0)))","v":""},{"$f":"IF(D80=\"\",\"\",(VLOOKUP(D80,'Membership #'!$A$1:$C$1005,3,0)))","v":""},null,null,""]
["","","",null,{"$f":"IF(D81=\"\",\"\",(VLOOKUP(D81,'Membership #'!$A$1:$C$1005,2,0)))","v":""},{"$f":"IF(D81=\"\",\"\",(VLOOKUP(D81,'Membership #'!$A$1:$C$1005,3,0)))","v":""},null,null,""]
["","","",null,{"$f":"IF(D82=\"\",\"\",(VLOOKUP(D82,'Membership #'!$A$1:$C$1005,2,0)))","v":""},{"$f":"IF(D82=\"\",\"\",(VLOOKUP(D82,'Membership #'!$A$1:$C$1005,3,0)))","v":""},null,null,""]
["","","",null,{"$f":"IF(D83=\"\",\"\",(VLOOKUP(D83,'Membership #'!$A$1:$C$1005,2,0)))","v":""},{"$f":"IF(D83=\"\",\"\",(VLOOKUP(D83,'Membership #'!$A$1:$C$1005,3,0)))","v":""},null,null,""]
["","","",null,{"$f":"IF(D84=\"\",\"\",(VLOOKUP(D84,'Membership #'!$A$1:$C$1005,2,0)))","v":""},{"$f":"IF(D84=\"\",\"\",(VLOOKUP(D84,'Membership #'!$A$1:$C$1005,3,0)))","v":""},null,null,""]
["","","",null,{"$f":"IF(D85=\"\",\"\",(VLOOKUP(D85,'Membership #'!$A$1:$C$1005,2,0)))","v":""},{"$f":"IF(D85=\"\",\"\",(VLOOKUP(D85,'Membership #'!$A$1:$C$1005,3,0)))","v":""},null,null,""]
["","","",null,{"$f":"IF(D86=\"\",\"\",(VLOOKUP(D86,'Membership #'!$A$1:$C$1005,2,0)))","v":""},{"$f":"IF(D86=\"\",\"\",(VLOOKUP(D86,'Membership #'!$A$1:$C$1005,3,0)))","v":""},null,null,""]
["","","",null,{"$f":"IF(D87=\"\",\"\",(VLOOKUP(D87,'Membership #'!$A$1:$C$1005,2,0)))","v":""},{"$f":"IF(D87=\"\",\"\",(VLOOKUP(D87,'Membership #'!$A$1:$C$1005,3,0)))","v":""},null,null,""]
["","","",null,{"$f":"IF(D88=\"\",\"\",(VLOOKUP(D88,'Membership #'!$A$1:$C$1005,2,0)))","v":""},{"$f":"IF(D88=\"\",\"\",(VLOOKUP(D88,'Membership #'!$A$1:$C$1005,3,0)))","v":""},null,null,""]
["","","",null,{"$f":"IF(D89=\"\",\"\",(VLOOKUP(D89,'Membership #'!$A$1:$C$1005,2,0)))","v":""},{"$f":"IF(D89=\"\",\"\",(VLOOKUP(D89,'Membership #'!$A$1:$C$1005,3,0)))","v":""},null,null,""]
["","","",null,{"$f":"IF(D90=\"\",\"\",(VLOOKUP(D90,'Membership #'!$A$1:$C$1005,2,0)))","v":""},{"$f":"IF(D90=\"\",\"\",(VLOOKUP(D90,'Membership #'!$A$1:$C$1005,3,0)))","v":""},null,null,""]
["","","",null,{"$f":"IF(D91=\"\",\"\",(VLOOKUP(D91,'Membership #'!$A$1:$C$1005,2,0)))","v":""},{"$f":"IF(D91=\"\",\"\",(VLOOKUP(D91,'Membership #'!$A$1:$C$1005,3,0)))","v":""},null,null,""]
["","","",null,{"$f":"IF(D92=\"\",\"\",(VLOOKUP(D92,'Membership #'!$A$1:$C$1005,2,0)))","v":""},{"$f":"IF(D92=\"\",\"\",(VLOOKUP(D92,'Membership #'!$A$1:$C$1005,3,0)))","v":""},null,null,""]
["","","",null,{"$f":"IF(D93=\"\",\"\",(VLOOKUP(D93,'Membership #'!$A$1:$C$1005,2,0)))","v":""},{"$f":"IF(D93=\"\",\"\",(VLOOKUP(D93,'Membership #'!$A$1:$C$1005,3,0)))","v":""},null,null,""]
["","","",null,{"$f":"IF(D94=\"\",\"\",(VLOOKUP(D94,'Membership #'!$A$1:$C$1005,2,0)))","v":""},{"$f":"IF(D94=\"\",\"\",(VLOOKUP(D94,'Membership #'!$A$1:$C$1005,3,0)))","v":""},null,null,""]
["","","",null,{"$f":"IF(D95=\"\",\"\",(VLOOKUP(D95,'Membership #'!$A$1:$C$1005,2,0)))","v":""},{"$f":"IF(D95=\"\",\"\",(VLOOKUP(D95,'Membership #'!$A$1:$C$1005,3,0)))","v":""},null,null,""]
["","","",null,{"$f":"IF(D96=\"\",\"\",(VLOOKUP(D96,'Membership #'!$A$1:$C$1005,2,0)))","v":""},{"$f":"IF(D96=\"\",\"\",(VLOOKUP(D96,'Membership #'!$A$1:$C$1005,3,0)))","v":""},null,null,""]
["","","",null,{"$f":"IF(D97=\"\",\"\",(VLOOKUP(D97,'Membership #'!$A$1:$C$1005,2,0)))","v":""},{"$f":"IF(D97=\"\",\"\",(VLOOKUP(D97,'Membership #'!$A$1:$C$1005,3,0)))","v":""},null,null,""]
["","","",null,{"$f":"IF(D98=\"\",\"\",(VLOOKUP(D98,'Membership #'!$A$1:$C$1005,2,0)))","v":""},{"$f":"IF(D98=\"\",\"\",(VLOOKUP(D98,'Membership #'!$A$1:$C$1005,3,0)))","v":""},null,null,""]

{"sheet":"OPEN POLES","index":15,"n_rows":101,"n_cols":26,"rows_kept":101,"cut":false,"hidden":false,"merged":[[5,12,5,15],[3,3,6,3],[3,7,6,7],[3,10,6,10],[3,8,6,8],[3,9,6,9],[0,0,0,10],[1,0,1,10],[2,6,2,10],[3,0,6,0],[3,4,6,4],[3,5,6,5],[3,6,6,6],[3,1,6,1],[2,0,2,3],[3,2,6,2]]}
["Tom Burt & Mark McGuire Memorial Jackpot Aug 22, 2021",null,null,null,null,null,null,null,null,null,null,null,"x=Scratch"]
["OPEN POLES",null,null,null,null,null,null,null,null,null,null,null,"n=No Time"]
["# Enteries:",null,null,null,{"$f":"COUNTIF($D$8:$D$100,\">0\")","v":20},null,null,null,null,null,null,null,null,null,null,null,null,"Don't Erase these numbers below!!"]
["Rand Draw","Seed","Running Order","RING #      ","NAME","HORSE NAME","TIME","PENALTY ","TOTAL","PLACINGS","POINTS",null,null,null,null,null,null,{"$f":"IF(N9=2,7,IF(N9=3,6,IF(N9=4,5,IF(N9=5,4,IF(AND(N9>5,N11>600),3,IF(AND(N9>5,N11<600,N11>299.99),2,IF(AND(N9>5,N11<300),1,8)))))))","v":2},1,2,3,4,5,6,7,8]
[null,null,null,null,null,null,null,null,null,null,null,null,null,null,null,null,null,null,299,"$300-","$600 -"]
[null,null,null,null,null,null,null,null,null,null,null,null,"OPEN Poles",null,null,null,null,null,"or less",599,"More","5 Entries","4 Entries","3 Entries","2 Entries"]
[null,null,null,null,null,null,null,null,null,null,null,null,null,null,null,null,null,"1st",0.32,0.27,0.24,0.35,0.4,0.46,0.6]
[{"$f":"IF(D8<>\"\",RAND(),\"\")","v":0.94739770129262724},{"$f":"IF(D8<>\"\",RANK(A8,A$8:A$101),\"\")","v":1},1,616,{"$f":"IF(D8=\"\",\"\",(VLOOKUP(D8,'Membership #'!$A$1:$C$1005,2,0)))","v":"Judy Bateman"},{"$f":"IF(D8=\"\",\"\",(VLOOKUP(D8,'Membership #'!$A$1:$C$1005,3,0)))","v":"HM HollywoodRockstar"},22.471,null,{"$f":"IF(G8=\"n\",\"No Time\",IF(G8=\"x\",\"Scratch\",IF(G8<>\"\",SUM(G8+H8),\"\")))","v":22.471},null,null,null,"Added",150,null,null,null,"2nd",0.23,0.22,0.19,0.25,0.28000000000000003,0.34,0.4]
[{"$f":"IF(D9<>\"\",RAND(),\"\")","v":0.44153474523742509},{"$f":"IF(D9<>\"\",RANK(A9,A$8:A$101),\"\")","v":13},2,695,{"$f":"IF(D9=\"\",\"\",(VLOOKUP(D9,'Membership #'!$A$1:$C$1005,2,0)))","v":"Tessa Dicks"},{"$f":"IF(D9=\"\",\"\",(VLOOKUP(D9,'Membership #'!$A$1:$C$1005,3,0)))","v":"Charge's Dusty Luck"},23.19,null,23.19,null,null,null,"Entries",19,null,20,"per head","3rd",0.15,0.18,0.16,0.17,0.18,0.2]
[{"$f":"IF(D10<>\"\",RAND(),\"\")","v":0.5715580667479887},{"$f":"IF(D10<>\"\",RANK(A10,A$8:A$101),\"\")","v":11},3,909,{"$f":"IF(D10=\"\",\"\",(VLOOKUP(D10,'Membership #'!$A$1:$C$1005,2,0)))","v":"Rebecca Gillis"},{"$f":"IF(D10=\"\",\"\",(VLOOKUP(D10,'Membership #'!$A$1:$C$1005,3,0)))","v":"Martha's Tivio Moon"},23.672999999999998,null,23.672999999999998,null,null,null,"Jackpot",{"$f":"P9*N9","v":380},null,0.85,"payback","4th",0.12,0.13,0.13,0.13,0.14000000000000001]
[{"$f":"IF(D11<>\"\",RAND(),\"\")","v":0.59519593560398265},{"$f":"IF(D11<>\"\",RANK(A11,A$8:A$101),\"\")","v":10},4,855,{"$f":"IF(D11=\"\",\"\",(VLOOKUP(D11,'Membership #'!$A$1:$C$1005,2,0)))","v":"Jenelle Collier"},{"$f":"IF(D11=\"\",\"\",(VLOOKUP(D11,'Membership #'!$A$1:$C$1005,3,0)))","v":"Peppy Sans Surprise"},24.63,null,24.63,null,null,null,"Total Money",{"$f":"N8+(N10*P10)","v":473},null,{"$f":"N10*P10","v":323},"Jackpot","5th",0.1,0.09,0.08,0.1]
[0.90836200451868654,2,5,732,{"$f":"IF(D12=\"\",\"\",(VLOOKUP(D12,'Membership #'!$A$1:$C$1005,2,0)))","v":"Brenna Carrigan"},{"$f":"IF(D12=\"\",\"\",(VLOOKUP(D12,'Membership #'!$A$1:$C$1005,3,0)))","v":"Carlos"},25.75,null,25.75,null,null,null,null,"Percentage","Money","Ring #",null,"6th",0.08,0.06,0.06]
[0.34840062077116973,15,7,703,{"$f":"IF(D13=\"\",\"\",(VLOOKUP(D13,'Membership #'!$A$1:$C$1005,2,0)))","v":"Chris Baker"},{"$f":"IF(D13=\"\",\"\",(VLOOKUP(D13,'Membership #'!$A$1:$C$1005,3,0)))","v":"Jamer All Fired Up"},21.521999999999998,5,26.521999999999998,null,null,null,"1st",{"$f":"HLOOKUP($R$4,$S$4:$Z$17,4,0)","v":0.27},{"$f":"IF(N13<>0,N$11*N13,\"\")","v":127.71000000000001},null,{"$f":"IF(P13=\"\",\"\",(VLOOKUP(P13,'Membership #'!$A$1:$C$1005,2,0)))","v":""},"7th",null,0.03,0.05]
[0.47934597423272618,12,8,966,{"$f":"IF(D14=\"\",\"\",(VLOOKUP(D14,'Membership #'!$A$1:$C$1005,2,0)))","v":"Ava Anderson"},{"$f":"IF(D14=\"\",\"\",(VLOOKUP(D14,'Membership #'!$A$1:$C$1005,3,0)))","v":"Black Sass"},26.815999999999999,null,26.815999999999999,null,null,null,"2nd",{"$f":"HLOOKUP($R$4,$S$4:$Z$17,5,0)","v":0.22},104.06,null,{"$f":"IF(P14=\"\",\"\",(VLOOKUP(P14,'Membership #'!$A$1:$C$1005,2,0)))","v":""},"8th",null,0.02,0.04]
[0.2011696612896271,18,9,516,{"$f":"IF(D15=\"\",\"\",(VLOOKUP(D15,'Membership #'!$A$1:$C$1005,2,0)))","v":"Laurie Don Reginato"},{"$f":"IF(D15=\"\",\"\",(VLOOKUP(D15,'Membership #'!$A$1:$C$1005,3,0)))","v":"TCR Gold Runny"},22.292000000000002,5,27.292000000000002,null,null,null,"3rd",{"$f":"HLOOKUP($R$4,$S$4:$Z$17,6,0)","v":0.18},85.14,null,{"$f":"IF(P15=\"\",\"\",(VLOOKUP(P15,'Membership #'!$A$1:$C$1005,2,0)))","v":""},"9th",null,null,0.03]
[0.84849146156549249,7,10,914,{"$f":"IF(D16=\"\",\"\",(VLOOKUP(D16,'Membership #'!$A$1:$C$1005,2,0)))","v":"Shelby MacPherson"},{"$f":"IF(D16=\"\",\"\",(VLOOKUP(D16,'Membership #'!$A$1:$C$1005,3,0)))","v":"Shelbys Badger Bar"},22.585000000000001,5,27.585000000000001,null,null,null,"4th",{"$f":"HLOOKUP($R$4,$S$4:$Z$17,7,0)","v":0.13},61.49,null,{"$f":"IF(P16=\"\",\"\",(VLOOKUP(P16,'Membership #'!$A$1:$C$1005,2,0)))","v":""},"10th",null,null,0.02]
[0.10765998743916061,19,6,892,{"$f":"IF(D17=\"\",\"\",(VLOOKUP(D17,'Membership #'!$A$1:$C$1005,2,0)))","v":"Donnie MacNeil"},{"$f":"IF(D17=\"\",\"\",(VLOOKUP(D17,'Membership #'!$A$1:$C$1005,3,0)))","v":"Gifted Go Gold"},26.463000000000001,5,31.463000000000001,null,null,null,"5th",{"$f":"HLOOKUP($R$4,$S$4:$Z$17,8,0)","v":0.09},42.57,null,{"$f":"IF(P17=\"\",\"\",(VLOOKUP(P17,'Membership #'!$A$1:$C$1005,2,0)))","v":""}]
[0.85758270473200859,6,11,922,{"$f":"IF(D18=\"\",\"\",(VLOOKUP(D18,'Membership #'!$A$1:$C$1005,2,0)))","v":"Stevi Jardine"},{"$f":"IF(D18=\"\",\"\",(VLOOKUP(D18,'Membership #'!$A$1:$C$1005,3,0)))","v":"Paytons Pretty Cool"},21.623999999999999,10,31.623999999999999,null,null,null,"6th",{"$f":"HLOOKUP($R$4,$S$4:$Z$17,9,0)","v":0.06},28.38,null,{"$f":"IF(P18=\"\",\"\",(VLOOKUP(P18,'Membership #'!$A$1:$C$1005,2,0)))","v":""}]
[0.88650667334291922,3,12,777,{"$f":"IF(D19=\"\",\"\",(VLOOKUP(D19,'Membership #'!$A$1:$C$1005,2,0)))","v":"Julia Parker"},{"$f":"IF(D19=\"\",\"\",(VLOOKUP(D19,'Membership #'!$A$1:$C$1005,3,0)))","v":"Doc's Spirit Prairie"},21.78,10,31.78,null,null,null,"7th",{"$f":"HLOOKUP($R$4,$S$4:$Z$17,10,0)","v":0.03},14.19,null,{"$f":"IF(P19=\"\",\"\",(VLOOKUP(P19,'Membership #'!$A$1:$C$1005,2,0)))","v":""}]
[0.70279133425658802,8,13,698,{"$f":"IF(D20=\"\",\"\",(VLOOKUP(D20,'Membership #'!$A$1:$C$1005,2,0)))","v":"Kaleigh Denton"},{"$f":"IF(D20=\"\",\"\",(VLOOKUP(D20,'Membership #'!$A$1:$C$1005,3,0)))","v":"Coleasaki"},22.039000000000001,10,32.039000000000001,null,null,null,"8th",{"$f":"HLOOKUP($R$4,$S$4:$Z$17,11,0)","v":0.02},9.4600000000000009,null,{"$f":"IF(P20=\"\",\"\",(VLOOKUP(P20,'Membership #'!$A$1:$C$1005,2,0)))","v":""}]
[0.28057922560039317,17,14,684,{"$f":"IF(D21=\"\",\"\",(VLOOKUP(D21,'Membership #'!$A$1:$C$1005,2,0)))","v":"Shann Cox"},{"$f":"IF(D21=\"\",\"\",(VLOOKUP(D21,'Membership #'!$A$1:$C$1005,3,0)))","v":"Jags Cash Flow"},22.85,10,32.85,null,null,null,"9th",{"$f":"HLOOKUP($R$4,$S$4:$Z$17,12,0)","v":0},"",null,{"$f":"IF(P21=\"\",\"\",(VLOOKUP(P21,'Membership #'!$A$1:$C$1005,2,0)))","v":""}]
[0.61449938101888879,9,15,700,{"$f":"IF(D22=\"\",\"\",(VLOOKUP(D22,'Membership #'!$A$1:$C$1005,2,0)))","v":"Lindsay Baker"},{"$f":"IF(D22=\"\",\"\",(VLOOKUP(D22,'Membership #'!$A$1:$C$1005,3,0)))","v":"Boons Laughing Boy"},35.156999999999996,15,50.156999999999996,null,null,null,"10th",{"$f":"HLOOKUP($R$4,$S$4:$Z$17,13,0)","v":0},"",null,{"$f":"IF(P22=\"\",\"\",(VLOOKUP(P22,'Membership #'!$A$1:$C$1005,2,0)))","v":""}]
[0.87597113576240737,4,16,904,{"$f":"IF(D23=\"\",\"\",(VLOOKUP(D23,'Membership #'!$A$1:$C$1005,2,0)))","v":"Ella Cowley"},{"$f":"IF(D23=\"\",\"\",(VLOOKUP(D23,'Membership #'!$A$1:$C$1005,3,0)))","v":"Blazin Boots"},"n",null,"No Time",null,null,null,"Total Money",null,{"$f":"SUM(O13:O22)","v":473}]
[5.6953520130999524E-2,20,17,674,{"$f":"IF(D24=\"\",\"\",(VLOOKUP(D24,'Membership #'!$A$1:$C$1005,2,0)))","v":"Kyle Beaton"},{"$f":"IF(D24=\"\",\"\",(VLOOKUP(D24,'Membership #'!$A$1:$C$1005,3,0)))","v":"Jus For Kicks"},"x",null,"Scratch"]
[0.4234684569820002,14,18,971,{"$f":"IF(D25=\"\",\"\",(VLOOKUP(D25,'Membership #'!$A$1:$C$1005,2,0)))","v":"Arielle Burke"},{"$f":"IF(D25=\"\",\"\",(VLOOKUP(D25,'Membership #'!$A$1:$C$1005,3,0)))","v":"Elm Sally"},"x",null,"Scratch"]
[0.33792477730427917,16,19,973,{"$f":"IF(D26=\"\",\"\",(VLOOKUP(D26,'Membership #'!$A$1:$C$1005,2,0)))","v":"Sara Ivey"},{"$f":"IF(D26=\"\",\"\",(VLOOKUP(D26,'Membership #'!$A$1:$C$1005,3,0)))","v":"Ms Heavenly Gator"},"x",null,"Scratch"]
[0.86370916931400421,5,"",78,{"$f":"IF(D27=\"\",\"\",(VLOOKUP(D27,'Membership #'!$A$1:$C$1005,2,0)))","v":"Stephanie Rich"},{"$f":"IF(D27=\"\",\"\",(VLOOKUP(D27,'Membership #'!$A$1:$C$1005,3,0)))","v":"Texas Mickey"},"x",null,"Scratch"]
["","","",null,{"$f":"IF(D28=\"\",\"\",(VLOOKUP(D28,'Membership #'!$A$1:$C$1005,2,0)))","v":""},{"$f":"IF(D28=\"\",\"\",(VLOOKUP(D28,'Membership #'!$A$1:$C$1005,3,0)))","v":""},null,null,{"$f":"IF(G28=\"n\",\"No Time\",IF(G28=\"x\",\"Scratch\",IF(G28<>\"\",SUM(G28+H28),\"\")))","v":""}]
["","","",null,{"$f":"IF(D29=\"\",\"\",(VLOOKUP(D29,'Membership #'!$A$1:$C$1005,2,0)))","v":""},{"$f":"IF(D29=\"\",\"\",(VLOOKUP(D29,'Membership #'!$A$1:$C$1005,3,0)))","v":""},null,null,""]
["","","",null,{"$f":"IF(D30=\"\",\"\",(VLOOKUP(D30,'Membership #'!$A$1:$C$1005,2,0)))","v":""},{"$f":"IF(D30=\"\",\"\",(VLOOKUP(D30,'Membership #'!$A$1:$C$1005,3,0)))","v":""},null,null,""]
[{"$f":"IF(D31<>\"\",RAND(),\"\")","v":""},{"$f":"IF(D31<>\"\",RANK(A31,A$8:A$101),\"\")","v":""},"",null,{"$f":"IF(D31=\"\",\"\",(VLOOKUP(D31,'Membership #'!$A$1:$C$1005,2,0)))","v":""},{"$f":"IF(D31=\"\",\"\",(VLOOKUP(D31,'Membership #'!$A$1:$C$1005,3,0)))","v":""},null,null,{"$f":"IF(G31=\"n\",\"No Time\",IF(G31=\"x\",\"Scratch\",IF(G31<>\"\",SUM(G31+H31),\"\")))","v":""}]
["","","",null,{"$f":"IF(D32=\"\",\"\",(VLOOKUP(D32,'Membership #'!$A$1:$C$1005,2,0)))","v":""},{"$f":"IF(D32=\"\",\"\",(VLOOKUP(D32,'Membership #'!$A$1:$C$1005,3,0)))","v":""},null,null,""]
["","","",null,{"$f":"IF(D33=\"\",\"\",(VLOOKUP(D33,'Membership #'!$A$1:$C$1005,2,0)))","v":""},{"$f":"IF(D33=\"\",\"\",(VLOOKUP(D33,'Membership #'!$A$1:$C$1005,3,0)))","v":""},null,null,""]
["","","",null,{"$f":"IF(D34=\"\",\"\",(VLOOKUP(D34,'Membership #'!$A$1:$C$1005,2,0)))","v":""},{"$f":"IF(D34=\"\",\"\",(VLOOKUP(D34,'Membership #'!$A$1:$C$1005,3,0)))","v":""},null,null,{"$f":"IF(G34=\"n\",\"No Time\",IF(G34=\"x\",\"Scratch\",IF(G34<>\"\",SUM(G34+H34),\"\")))","v":""}]
["","","",null,{"$f":"IF(D35=\"\",\"\",(VLOOKUP(D35,'Membership #'!$A$1:$C$1005,2,0)))","v":""},{"$f":"IF(D35=\"\",\"\",(VLOOKUP(D35,'Membership #'!$A$1:$C$1005,3,0)))","v":""},null,null,{"$f":"IF(G35=\"n\",\"No Time\",IF(G35=\"x\",\"Scratch\",IF(G35<>\"\",SUM(G35+H35),\"\")))","v":""}]
["","","",null,{"$f":"IF(D36=\"\",\"\",(VLOOKUP(D36,'Membership #'!$A$1:$C$1005,2,0)))","v":""},{"$f":"IF(D36=\"\",\"\",(VLOOKUP(D36,'Membership #'!$A$1:$C$1005,3,0)))","v":""},null,null,""]
["","","",null,{"$f":"IF(D37=\"\",\"\",(VLOOKUP(D37,'Membership #'!$A$1:$C$1005,2,0)))","v":""},{"$f":"IF(D37=\"\",\"\",(VLOOKUP(D37,'Membership #'!$A$1:$C$1005,3,0)))","v":""},null,null,""]
["","","",null,{"$f":"IF(D38=\"\",\"\",(VLOOKUP(D38,'Membership #'!$A$1:$C$1005,2,0)))","v":""},{"$f":"IF(D38=\"\",\"\",(VLOOKUP(D38,'Membership #'!$A$1:$C$1005,3,0)))","v":""},null,null,{"$f":"IF(G38=\"n\",\"No Time\",IF(G38=\"x\",\"Scratch\",IF(G38<>\"\",SUM(G38+H38),\"\")))","v":""}]
["","","",null,{"$f":"IF(D39=\"\",\"\",(VLOOKUP(D39,'Membership #'!$A$1:$C$1005,2,0)))","v":""},{"$f":"IF(D39=\"\",\"\",(VLOOKUP(D39,'Membership #'!$A$1:$C$1005,3,0)))","v":""},null,null,""]
["",{"$f":"IF(D40<>\"\",RANK(A40,A$8:A$101),\"\")","v":""},"",null,{"$f":"IF(D40=\"\",\"\",(VLOOKUP(D40,'Membership #'!$A$1:$C$1005,2,0)))","v":""},{"$f":"IF(D40=\"\",\"\",(VLOOKUP(D40,'Membership #'!$A$1:$C$1005,3,0)))","v":""},null,null,""]
["","","",null,{"$f":"IF(D41=\"\",\"\",(VLOOKUP(D41,'Membership #'!$A$1:$C$1005,2,0)))","v":""},{"$f":"IF(D41=\"\",\"\",(VLOOKUP(D41,'Membership #'!$A$1:$C$1005,3,0)))","v":""},null,null,""]
["","","",null,{"$f":"IF(D42=\"\",\"\",(VLOOKUP(D42,'Membership #'!$A$1:$C$1005,2,0)))","v":""},{"$f":"IF(D42=\"\",\"\",(VLOOKUP(D42,'Membership #'!$A$1:$C$1005,3,0)))","v":""},null,null,""]
["","","",null,{"$f":"IF(D43=\"\",\"\",(VLOOKUP(D43,'Membership #'!$A$1:$C$1005,2,0)))","v":""},{"$f":"IF(D43=\"\",\"\",(VLOOKUP(D43,'Membership #'!$A$1:$C$1005,3,0)))","v":""},null,null,""]
["","","",null,{"$f":"IF(D44=\"\",\"\",(VLOOKUP(D44,'Membership #'!$A$1:$C$1005,2,0)))","v":""},{"$f":"IF(D44=\"\",\"\",(VLOOKUP(D44,'Membership #'!$A$1:$C$1005,3,0)))","v":""},null,null,""]
["","","",null,{"$f":"IF(D45=\"\",\"\",(VLOOKUP(D45,'Membership #'!$A$1:$C$1005,2,0)))","v":""},{"$f":"IF(D45=\"\",\"\",(VLOOKUP(D45,'Membership #'!$A$1:$C$1005,3,0)))","v":""},null,null,""]
["","","",null,{"$f":"IF(D46=\"\",\"\",(VLOOKUP(D46,'Membership #'!$A$1:$C$1005,2,0)))","v":""},{"$f":"IF(D46=\"\",\"\",(VLOOKUP(D46,'Membership #'!$A$1:$C$1005,3,0)))","v":""},null,null,""]
["","","",null,{"$f":"IF(D47=\"\",\"\",(VLOOKUP(D47,'Membership #'!$A$1:$C$1005,2,0)))","v":""},{"$f":"IF(D47=\"\",\"\",(VLOOKUP(D47,'Membership #'!$A$1:$C$1005,3,0)))","v":""},null,null,""]
["","","",null,{"$f":"IF(D48=\"\",\"\",(VLOOKUP(D48,'Membership #'!$A$1:$C$1005,2,0)))","v":""},{"$f":"IF(D48=\"\",\"\",(VLOOKUP(D48,'Membership #'!$A$1:$C$1005,3,0)))","v":""},null,null,""]
["","","",null,{"$f":"IF(D49=\"\",\"\",(VLOOKUP(D49,'Membership #'!$A$1:$C$1005,2,0)))","v":""},{"$f":"IF(D49=\"\",\"\",(VLOOKUP(D49,'Membership #'!$A$1:$C$1005,3,0)))","v":""},null,null,""]
["","","",null,{"$f":"IF(D50=\"\",\"\",(VLOOKUP(D50,'Membership #'!$A$1:$C$1005,2,0)))","v":""},{"$f":"IF(D50=\"\",\"\",(VLOOKUP(D50,'Membership #'!$A$1:$C$1005,3,0)))","v":""},null,null,""]
["","","",null,{"$f":"IF(D51=\"\",\"\",(VLOOKUP(D51,'Membership #'!$A$1:$C$1005,2,0)))","v":""},{"$f":"IF(D51=\"\",\"\",(VLOOKUP(D51,'Membership #'!$A$1:$C$1005,3,0)))","v":""},null,null,""]
["","","",null,{"$f":"IF(D52=\"\",\"\",(VLOOKUP(D52,'Membership #'!$A$1:$C$1005,2,0)))","v":""},{"$f":"IF(D52=\"\",\"\",(VLOOKUP(D52,'Membership #'!$A$1:$C$1005,3,0)))","v":""},null,null,""]
["","","",null,{"$f":"IF(D53=\"\",\"\",(VLOOKUP(D53,'Membership #'!$A$1:$C$1005,2,0)))","v":""},{"$f":"IF(D53=\"\",\"\",(VLOOKUP(D53,'Membership #'!$A$1:$C$1005,3,0)))","v":""},null,null,""]
["","","",null,{"$f":"IF(D54=\"\",\"\",(VLOOKUP(D54,'Membership #'!$A$1:$C$1005,2,0)))","v":""},{"$f":"IF(D54=\"\",\"\",(VLOOKUP(D54,'Membership #'!$A$1:$C$1005,3,0)))","v":""},null,null,""]
["","","",null,{"$f":"IF(D55=\"\",\"\",(VLOOKUP(D55,'Membership #'!$A$1:$C$1005,2,0)))","v":""},{"$f":"IF(D55=\"\",\"\",(VLOOKUP(D55,'Membership #'!$A$1:$C$1005,3,0)))","v":""},null,null,""]
["","","",null,{"$f":"IF(D56=\"\",\"\",(VLOOKUP(D56,'Membership #'!$A$1:$C$1005,2,0)))","v":""},{"$f":"IF(D56=\"\",\"\",(VLOOKUP(D56,'Membership #'!$A$1:$C$1005,3,0)))","v":""},null,null,""]
["","","",null,{"$f":"IF(D57=\"\",\"\",(VLOOKUP(D57,'Membership #'!$A$1:$C$1005,2,0)))","v":""},{"$f":"IF(D57=\"\",\"\",(VLOOKUP(D57,'Membership #'!$A$1:$C$1005,3,0)))","v":""},null,null,""]
["","","",null,{"$f":"IF(D58=\"\",\"\",(VLOOKUP(D58,'Membership #'!$A$1:$C$1005,2,0)))","v":""},{"$f":"IF(D58=\"\",\"\",(VLOOKUP(D58,'Membership #'!$A$1:$C$1005,3,0)))","v":""},null,null,""]
["","","",null,{"$f":"IF(D59=\"\",\"\",(VLOOKUP(D59,'Membership #'!$A$1:$C$1005,2,0)))","v":""},{"$f":"IF(D59=\"\",\"\",(VLOOKUP(D59,'Membership #'!$A$1:$C$1005,3,0)))","v":""},null,null,""]
["","","",null,{"$f":"IF(D60=\"\",\"\",(VLOOKUP(D60,'Membership #'!$A$1:$C$1005,2,0)))","v":""},{"$f":"IF(D60=\"\",\"\",(VLOOKUP(D60,'Membership #'!$A$1:$C$1005,3,0)))","v":""},null,null,""]
["","","",null,{"$f":"IF(D61=\"\",\"\",(VLOOKUP(D61,'Membership #'!$A$1:$C$1005,2,0)))","v":""},{"$f":"IF(D61=\"\",\"\",(VLOOKUP(D61,'Membership #'!$A$1:$C$1005,3,0)))","v":""},null,null,""]
["","","",null,{"$f":"IF(D62=\"\",\"\",(VLOOKUP(D62,'Membership #'!$A$1:$C$1005,2,0)))","v":""},{"$f":"IF(D62=\"\",\"\",(VLOOKUP(D62,'Membership #'!$A$1:$C$1005,3,0)))","v":""},null,null,""]
["","","",null,{"$f":"IF(D63=\"\",\"\",(VLOOKUP(D63,'Membership #'!$A$1:$C$1005,2,0)))","v":""},{"$f":"IF(D63=\"\",\"\",(VLOOKUP(D63,'Membership #'!$A$1:$C$1005,3,0)))","v":""},null,null,""]
["","","",null,{"$f":"IF(D64=\"\",\"\",(VLOOKUP(D64,'Membership #'!$A$1:$C$1005,2,0)))","v":""},{"$f":"IF(D64=\"\",\"\",(VLOOKUP(D64,'Membership #'!$A$1:$C$1005,3,0)))","v":""},null,null,""]
["","","",null,{"$f":"IF(D65=\"\",\"\",(VLOOKUP(D65,'Membership #'!$A$1:$C$1005,2,0)))","v":""},{"$f":"IF(D65=\"\",\"\",(VLOOKUP(D65,'Membership #'!$A$1:$C$1005,3,0)))","v":""},null,null,""]
["","","",null,{"$f":"IF(D66=\"\",\"\",(VLOOKUP(D66,'Membership #'!$A$1:$C$1005,2,0)))","v":""},{"$f":"IF(D66=\"\",\"\",(VLOOKUP(D66,'Membership #'!$A$1:$C$1005,3,0)))","v":""},null,null,""]
["","","",null,{"$f":"IF(D67=\"\",\"\",(VLOOKUP(D67,'Membership #'!$A$1:$C$1005,2,0)))","v":""},{"$f":"IF(D67=\"\",\"\",(VLOOKUP(D67,'Membership #'!$A$1:$C$1005,3,0)))","v":""},null,null,""]
["","","",null,{"$f":"IF(D68=\"\",\"\",(VLOOKUP(D68,'Membership #'!$A$1:$C$1005,2,0)))","v":""},{"$f":"IF(D68=\"\",\"\",(VLOOKUP(D68,'Membership #'!$A$1:$C$1005,3,0)))","v":""},null,null,""]
["","","",null,{"$f":"IF(D69=\"\",\"\",(VLOOKUP(D69,'Membership #'!$A$1:$C$1005,2,0)))","v":""},{"$f":"IF(D69=\"\",\"\",(VLOOKUP(D69,'Membership #'!$A$1:$C$1005,3,0)))","v":""},null,null,""]
["","","",null,{"$f":"IF(D70=\"\",\"\",(VLOOKUP(D70,'Membership #'!$A$1:$C$1005,2,0)))","v":""},{"$f":"IF(D70=\"\",\"\",(VLOOKUP(D70,'Membership #'!$A$1:$C$1005,3,0)))","v":""},null,null,""]
["","","",null,{"$f":"IF(D71=\"\",\"\",(VLOOKUP(D71,'Membership #'!$A$1:$C$1005,2,0)))","v":""},{"$f":"IF(D71=\"\",\"\",(VLOOKUP(D71,'Membership #'!$A$1:$C$1005,3,0)))","v":""},null,null,""]
["",{"$f":"IF(D72<>\"\",RANK(A72,A$8:A$101),\"\")","v":""},"",null,{"$f":"IF(D72=\"\",\"\",(VLOOKUP(D72,'Membership #'!$A$1:$C$1005,2,0)))","v":""},{"$f":"IF(D72=\"\",\"\",(VLOOKUP(D72,'Membership #'!$A$1:$C$1005,3,0)))","v":""},null,null,""]
["","","",null,{"$f":"IF(D73=\"\",\"\",(VLOOKUP(D73,'Membership #'!$A$1:$C$1005,2,0)))","v":""},{"$f":"IF(D73=\"\",\"\",(VLOOKUP(D73,'Membership #'!$A$1:$C$1005,3,0)))","v":""},null,null,{"$f":"IF(G73=\"n\",\"No Time\",IF(G73=\"x\",\"Scratch\",IF(G73<>\"\",SUM(G73+H73),\"\")))","v":""}]
["","","",null,{"$f":"IF(D74=\"\",\"\",(VLOOKUP(D74,'Membership #'!$A$1:$C$1005,2,0)))","v":""},{"$f":"IF(D74=\"\",\"\",(VLOOKUP(D74,'Membership #'!$A$1:$C$1005,3,0)))","v":""},null,null,""]
["","","",null,{"$f":"IF(D75=\"\",\"\",(VLOOKUP(D75,'Membership #'!$A$1:$C$1005,2,0)))","v":""},{"$f":"IF(D75=\"\",\"\",(VLOOKUP(D75,'Membership #'!$A$1:$C$1005,3,0)))","v":""},null,null,""]
["","","",null,{"$f":"IF(D76=\"\",\"\",(VLOOKUP(D76,'Membership #'!$A$1:$C$1005,2,0)))","v":""},{"$f":"IF(D76=\"\",\"\",(VLOOKUP(D76,'Membership #'!$A$1:$C$1005,3,0)))","v":""},null,null,""]
["","","",null,{"$f":"IF(D77=\"\",\"\",(VLOOKUP(D77,'Membership #'!$A$1:$C$1005,2,0)))","v":""},{"$f":"IF(D77=\"\",\"\",(VLOOKUP(D77,'Membership #'!$A$1:$C$1005,3,0)))","v":""},null,null,""]
["","","",null,{"$f":"IF(D78=\"\",\"\",(VLOOKUP(D78,'Membership #'!$A$1:$C$1005,2,0)))","v":""},{"$f":"IF(D78=\"\",\"\",(VLOOKUP(D78,'Membership #'!$A$1:$C$1005,3,0)))","v":""},null,null,""]
["","","",null,{"$f":"IF(D79=\"\",\"\",(VLOOKUP(D79,'Membership #'!$A$1:$C$1005,2,0)))","v":""},{"$f":"IF(D79=\"\",\"\",(VLOOKUP(D79,'Membership #'!$A$1:$C$1005,3,0)))","v":""},null,null,""]
["","","",null,{"$f":"IF(D80=\"\",\"\",(VLOOKUP(D80,'Membership #'!$A$1:$C$1005,2,0)))","v":""},{"$f":"IF(D80=\"\",\"\",(VLOOKUP(D80,'Membership #'!$A$1:$C$1005,3,0)))","v":""},null,null,""]
["","","",null,{"$f":"IF(D81=\"\",\"\",(VLOOKUP(D81,'Membership #'!$A$1:$C$1005,2,0)))","v":""},{"$f":"IF(D81=\"\",\"\",(VLOOKUP(D81,'Membership #'!$A$1:$C$1005,3,0)))","v":""},null,null,""]
["","","",null,{"$f":"IF(D82=\"\",\"\",(VLOOKUP(D82,'Membership #'!$A$1:$C$1005,2,0)))","v":""},{"$f":"IF(D82=\"\",\"\",(VLOOKUP(D82,'Membership #'!$A$1:$C$1005,3,0)))","v":""},null,null,""]
["","","",null,{"$f":"IF(D83=\"\",\"\",(VLOOKUP(D83,'Membership #'!$A$1:$C$1005,2,0)))","v":""},{"$f":"IF(D83=\"\",\"\",(VLOOKUP(D83,'Membership #'!$A$1:$C$1005,3,0)))","v":""},null,null,""]
["","","",null,{"$f":"IF(D84=\"\",\"\",(VLOOKUP(D84,'Membership #'!$A$1:$C$1005,2,0)))","v":""},{"$f":"IF(D84=\"\",\"\",(VLOOKUP(D84,'Membership #'!$A$1:$C$1005,3,0)))","v":""},null,null,""]
["","","",null,{"$f":"IF(D85=\"\",\"\",(VLOOKUP(D85,'Membership #'!$A$1:$C$1005,2,0)))","v":""},{"$f":"IF(D85=\"\",\"\",(VLOOKUP(D85,'Membership #'!$A$1:$C$1005,3,0)))","v":""},null,null,""]
["","","",null,{"$f":"IF(D86=\"\",\"\",(VLOOKUP(D86,'Membership #'!$A$1:$C$1005,2,0)))","v":""},{"$f":"IF(D86=\"\",\"\",(VLOOKUP(D86,'Membership #'!$A$1:$C$1005,3,0)))","v":""},null,null,""]
[{"$f":"IF(D87<>\"\",RAND(),\"\")","v":""},"","",null,{"$f":"IF(D87=\"\",\"\",(VLOOKUP(D87,'Membership #'!$A$1:$C$1005,2,0)))","v":""},{"$f":"IF(D87=\"\",\"\",(VLOOKUP(D87,'Membership #'!$A$1:$C$1005,3,0)))","v":""},null,null,""]
["","","",null,{"$f":"IF(D88=\"\",\"\",(VLOOKUP(D88,'Membership #'!$A$1:$C$1005,2,0)))","v":""},{"$f":"IF(D88=\"\",\"\",(VLOOKUP(D88,'Membership #'!$A$1:$C$1005,3,0)))","v":""},null,null,""]
["","","",null,{"$f":"IF(D89=\"\",\"\",(VLOOKUP(D89,'Membership #'!$A$1:$C$1005,2,0)))","v":""},{"$f":"IF(D89=\"\",\"\",(VLOOKUP(D89,'Membership #'!$A$1:$C$1005,3,0)))","v":""},null,null,""]
["","","",null,{"$f":"IF(D90=\"\",\"\",(VLOOKUP(D90,'Membership #'!$A$1:$C$1005,2,0)))","v":""},{"$f":"IF(D90=\"\",\"\",(VLOOKUP(D90,'Membership #'!$A$1:$C$1005,3,0)))","v":""},null,null,""]
["","","",null,{"$f":"IF(D91=\"\",\"\",(VLOOKUP(D91,'Membership #'!$A$1:$C$1005,2,0)))","v":""},{"$f":"IF(D91=\"\",\"\",(VLOOKUP(D91,'Membership #'!$A$1:$C$1005,3,0)))","v":""},null,null,""]
["","","",null,{"$f":"IF(D92=\"\",\"\",(VLOOKUP(D92,'Membership #'!$A$1:$C$1005,2,0)))","v":""},{"$f":"IF(D92=\"\",\"\",(VLOOKUP(D92,'Membership #'!$A$1:$C$1005,3,0)))","v":""},null,null,""]
["","","",null,{"$f":"IF(D93=\"\",\"\",(VLOOKUP(D93,'Membership #'!$A$1:$C$1005,2,0)))","v":""},{"$f":"IF(D93=\"\",\"\",(VLOOKUP(D93,'Membership #'!$A$1:$C$1005,3,0)))","v":""},null,null,""]
["","","",null,{"$f":"IF(D94=\"\",\"\",(VLOOKUP(D94,'Membership #'!$A$1:$C$1005,2,0)))","v":""},{"$f":"IF(D94=\"\",\"\",(VLOOKUP(D94,'Membership #'!$A$1:$C$1005,3,0)))","v":""},null,null,""]
["","","",null,{"$f":"IF(D95=\"\",\"\",(VLOOKUP(D95,'Membership #'!$A$1:$C$1005,2,0)))","v":""},{"$f":"IF(D95=\"\",\"\",(VLOOKUP(D95,'Membership #'!$A$1:$C$1005,3,0)))","v":""},null,null,""]
["","","",null,{"$f":"IF(D96=\"\",\"\",(VLOOKUP(D96,'Membership #'!$A$1:$C$1005,2,0)))","v":""},{"$f":"IF(D96=\"\",\"\",(VLOOKUP(D96,'Membership #'!$A$1:$C$1005,3,0)))","v":""},null,null,""]
["","","",null,{"$f":"IF(D97=\"\",\"\",(VLOOKUP(D97,'Membership #'!$A$1:$C$1005,2,0)))","v":""},{"$f":"IF(D97=\"\",\"\",(VLOOKUP(D97,'Membership #'!$A$1:$C$1005,3,0)))","v":""},null,null,""]
["","","",null,{"$f":"IF(D98=\"\",\"\",(VLOOKUP(D98,'Membership #'!$A$1:$C$1005,2,0)))","v":""},{"$f":"IF(D98=\"\",\"\",(VLOOKUP(D98,'Membership #'!$A$1:$C$1005,3,0)))","v":""},null,null,""]
["","","",null,{"$f":"IF(D99=\"\",\"\",(VLOOKUP(D99,'Membership #'!$A$1:$C$1005,2,0)))","v":""},{"$f":"IF(D99=\"\",\"\",(VLOOKUP(D99,'Membership #'!$A$1:$C$1005,3,0)))","v":""},null,null,""]
["","","",null,{"$f":"IF(D100=\"\",\"\",(VLOOKUP(D100,'Membership #'!$A$1:$C$1005,2,0)))","v":""},{"$f":"IF(D100=\"\",\"\",(VLOOKUP(D100,'Membership #'!$A$1:$C$1005,3,0)))","v":""},null,null,""]
["","","",null,{"$f":"IF(D101=\"\",\"\",(VLOOKUP(D101,'Membership #'!$A$1:$C$1005,2,0)))","v":""},{"$f":"IF(D101=\"\",\"\",(VLOOKUP(D101,'Membership #'!$A$1:$C$1005,3,0)))","v":""},null,null,""]

{"sheet":"3D Barrels","index":16,"n_rows":103,"n_cols":22,"rows_kept":103,"cut":false,"hidden":false,"merged":[[5,12,5,15],[0,0,0,10],[1,0,1,10],[2,0,2,3],[2,6,2,10],[3,0,6,0],[3,1,6,1],[3,2,6,2],[3,3,6,3],[3,4,6,4],[3,9,6,9],[3,10,6,10],[3,5,6,5],[3,6,6,6],[3,7,6,7],[3,8,6,8]]}
["Tom Burt & Mark McGuire Memorial Jackpot Aug 21, 2021",null,null,null,null,null,null,null,null,null,null,null,"x=Scratch"]
["3D Barrels",null,null,null,null,null,null,null,null,null,null,null,"n=No Time"]
["# Enteries:",null,null,null,{"$f":"COUNTIF($D$8:$D$102,\">0\")","v":0},null,null,null,null,null,null,null,null,null,null,null,null,"1 -29 horses per class pay 3 placings"]
["Rand Draw","Seed","Running Order","RING #      ","NAME","HORSE NAME","TIME","PENALTY ","TOTAL","PLACINGS","POINTS",null,"3D Sponsored By ",null,null,null,null,"30 -39 horses per class pay 4 placings"]
[null,null,null,null,null,null,null,null,null,null,null,null,null,null,null,null,null,"40 and over horses per class pay 5 placings"]
[null,null,null,null,null,null,null,null,null,null,null,null,"3D Barrels"]
[null,null,null,null,null,null,null,null,null,null,null,null,null,null,null,null,null,null,"5 Entries","4 Entries","3 Entries","2 Entries"]
[{"$f":"IF(D8<>\"\",RAND(),\"\")","v":""},{"$f":"IF(D8<>\"\",RANK(A8,A$8:A$103),\"\")","v":""},1,null,{"$f":"IF(D8=\"\",\"\",(VLOOKUP(D8,'Membership #'!$A$1:$C$1005,2,0)))","v":""},{"$f":"IF(D8=\"\",\"\",(VLOOKUP(D8,'Membership #'!$A$1:$C$1005,3,0)))","v":""},null,null,{"$f":"IF(G8=\"n\",\"No Time\",IF(G8=\"x\",\"Scratch\",IF(G8<>\"\",SUM(G8+H8),\"\")))","v":""},null,null,null,"Added",null,null,null,null,"1st",0.35,0.4,0.5,0.6]
["","",2,null,{"$f":"IF(D9=\"\",\"\",(VLOOKUP(D9,'Membership #'!$A$1:$C$1005,2,0)))","v":""},{"$f":"IF(D9=\"\",\"\",(VLOOKUP(D9,'Membership #'!$A$1:$C$1005,3,0)))","v":""},null,null,"",null,null,null,"Entries",null,null,15,"per head","2nd",0.25,0.3,0.3,0.4]
["","",3,null,{"$f":"IF(D10=\"\",\"\",(VLOOKUP(D10,'Membership #'!$A$1:$C$1005,2,0)))","v":""},{"$f":"IF(D10=\"\",\"\",(VLOOKUP(D10,'Membership #'!$A$1:$C$1005,3,0)))","v":""},null,null,"",null,null,null,"Jackpot",{"$f":"P9*N9","v":0},null,0.85,"payback","3rd",0.2,0.2,0.2]
["","",4,null,{"$f":"IF(D11=\"\",\"\",(VLOOKUP(D11,'Membership #'!$A$1:$C$1005,2,0)))","v":""},{"$f":"IF(D11=\"\",\"\",(VLOOKUP(D11,'Membership #'!$A$1:$C$1005,3,0)))","v":""},null,null,"",null,null,null,"Total Money",{"$f":"N8+(N10*P10)","v":0},null,{"$f":"N10*P10","v":0},"Jackpot","4th",0.15,0.1]
["","",5,null,{"$f":"IF(D12=\"\",\"\",(VLOOKUP(D12,'Membership #'!$A$1:$C$1005,2,0)))","v":""},{"$f":"IF(D12=\"\",\"\",(VLOOKUP(D12,'Membership #'!$A$1:$C$1005,3,0)))","v":""},null,null,"",null,null,null,"1D","Percentage","Money","Ring #",null,"5th",0.05]
["","",6,null,{"$f":"IF(D13=\"\",\"\",(VLOOKUP(D13,'Membership #'!$A$1:$C$1005,2,0)))","v":""},{"$f":"IF(D13=\"\",\"\",(VLOOKUP(D13,'Membership #'!$A$1:$C$1005,3,0)))","v":""},null,null,"",null,null,null,"1st",0.35,{"$f":"N$11/3*N13","v":0},null,{"$f":"IF(P13=\"\",\"\",(VLOOKUP(P13,'Membership #'!$A$1:$C$1005,2,0)))","v":""}]
["","",7,null,{"$f":"IF(D14=\"\",\"\",(VLOOKUP(D14,'Membership #'!$A$1:$C$1005,2,0)))","v":""},{"$f":"IF(D14=\"\",\"\",(VLOOKUP(D14,'Membership #'!$A$1:$C$1005,3,0)))","v":""},null,null,"",null,null,null,"2nd",0.25,{"$f":"N$11/3*N14","v":0},null,{"$f":"IF(P14=\"\",0,(VLOOKUP(P14,'Membership #'!$A$1:$C$1005,2,0)))","v":0}]
["","",8,null,{"$f":"IF(D15=\"\",\"\",(VLOOKUP(D15,'Membership #'!$A$1:$C$1005,2,0)))","v":""},{"$f":"IF(D15=\"\",\"\",(VLOOKUP(D15,'Membership #'!$A$1:$C$1005,3,0)))","v":""},null,null,"",null,null,null,"3rd",0.2,{"$f":"N$11/3*N15","v":0},null,{"$f":"IF(P15=\"\",0,(VLOOKUP(P15,'Membership #'!$A$1:$C$1005,2,0)))","v":0}]
["","",9,null,{"$f":"IF(D16=\"\",\"\",(VLOOKUP(D16,'Membership #'!$A$1:$C$1005,2,0)))","v":""},{"$f":"IF(D16=\"\",\"\",(VLOOKUP(D16,'Membership #'!$A$1:$C$1005,3,0)))","v":""},null,null,"",null,null,null,"4th",0.15,{"$f":"N$11/3*N16","v":0},null,{"$f":"IF(P16=\"\",0,(VLOOKUP(P16,'Membership #'!$A$1:$C$1005,2,0)))","v":0}]
["","",10,null,{"$f":"IF(D17=\"\",\"\",(VLOOKUP(D17,'Membership #'!$A$1:$C$1005,2,0)))","v":""},{"$f":"IF(D17=\"\",\"\",(VLOOKUP(D17,'Membership #'!$A$1:$C$1005,3,0)))","v":""},null,null,"",null,null,null,"5th",0.05,{"$f":"N$11/3*N17","v":0},null,{"$f":"IF(P17=\"\",\"\",(VLOOKUP(P17,'Membership #'!$A$1:$C$1005,2,0)))","v":""}]
["","",11,null,{"$f":"IF(D18=\"\",\"\",(VLOOKUP(D18,'Membership #'!$A$1:$C$1005,2,0)))","v":""},{"$f":"IF(D18=\"\",\"\",(VLOOKUP(D18,'Membership #'!$A$1:$C$1005,3,0)))","v":""},null,null,"",null,null,null,"2D","Percentage","Money","Ring #"]
["","",12,null,{"$f":"IF(D19=\"\",\"\",(VLOOKUP(D19,'Membership #'!$A$1:$C$1005,2,0)))","v":""},{"$f":"IF(D19=\"\",\"\",(VLOOKUP(D19,'Membership #'!$A$1:$C$1005,3,0)))","v":""},null,null,"",null,null,null,"1st",0.35,{"$f":"N$11/3*N19","v":0},null,{"$f":"IF(P19=\"\",\"\",(VLOOKUP(P19,'Membership #'!$A$1:$C$1005,2,0)))","v":""}]
["","",13,null,{"$f":"IF(D20=\"\",\"\",(VLOOKUP(D20,'Membership #'!$A$1:$C$1005,2,0)))","v":""},{"$f":"IF(D20=\"\",\"\",(VLOOKUP(D20,'Membership #'!$A$1:$C$1005,3,0)))","v":""},null,null,"",null,null,null,"2nd",0.25,{"$f":"N$11/3*N20","v":0},null,{"$f":"IF(P20=\"\",\"\",(VLOOKUP(P20,'Membership #'!$A$1:$C$1005,2,0)))","v":""}]
["","",14,null,{"$f":"IF(D21=\"\",\"\",(VLOOKUP(D21,'Membership #'!$A$1:$C$1005,2,0)))","v":""},{"$f":"IF(D21=\"\",\"\",(VLOOKUP(D21,'Membership #'!$A$1:$C$1005,3,0)))","v":""},null,null,"",null,null,null,"3rd",0.2,{"$f":"N$11/3*N21","v":0},null,{"$f":"IF(P21=\"\",\"\",(VLOOKUP(P21,'Membership #'!$A$1:$C$1005,2,0)))","v":""}]
["","",15,null,{"$f":"IF(D22=\"\",\"\",(VLOOKUP(D22,'Membership #'!$A$1:$C$1005,2,0)))","v":""},{"$f":"IF(D22=\"\",\"\",(VLOOKUP(D22,'Membership #'!$A$1:$C$1005,3,0)))","v":""},null,null,"",null,null,null,"4th",0.15,{"$f":"N$11/3*N22","v":0},null,{"$f":"IF(P22=\"\",\"\",(VLOOKUP(P22,'Membership #'!$A$1:$C$1005,2,0)))","v":""}]
["","",16,null,{"$f":"IF(D23=\"\",\"\",(VLOOKUP(D23,'Membership #'!$A$1:$C$1005,2,0)))","v":""},{"$f":"IF(D23=\"\",\"\",(VLOOKUP(D23,'Membership #'!$A$1:$C$1005,3,0)))","v":""},null,null,"",null,null,null,"5th",0.05,{"$f":"N$11/3*N23","v":0},null,{"$f":"IF(P23=\"\",\"\",(VLOOKUP(P23,'Membership #'!$A$1:$C$1005,2,0)))","v":""}]
["","",17,null,{"$f":"IF(D24=\"\",\"\",(VLOOKUP(D24,'Membership #'!$A$1:$C$1005,2,0)))","v":""},{"$f":"IF(D24=\"\",\"\",(VLOOKUP(D24,'Membership #'!$A$1:$C$1005,3,0)))","v":""},null,null,"",null,null,null,"3D","Percentage","Money","Ring #"]
["","",18,null,{"$f":"IF(D25=\"\",\"\",(VLOOKUP(D25,'Membership #'!$A$1:$C$1005,2,0)))","v":""},{"$f":"IF(D25=\"\",\"\",(VLOOKUP(D25,'Membership #'!$A$1:$C$1005,3,0)))","v":""},null,null,"",null,null,null,"1st",0.35,{"$f":"N$11/3*N25","v":0},null,{"$f":"IF(P25=\"\",\"\",(VLOOKUP(P25,'Membership #'!$A$1:$C$1005,2,0)))","v":""}]
["","",19,null,{"$f":"IF(D26=\"\",\"\",(VLOOKUP(D26,'Membership #'!$A$1:$C$1005,2,0)))","v":""},{"$f":"IF(D26=\"\",\"\",(VLOOKUP(D26,'Membership #'!$A$1:$C$1005,3,0)))","v":""},null,null,"",null,null,null,"2nd",0.25,{"$f":"N$11/3*N26","v":0},null,{"$f":"IF(P26=\"\",\"\",(VLOOKUP(P26,'Membership #'!$A$1:$C$1005,2,0)))","v":""}]
["","",20,null,{"$f":"IF(D27=\"\",\"\",(VLOOKUP(D27,'Membership #'!$A$1:$C$1005,2,0)))","v":""},{"$f":"IF(D27=\"\",\"\",(VLOOKUP(D27,'Membership #'!$A$1:$C$1005,3,0)))","v":""},null,null,"",null,null,null,"3rd",0.2,{"$f":"N$11/3*N27","v":0},null,{"$f":"IF(P27=\"\",\"\",(VLOOKUP(P27,'Membership #'!$A$1:$C$1005,2,0)))","v":""}]
["","",21,null,{"$f":"IF(D28=\"\",\"\",(VLOOKUP(D28,'Membership #'!$A$1:$C$1005,2,0)))","v":""},{"$f":"IF(D28=\"\",\"\",(VLOOKUP(D28,'Membership #'!$A$1:$C$1005,3,0)))","v":""},null,null,"",null,null,null,"4th",0.15,{"$f":"N$11/3*N28","v":0},null,{"$f":"IF(P28=\"\",\"\",(VLOOKUP(P28,'Membership #'!$A$1:$C$1005,2,0)))","v":""}]
["","",22,null,{"$f":"IF(D29=\"\",\"\",(VLOOKUP(D29,'Membership #'!$A$1:$C$1005,2,0)))","v":""},{"$f":"IF(D29=\"\",\"\",(VLOOKUP(D29,'Membership #'!$A$1:$C$1005,3,0)))","v":""},null,null,"",null,null,null,"5th",0.05,{"$f":"N$11/3*N29","v":0},null,{"$f":"IF(P29=\"\",\"\",(VLOOKUP(P29,'Membership #'!$A$1:$C$1005,2,0)))","v":""}]
["","",23,null,{"$f":"IF(D30=\"\",\"\",(VLOOKUP(D30,'Membership #'!$A$1:$C$1005,2,0)))","v":""},{"$f":"IF(D30=\"\",\"\",(VLOOKUP(D30,'Membership #'!$A$1:$C$1005,3,0)))","v":""},null,null,""]
["","",24,null,{"$f":"IF(D31=\"\",\"\",(VLOOKUP(D31,'Membership #'!$A$1:$C$1005,2,0)))","v":""},{"$f":"IF(D31=\"\",\"\",(VLOOKUP(D31,'Membership #'!$A$1:$C$1005,3,0)))","v":""},null,null,"",null,null,null,null,null,{"$f":"SUM(O13:O17,O19:O23,O25:O29)","v":0}]
["","",25,null,{"$f":"IF(D32=\"\",\"\",(VLOOKUP(D32,'Membership #'!$A$1:$C$1005,2,0)))","v":""},{"$f":"IF(D32=\"\",\"\",(VLOOKUP(D32,'Membership #'!$A$1:$C$1005,3,0)))","v":""},null,null,""]
["","",26,null,{"$f":"IF(D33=\"\",\"\",(VLOOKUP(D33,'Membership #'!$A$1:$C$1005,2,0)))","v":""},{"$f":"IF(D33=\"\",\"\",(VLOOKUP(D33,'Membership #'!$A$1:$C$1005,3,0)))","v":""},null,null,""]
["","",27,null,{"$f":"IF(D34=\"\",\"\",(VLOOKUP(D34,'Membership #'!$A$1:$C$1005,2,0)))","v":""},{"$f":"IF(D34=\"\",\"\",(VLOOKUP(D34,'Membership #'!$A$1:$C$1005,3,0)))","v":""},null,null,""]
["","",28,null,{"$f":"IF(D35=\"\",\"\",(VLOOKUP(D35,'Membership #'!$A$1:$C$1005,2,0)))","v":""},{"$f":"IF(D35=\"\",\"\",(VLOOKUP(D35,'Membership #'!$A$1:$C$1005,3,0)))","v":""},null,null,""]
["","",29,null,{"$f":"IF(D36=\"\",\"\",(VLOOKUP(D36,'Membership #'!$A$1:$C$1005,2,0)))","v":""},{"$f":"IF(D36=\"\",\"\",(VLOOKUP(D36,'Membership #'!$A$1:$C$1005,3,0)))","v":""},null,null,"",null,null,null,null,{"$f":"IF(M36=\"\",\"\",(VLOOKUP(M36,'Membership #'!$A$1:$C$1005,2,0)))","v":""},{"$f":"IF(M36=\"\",\"\",(VLOOKUP(M36,'Membership #'!$A$1:$C$1005,3,0)))","v":""}]
["","",30,null,{"$f":"IF(D37=\"\",\"\",(VLOOKUP(D37,'Membership #'!$A$1:$C$1005,2,0)))","v":""},{"$f":"IF(D37=\"\",\"\",(VLOOKUP(D37,'Membership #'!$A$1:$C$1005,3,0)))","v":""},null,null,"",null,null,null,null,{"$f":"IF(M37=\"\",\"\",(VLOOKUP(M37,'Membership #'!$A$1:$C$1005,2,0)))","v":""},{"$f":"IF(M37=\"\",\"\",(VLOOKUP(M37,'Membership #'!$A$1:$C$1005,3,0)))","v":""}]
["","",31,null,{"$f":"IF(D38=\"\",\"\",(VLOOKUP(D38,'Membership #'!$A$1:$C$1005,2,0)))","v":""},{"$f":"IF(D38=\"\",\"\",(VLOOKUP(D38,'Membership #'!$A$1:$C$1005,3,0)))","v":""},null,null,"",null,null,null,null,{"$f":"IF(M38=\"\",\"\",(VLOOKUP(M38,'Membership #'!$A$1:$C$1005,2,0)))","v":""},{"$f":"IF(M38=\"\",\"\",(VLOOKUP(M38,'Membership #'!$A$1:$C$1005,3,0)))","v":""}]
["","",32,null,{"$f":"IF(D39=\"\",\"\",(VLOOKUP(D39,'Membership #'!$A$1:$C$1005,2,0)))","v":""},{"$f":"IF(D39=\"\",\"\",(VLOOKUP(D39,'Membership #'!$A$1:$C$1005,3,0)))","v":""},null,null,{"$f":"IF(G39=\"n\",\"No Time\",IF(G39=\"x\",\"Scratch\",IF(G39<>\"\",SUM(G39+H39),\"\")))","v":""},null,null,null,null,{"$f":"IF(M39=\"\",\"\",(VLOOKUP(M39,'Membership #'!$A$1:$C$1005,2,0)))","v":""},{"$f":"IF(M39=\"\",\"\",(VLOOKUP(M39,'Membership #'!$A$1:$C$1005,3,0)))","v":""}]
["",{"$f":"IF(D40<>\"\",RANK(A40,A$8:A$103),\"\")","v":""},33,null,{"$f":"IF(D40=\"\",\"\",(VLOOKUP(D40,'Membership #'!$A$1:$C$1005,2,0)))","v":""},{"$f":"IF(D40=\"\",\"\",(VLOOKUP(D40,'Membership #'!$A$1:$C$1005,3,0)))","v":""},null,null,"",null,null,null,null,{"$f":"IF(M40=\"\",\"\",(VLOOKUP(M40,'Membership #'!$A$1:$C$1005,2,0)))","v":""},{"$f":"IF(M40=\"\",\"\",(VLOOKUP(M40,'Membership #'!$A$1:$C$1005,3,0)))","v":""}]
["","",34,null,{"$f":"IF(D41=\"\",\"\",(VLOOKUP(D41,'Membership #'!$A$1:$C$1005,2,0)))","v":""},{"$f":"IF(D41=\"\",\"\",(VLOOKUP(D41,'Membership #'!$A$1:$C$1005,3,0)))","v":""},null,null,"",null,null,null,null,{"$f":"IF(M41=\"\",\"\",(VLOOKUP(M41,'Membership #'!$A$1:$C$1005,2,0)))","v":""},{"$f":"IF(M41=\"\",\"\",(VLOOKUP(M41,'Membership #'!$A$1:$C$1005,3,0)))","v":""}]
["","",35,null,{"$f":"IF(D42=\"\",\"\",(VLOOKUP(D42,'Membership #'!$A$1:$C$1005,2,0)))","v":""},{"$f":"IF(D42=\"\",\"\",(VLOOKUP(D42,'Membership #'!$A$1:$C$1005,3,0)))","v":""},null,null,"",null,null,null,null,{"$f":"IF(M42=\"\",\"\",(VLOOKUP(M42,'Membership #'!$A$1:$C$1005,2,0)))","v":""},{"$f":"IF(M42=\"\",\"\",(VLOOKUP(M42,'Membership #'!$A$1:$C$1005,3,0)))","v":""}]
["","",36,null,{"$f":"IF(D43=\"\",\"\",(VLOOKUP(D43,'Membership #'!$A$1:$C$1005,2,0)))","v":""},{"$f":"IF(D43=\"\",\"\",(VLOOKUP(D43,'Membership #'!$A$1:$C$1005,3,0)))","v":""},null,null,""]
["","",37,null,{"$f":"IF(D44=\"\",\"\",(VLOOKUP(D44,'Membership #'!$A$1:$C$1005,2,0)))","v":""},{"$f":"IF(D44=\"\",\"\",(VLOOKUP(D44,'Membership #'!$A$1:$C$1005,3,0)))","v":""},null,null,""]
["","",38,null,{"$f":"IF(D45=\"\",\"\",(VLOOKUP(D45,'Membership #'!$A$1:$C$1005,2,0)))","v":""},{"$f":"IF(D45=\"\",\"\",(VLOOKUP(D45,'Membership #'!$A$1:$C$1005,3,0)))","v":""},null,null,""]
["","",39,null,{"$f":"IF(D46=\"\",\"\",(VLOOKUP(D46,'Membership #'!$A$1:$C$1005,2,0)))","v":""},{"$f":"IF(D46=\"\",\"\",(VLOOKUP(D46,'Membership #'!$A$1:$C$1005,3,0)))","v":""},null,null,""]
["","","",null,{"$f":"IF(D47=\"\",\"\",(VLOOKUP(D47,'Membership #'!$A$1:$C$1005,2,0)))","v":""},{"$f":"IF(D47=\"\",\"\",(VLOOKUP(D47,'Membership #'!$A$1:$C$1005,3,0)))","v":""},null,null,""]
["","","",null,{"$f":"IF(D48=\"\",\"\",(VLOOKUP(D48,'Membership #'!$A$1:$C$1005,2,0)))","v":""},{"$f":"IF(D48=\"\",\"\",(VLOOKUP(D48,'Membership #'!$A$1:$C$1005,3,0)))","v":""},null,null,""]
["","","",null,{"$f":"IF(D49=\"\",\"\",(VLOOKUP(D49,'Membership #'!$A$1:$C$1005,2,0)))","v":""},{"$f":"IF(D49=\"\",\"\",(VLOOKUP(D49,'Membership #'!$A$1:$C$1005,3,0)))","v":""},null,null,""]
["","","",null,{"$f":"IF(D50=\"\",\"\",(VLOOKUP(D50,'Membership #'!$A$1:$C$1005,2,0)))","v":""},{"$f":"IF(D50=\"\",\"\",(VLOOKUP(D50,'Membership #'!$A$1:$C$1005,3,0)))","v":""},null,null,""]
["","","",null,{"$f":"IF(D51=\"\",\"\",(VLOOKUP(D51,'Membership #'!$A$1:$C$1005,2,0)))","v":""},{"$f":"IF(D51=\"\",\"\",(VLOOKUP(D51,'Membership #'!$A$1:$C$1005,3,0)))","v":""},null,null,""]
["","","",null,{"$f":"IF(D52=\"\",\"\",(VLOOKUP(D52,'Membership #'!$A$1:$C$1005,2,0)))","v":""},{"$f":"IF(D52=\"\",\"\",(VLOOKUP(D52,'Membership #'!$A$1:$C$1005,3,0)))","v":""},null,null,""]
["","","",null,{"$f":"IF(D53=\"\",\"\",(VLOOKUP(D53,'Membership #'!$A$1:$C$1005,2,0)))","v":""},{"$f":"IF(D53=\"\",\"\",(VLOOKUP(D53,'Membership #'!$A$1:$C$1005,3,0)))","v":""},null,null,""]
["","","",null,{"$f":"IF(D54=\"\",\"\",(VLOOKUP(D54,'Membership #'!$A$1:$C$1005,2,0)))","v":""},{"$f":"IF(D54=\"\",\"\",(VLOOKUP(D54,'Membership #'!$A$1:$C$1005,3,0)))","v":""},null,null,""]
[{"$f":"IF(D55<>\"\",RAND(),\"\")","v":""},"","",null,{"$f":"IF(D55=\"\",\"\",(VLOOKUP(D55,'Membership #'!$A$1:$C$1005,2,0)))","v":""},{"$f":"IF(D55=\"\",\"\",(VLOOKUP(D55,'Membership #'!$A$1:$C$1005,3,0)))","v":""},null,null,""]
["","","",null,{"$f":"IF(D56=\"\",\"\",(VLOOKUP(D56,'Membership #'!$A$1:$C$1005,2,0)))","v":""},{"$f":"IF(D56=\"\",\"\",(VLOOKUP(D56,'Membership #'!$A$1:$C$1005,3,0)))","v":""},null,null,""]
["","","",null,{"$f":"IF(D57=\"\",\"\",(VLOOKUP(D57,'Membership #'!$A$1:$C$1005,2,0)))","v":""},{"$f":"IF(D57=\"\",\"\",(VLOOKUP(D57,'Membership #'!$A$1:$C$1005,3,0)))","v":""},null,null,""]
["","","",null,{"$f":"IF(D58=\"\",\"\",(VLOOKUP(D58,'Membership #'!$A$1:$C$1005,2,0)))","v":""},{"$f":"IF(D58=\"\",\"\",(VLOOKUP(D58,'Membership #'!$A$1:$C$1005,3,0)))","v":""},null,null,""]
["","","",null,{"$f":"IF(D59=\"\",\"\",(VLOOKUP(D59,'Membership #'!$A$1:$C$1005,2,0)))","v":""},{"$f":"IF(D59=\"\",\"\",(VLOOKUP(D59,'Membership #'!$A$1:$C$1005,3,0)))","v":""},null,null,{"$f":"IF(G59=\"n\",\"No Time\",IF(G59=\"x\",\"Scratch\",IF(G59<>\"\",SUM(G59+H59),\"\")))","v":""}]
["","","",null,{"$f":"IF(D60=\"\",\"\",(VLOOKUP(D60,'Membership #'!$A$1:$C$1005,2,0)))","v":""},{"$f":"IF(D60=\"\",\"\",(VLOOKUP(D60,'Membership #'!$A$1:$C$1005,3,0)))","v":""},null,null,{"$f":"IF(G60=\"n\",\"No Time\",IF(G60=\"x\",\"Scratch\",IF(G60<>\"\",SUM(G60+H60),\"\")))","v":""}]
["","","",null,{"$f":"IF(D61=\"\",\"\",(VLOOKUP(D61,'Membership #'!$A$1:$C$1005,2,0)))","v":""},{"$f":"IF(D61=\"\",\"\",(VLOOKUP(D61,'Membership #'!$A$1:$C$1005,3,0)))","v":""},null,null,""]
["","","",null,{"$f":"IF(D62=\"\",\"\",(VLOOKUP(D62,'Membership #'!$A$1:$C$1005,2,0)))","v":""},{"$f":"IF(D62=\"\",\"\",(VLOOKUP(D62,'Membership #'!$A$1:$C$1005,3,0)))","v":""},null,null,""]
["","","",null,{"$f":"IF(D63=\"\",\"\",(VLOOKUP(D63,'Membership #'!$A$1:$C$1005,2,0)))","v":""},{"$f":"IF(D63=\"\",\"\",(VLOOKUP(D63,'Membership #'!$A$1:$C$1005,3,0)))","v":""},null,null,""]
["","","",null,{"$f":"IF(D64=\"\",\"\",(VLOOKUP(D64,'Membership #'!$A$1:$C$1005,2,0)))","v":""},{"$f":"IF(D64=\"\",\"\",(VLOOKUP(D64,'Membership #'!$A$1:$C$1005,3,0)))","v":""},null,null,""]
["","","",null,{"$f":"IF(D65=\"\",\"\",(VLOOKUP(D65,'Membership #'!$A$1:$C$1005,2,0)))","v":""},{"$f":"IF(D65=\"\",\"\",(VLOOKUP(D65,'Membership #'!$A$1:$C$1005,3,0)))","v":""},null,null,""]
["","","",null,{"$f":"IF(D66=\"\",\"\",(VLOOKUP(D66,'Membership #'!$A$1:$C$1005,2,0)))","v":""},{"$f":"IF(D66=\"\",\"\",(VLOOKUP(D66,'Membership #'!$A$1:$C$1005,3,0)))","v":""},null,null,""]
["","","",null,{"$f":"IF(D67=\"\",\"\",(VLOOKUP(D67,'Membership #'!$A$1:$C$1005,2,0)))","v":""},{"$f":"IF(D67=\"\",\"\",(VLOOKUP(D67,'Membership #'!$A$1:$C$1005,3,0)))","v":""},null,null,""]
["","","",null,{"$f":"IF(D68=\"\",\"\",(VLOOKUP(D68,'Membership #'!$A$1:$C$1005,2,0)))","v":""},{"$f":"IF(D68=\"\",\"\",(VLOOKUP(D68,'Membership #'!$A$1:$C$1005,3,0)))","v":""},null,null,{"$f":"IF(G68=\"n\",\"No Time\",IF(G68=\"x\",\"Scratch\",IF(G68<>\"\",SUM(G68+H68),\"\")))","v":""}]
["","","",null,{"$f":"IF(D69=\"\",\"\",(VLOOKUP(D69,'Membership #'!$A$1:$C$1005,2,0)))","v":""},{"$f":"IF(D69=\"\",\"\",(VLOOKUP(D69,'Membership #'!$A$1:$C$1005,3,0)))","v":""},null,null,""]
["","","",null,{"$f":"IF(D70=\"\",\"\",(VLOOKUP(D70,'Membership #'!$A$1:$C$1005,2,0)))","v":""},{"$f":"IF(D70=\"\",\"\",(VLOOKUP(D70,'Membership #'!$A$1:$C$1005,3,0)))","v":""},null,null,""]
["","","",null,{"$f":"IF(D71=\"\",\"\",(VLOOKUP(D71,'Membership #'!$A$1:$C$1005,2,0)))","v":""},{"$f":"IF(D71=\"\",\"\",(VLOOKUP(D71,'Membership #'!$A$1:$C$1005,3,0)))","v":""},null,null,""]
["",{"$f":"IF(D72<>\"\",RANK(A72,A$8:A$103),\"\")","v":""},"",null,{"$f":"IF(D72=\"\",\"\",(VLOOKUP(D72,'Membership #'!$A$1:$C$1005,2,0)))","v":""},{"$f":"IF(D72=\"\",\"\",(VLOOKUP(D72,'Membership #'!$A$1:$C$1005,3,0)))","v":""},null,null,{"$f":"IF(G72=\"n\",\"No Time\",IF(G72=\"x\",\"Scratch\",IF(G72<>\"\",SUM(G72+H72),\"\")))","v":""}]
["","","",null,{"$f":"IF(D73=\"\",\"\",(VLOOKUP(D73,'Membership #'!$A$1:$C$1005,2,0)))","v":""},{"$f":"IF(D73=\"\",\"\",(VLOOKUP(D73,'Membership #'!$A$1:$C$1005,3,0)))","v":""},null,null,""]
["","","",null,{"$f":"IF(D74=\"\",\"\",(VLOOKUP(D74,'Membership #'!$A$1:$C$1005,2,0)))","v":""},{"$f":"IF(D74=\"\",\"\",(VLOOKUP(D74,'Membership #'!$A$1:$C$1005,3,0)))","v":""},null,null,""]
["","","",null,{"$f":"IF(D75=\"\",\"\",(VLOOKUP(D75,'Membership #'!$A$1:$C$1005,2,0)))","v":""},{"$f":"IF(D75=\"\",\"\",(VLOOKUP(D75,'Membership #'!$A$1:$C$1005,3,0)))","v":""},null,null,""]
["","","",null,{"$f":"IF(D76=\"\",\"\",(VLOOKUP(D76,'Membership #'!$A$1:$C$1005,2,0)))","v":""},{"$f":"IF(D76=\"\",\"\",(VLOOKUP(D76,'Membership #'!$A$1:$C$1005,3,0)))","v":""},null,null,""]
["","","",null,{"$f":"IF(D77=\"\",\"\",(VLOOKUP(D77,'Membership #'!$A$1:$C$1005,2,0)))","v":""},{"$f":"IF(D77=\"\",\"\",(VLOOKUP(D77,'Membership #'!$A$1:$C$1005,3,0)))","v":""},null,null,""]
["","","",null,{"$f":"IF(D78=\"\",\"\",(VLOOKUP(D78,'Membership #'!$A$1:$C$1005,2,0)))","v":""},{"$f":"IF(D78=\"\",\"\",(VLOOKUP(D78,'Membership #'!$A$1:$C$1005,3,0)))","v":""},null,null,""]
["","","",null,{"$f":"IF(D79=\"\",\"\",(VLOOKUP(D79,'Membership #'!$A$1:$C$1005,2,0)))","v":""},{"$f":"IF(D79=\"\",\"\",(VLOOKUP(D79,'Membership #'!$A$1:$C$1005,3,0)))","v":""},null,null,""]
["","","",null,{"$f":"IF(D80=\"\",\"\",(VLOOKUP(D80,'Membership #'!$A$1:$C$1005,2,0)))","v":""},{"$f":"IF(D80=\"\",\"\",(VLOOKUP(D80,'Membership #'!$A$1:$C$1005,3,0)))","v":""},null,null,""]
["","","",null,{"$f":"IF(D81=\"\",\"\",(VLOOKUP(D81,'Membership #'!$A$1:$C$1005,2,0)))","v":""},{"$f":"IF(D81=\"\",\"\",(VLOOKUP(D81,'Membership #'!$A$1:$C$1005,3,0)))","v":""},null,null,""]
["","","",null,{"$f":"IF(D82=\"\",\"\",(VLOOKUP(D82,'Membership #'!$A$1:$C$1005,2,0)))","v":""},{"$f":"IF(D82=\"\",\"\",(VLOOKUP(D82,'Membership #'!$A$1:$C$1005,3,0)))","v":""},null,null,""]
["","","",null,{"$f":"IF(D83=\"\",\"\",(VLOOKUP(D83,'Membership #'!$A$1:$C$1005,2,0)))","v":""},{"$f":"IF(D83=\"\",\"\",(VLOOKUP(D83,'Membership #'!$A$1:$C$1005,3,0)))","v":""},null,null,{"$f":"IF(G83=\"n\",\"No Time\",IF(G83=\"x\",\"Scratch\",IF(G83<>\"\",SUM(G83+H83),\"\")))","v":""}]
[{"$f":"IF(D84<>\"\",RAND(),\"\")","v":""},"","",null,{"$f":"IF(D84=\"\",\"\",(VLOOKUP(D84,'Membership #'!$A$1:$C$1005,2,0)))","v":""},{"$f":"IF(D84=\"\",\"\",(VLOOKUP(D84,'Membership #'!$A$1:$C$1005,3,0)))","v":""},null,null,""]
["","","",null,{"$f":"IF(D85=\"\",\"\",(VLOOKUP(D85,'Membership #'!$A$1:$C$1005,2,0)))","v":""},{"$f":"IF(D85=\"\",\"\",(VLOOKUP(D85,'Membership #'!$A$1:$C$1005,3,0)))","v":""},null,null,{"$f":"IF(G85=\"n\",\"No Time\",IF(G85=\"x\",\"Scratch\",IF(G85<>\"\",SUM(G85+H85),\"\")))","v":""}]
["","","",null,{"$f":"IF(D86=\"\",\"\",(VLOOKUP(D86,'Membership #'!$A$1:$C$1005,2,0)))","v":""},{"$f":"IF(D86=\"\",\"\",(VLOOKUP(D86,'Membership #'!$A$1:$C$1005,3,0)))","v":""},null,null,""]
["","","",null,{"$f":"IF(D87=\"\",\"\",(VLOOKUP(D87,'Membership #'!$A$1:$C$1005,2,0)))","v":""},{"$f":"IF(D87=\"\",\"\",(VLOOKUP(D87,'Membership #'!$A$1:$C$1005,3,0)))","v":""},null,null,{"$f":"IF(G87=\"n\",\"No Time\",IF(G87=\"x\",\"Scratch\",IF(G87<>\"\",SUM(G87+H87),\"\")))","v":""}]
["","","",null,{"$f":"IF(D88=\"\",\"\",(VLOOKUP(D88,'Membership #'!$A$1:$C$1005,2,0)))","v":""},{"$f":"IF(D88=\"\",\"\",(VLOOKUP(D88,'Membership #'!$A$1:$C$1005,3,0)))","v":""},null,null,""]
["","","",null,{"$f":"IF(D89=\"\",\"\",(VLOOKUP(D89,'Membership #'!$A$1:$C$1005,2,0)))","v":""},{"$f":"IF(D89=\"\",\"\",(VLOOKUP(D89,'Membership #'!$A$1:$C$1005,3,0)))","v":""},null,null,""]
["","","",null,{"$f":"IF(D90=\"\",\"\",(VLOOKUP(D90,'Membership #'!$A$1:$C$1005,2,0)))","v":""},{"$f":"IF(D90=\"\",\"\",(VLOOKUP(D90,'Membership #'!$A$1:$C$1005,3,0)))","v":""},null,null,{"$f":"IF(G90=\"n\",\"No Time\",IF(G90=\"x\",\"Scratch\",IF(G90<>\"\",SUM(G90+H90),\"\")))","v":""}]
["","","",null,{"$f":"IF(D91=\"\",\"\",(VLOOKUP(D91,'Membership #'!$A$1:$C$1005,2,0)))","v":""},{"$f":"IF(D91=\"\",\"\",(VLOOKUP(D91,'Membership #'!$A$1:$C$1005,3,0)))","v":""},null,null,""]
["","","",null,{"$f":"IF(D92=\"\",\"\",(VLOOKUP(D92,'Membership #'!$A$1:$C$1005,2,0)))","v":""},{"$f":"IF(D92=\"\",\"\",(VLOOKUP(D92,'Membership #'!$A$1:$C$1005,3,0)))","v":""},null,null,""]
["","","",null,{"$f":"IF(D93=\"\",\"\",(VLOOKUP(D93,'Membership #'!$A$1:$C$1005,2,0)))","v":""},{"$f":"IF(D93=\"\",\"\",(VLOOKUP(D93,'Membership #'!$A$1:$C$1005,3,0)))","v":""},null,null,""]
["","","",null,{"$f":"IF(D94=\"\",\"\",(VLOOKUP(D94,'Membership #'!$A$1:$C$1005,2,0)))","v":""},{"$f":"IF(D94=\"\",\"\",(VLOOKUP(D94,'Membership #'!$A$1:$C$1005,3,0)))","v":""},null,null,""]
["","","",null,{"$f":"IF(D95=\"\",\"\",(VLOOKUP(D95,'Membership #'!$A$1:$C$1005,2,0)))","v":""},{"$f":"IF(D95=\"\",\"\",(VLOOKUP(D95,'Membership #'!$A$1:$C$1005,3,0)))","v":""},null,null,""]
["","","",null,{"$f":"IF(D96=\"\",\"\",(VLOOKUP(D96,'Membership #'!$A$1:$C$1005,2,0)))","v":""},{"$f":"IF(D96=\"\",\"\",(VLOOKUP(D96,'Membership #'!$A$1:$C$1005,3,0)))","v":""},null,null,""]
["","","",null,{"$f":"IF(D97=\"\",\"\",(VLOOKUP(D97,'Membership #'!$A$1:$C$1005,2,0)))","v":""},{"$f":"IF(D97=\"\",\"\",(VLOOKUP(D97,'Membership #'!$A$1:$C$1005,3,0)))","v":""},null,null,""]
["","","",null,{"$f":"IF(D98=\"\",\"\",(VLOOKUP(D98,'Membership #'!$A$1:$C$1005,2,0)))","v":""},{"$f":"IF(D98=\"\",\"\",(VLOOKUP(D98,'Membership #'!$A$1:$C$1005,3,0)))","v":""},null,null,""]
["","","",null,{"$f":"IF(D99=\"\",\"\",(VLOOKUP(D99,'Membership #'!$A$1:$C$1005,2,0)))","v":""},{"$f":"IF(D99=\"\",\"\",(VLOOKUP(D99,'Membership #'!$A$1:$C$1005,3,0)))","v":""},null,null,""]
["","","",null,{"$f":"IF(D100=\"\",\"\",(VLOOKUP(D100,'Membership #'!$A$1:$C$1005,2,0)))","v":""},{"$f":"IF(D100=\"\",\"\",(VLOOKUP(D100,'Membership #'!$A$1:$C$1005,3,0)))","v":""},null,null,""]
["","","",null,{"$f":"IF(D101=\"\",\"\",(VLOOKUP(D101,'Membership #'!$A$1:$C$1005,2,0)))","v":""},{"$f":"IF(D101=\"\",\"\",(VLOOKUP(D101,'Membership #'!$A$1:$C$1005,3,0)))","v":""},null,null,""]
["","","",null,{"$f":"IF(D102=\"\",\"\",(VLOOKUP(D102,'Membership #'!$A$1:$C$1005,2,0)))","v":""},{"$f":"IF(D102=\"\",\"\",(VLOOKUP(D102,'Membership #'!$A$1:$C$1005,3,0)))","v":""},null,null,""]
["","","",null,{"$f":"IF(D103=\"\",\"\",(VLOOKUP(D103,'Membership #'!$A$1:$C$1005,2,0)))","v":""},{"$f":"IF(D103=\"\",\"\",(VLOOKUP(D103,'Membership #'!$A$1:$C$1005,3,0)))","v":""},null,null,""]

{"sheet":"GT_Custom","index":17,"n_rows":8,"n_cols":2,"rows_kept":8,"cut":false,"hidden":true,"merged":[]}
["C1","Custom 1"]
["C2","Custom 2"]
["C3","Custom 3"]
["C4","Custom 4"]
["C5","Custom 5"]
["C6","Custom 6"]
["C7","Custom 7"]
["C8","Custom 8"]

{"sheet":"Payouts","index":18,"n_rows":102,"n_cols":8,"rows_kept":102,"cut":false,"hidden":false,"merged":[]}
["Money","Ring #","Class"]
[{"$f":"'JUNIOR HORSE BARRELS'!O$13","v":34.730000000000004},{"$f":"'JUNIOR HORSE BARRELS'!P$13","v":0},"Jr Horse",null,null,"Sum of Money"]
[{"$f":"'JUNIOR HORSE BARRELS'!O$14","v":25.67},{"$f":"'JUNIOR HORSE BARRELS'!P$14","v":0},"Jr Horse",null,null,"Ring #","Class","Total"]
[{"$f":"'JUNIOR HORSE BARRELS'!O$15","v":15.100000000000001},{"$f":"'JUNIOR HORSE BARRELS'!P$15","v":0},"Jr Horse",null,null,0,"3D Barrels",200.00000000000003]
[{"$f":"'JUNIOR HORSE BARRELS'!O$16","v":""},{"$f":"'JUNIOR HORSE BARRELS'!P$16","v":0},"Jr Horse",null,null,null,"Adult Barrels",25]
[{"$f":"'JUNIOR HORSE BARRELS'!O$17","v":""},{"$f":"'JUNIOR HORSE BARRELS'!P$17","v":0},"Jr Horse",null,null,null,"Adult Poles",25]
[{"$f":"'JUNIOR HORSE BARRELS'!O$18","v":""},{"$f":"'JUNIOR HORSE BARRELS'!P$18","v":0},"Jr Horse",null,null,null,"Jr Horse",50]
[{"$f":"'JUNIOR HORSE BARRELS'!O$19","v":""},{"$f":"'JUNIOR HORSE BARRELS'!P$19","v":0},"Jr Horse",null,null,null,"Novice Barrels",0]
[{"$f":"'JUNIOR HORSE BARRELS'!O$20","v":""},{"$f":"'JUNIOR HORSE BARRELS'!P$20","v":0},"Jr Horse",null,null,null,"Novice Poles",0]
[{"$f":"'JUNIOR HORSE BARRELS'!O$21","v":""},{"$f":"'JUNIOR HORSE BARRELS'!P$21","v":0},"Jr Horse",null,null,null,"Open Barrels",150]
[{"$f":"'JUNIOR HORSE BARRELS'!O$22","v":""},{"$f":"'JUNIOR HORSE BARRELS'!P$22","v":0},"Jr Horse",null,null,null,"Open Poles",0]
[{"$f":"'YOUTH BARRELS'!O$13","v":28.400000000000002},{"$f":"'YOUTH BARRELS'!P$13","v":0},"Youth Barrels",null,null,null,"Youth Barrels",25]
[{"$f":"'YOUTH BARRELS'!O$14","v":20.412500000000001},{"$f":"'YOUTH BARRELS'!P$14","v":0},"Youth Barrels",null,null,null,"Youth Poles",25]
[{"$f":"'YOUTH BARRELS'!O$15","v":13.3125},{"$f":"'YOUTH BARRELS'!P$15","v":0},"Youth Barrels",null,null,"0 Total",null,500]
[{"$f":"'YOUTH BARRELS'!O$16","v":10.65},{"$f":"'YOUTH BARRELS'!P$16","v":0},"Youth Barrels",null,null,"Grand Total",null,500]
[{"$f":"'YOUTH BARRELS'!O$17","v":8.875},{"$f":"'YOUTH BARRELS'!P$17","v":0},"Youth Barrels"]
[{"$f":"'YOUTH BARRELS'!O$18","v":7.1000000000000005},{"$f":"'YOUTH BARRELS'!P$18","v":0},"Youth Barrels"]
[{"$f":"'YOUTH BARRELS'!O$19","v":""},{"$f":"'YOUTH BARRELS'!P$19","v":0},"Youth Barrels"]
[{"$f":"'YOUTH BARRELS'!O$20","v":""},{"$f":"'YOUTH BARRELS'!P$20","v":0},"Youth Barrels"]
[{"$f":"'YOUTH BARRELS'!O$21","v":""},{"$f":"'YOUTH BARRELS'!P$21","v":0},"Youth Barrels"]
[{"$f":"'YOUTH BARRELS'!O$22","v":""},{"$f":"'YOUTH BARRELS'!P$22","v":0},"Youth Barrels"]
[{"$f":"'NOVICE BARRELS'!O$13","v":92},{"$f":"'NOVICE BARRELS'!P$13","v":0},"Novice Barrels"]
[{"$f":"'NOVICE BARRELS'!O$14","v":66.125},{"$f":"'NOVICE BARRELS'!P$14","v":0},"Novice Barrels"]
[{"$f":"'NOVICE BARRELS'!O$15","v":43.125},{"$f":"'NOVICE BARRELS'!P$15","v":0},"Novice Barrels"]
[{"$f":"'NOVICE BARRELS'!O$16","v":34.5},{"$f":"'NOVICE BARRELS'!P$16","v":0},"Novice Barrels"]
[{"$f":"'NOVICE BARRELS'!O$17","v":28.75},{"$f":"'NOVICE BARRELS'!P$17","v":0},"Novice Barrels"]
[{"$f":"'NOVICE BARRELS'!O$18","v":23},{"$f":"'NOVICE BARRELS'!P$18","v":0},"Novice Barrels"]
[{"$f":"'NOVICE BARRELS'!O$19","v":""},{"$f":"'NOVICE BARRELS'!P$19","v":0},"Novice Barrels"]
[{"$f":"'NOVICE BARRELS'!O$20","v":""},{"$f":"'NOVICE BARRELS'!P$20","v":0},"Novice Barrels"]
[{"$f":"'NOVICE BARRELS'!O$21","v":""},{"$f":"'NOVICE BARRELS'!P$21","v":0},"Novice Barrels"]
[{"$f":"'NOVICE BARRELS'!O$22","v":""},{"$f":"'NOVICE BARRELS'!P$22","v":0},"Novice Barrels"]
[{"$f":"'OPEN BARRELS'!O$13","v":146.16},{"$f":"'OPEN BARRELS'!P$13","v":0},"Open Barrels"]
[{"$f":"'OPEN BARRELS'!O$14","v":115.71000000000001},{"$f":"'OPEN BARRELS'!P$14","v":0},"Open Barrels"]
[{"$f":"'OPEN BARRELS'!O$15","v":97.44},{"$f":"'OPEN BARRELS'!P$15","v":0},"Open Barrels"]
[{"$f":"'OPEN BARRELS'!O$16","v":79.17},{"$f":"'OPEN BARRELS'!P$16","v":0},"Open Barrels"]
[{"$f":"'OPEN BARRELS'!O$17","v":48.72},{"$f":"'OPEN BARRELS'!P$17","v":0},"Open Barrels"]
[{"$f":"'OPEN BARRELS'!O$18","v":36.54},{"$f":"'OPEN BARRELS'!P$18","v":0},"Open Barrels"]
[{"$f":"'OPEN BARRELS'!O$19","v":30.450000000000003},{"$f":"'OPEN BARRELS'!P$19","v":0},"Open Barrels"]
[{"$f":"'OPEN BARRELS'!O$20","v":24.36},{"$f":"'OPEN BARRELS'!P$20","v":0},"Open Barrels"]
[{"$f":"'OPEN BARRELS'!O$21","v":18.27},{"$f":"'OPEN BARRELS'!P$21","v":0},"Open Barrels"]
[{"$f":"'OPEN BARRELS'!O$22","v":12.18},{"$f":"'OPEN BARRELS'!P$22","v":0},"Open Barrels"]
[{"$f":"'YOUTH POLES'!O$13","v":28.400000000000002},{"$f":"'YOUTH POLES'!P$13","v":0},"Youth Poles"]
[{"$f":"'YOUTH POLES'!O$14","v":20.412500000000001},{"$f":"'YOUTH POLES'!P$14","v":0},"Youth Poles"]
[{"$f":"'YOUTH POLES'!O$15","v":13.3125},{"$f":"'YOUTH POLES'!P$15","v":0},"Youth Poles"]
[{"$f":"'YOUTH POLES'!O$16","v":10.65},{"$f":"'YOUTH POLES'!P$16","v":0},"Youth Poles"]
[{"$f":"'YOUTH POLES'!O$17","v":8.875},{"$f":"'YOUTH POLES'!P$17","v":0},"Youth Poles"]
[{"$f":"'YOUTH POLES'!O$18","v":7.1000000000000005},{"$f":"'YOUTH POLES'!P$18","v":0},"Youth Poles"]
[{"$f":"'YOUTH POLES'!O$19","v":""},{"$f":"'YOUTH POLES'!P$19","v":0},"Youth Poles"]
[{"$f":"'YOUTH POLES'!O$20","v":""},{"$f":"'YOUTH POLES'!P$20","v":0},"Youth Poles"]
[{"$f":"'YOUTH POLES'!O$21","v":""},{"$f":"'YOUTH POLES'!P$21","v":0},"Youth Poles"]
[{"$f":"'YOUTH POLES'!O$22","v":""},{"$f":"'YOUTH POLES'!P$22","v":0},"Youth Poles"]
[{"$f":"'NOVICE POLES'!O$13","v":75.680000000000007},{"$f":"'NOVICE POLES'!P$13","v":0},"Novice Poles"]
[{"$f":"'NOVICE POLES'!O$14","v":54.395000000000003},{"$f":"'NOVICE POLES'!P$14","v":0},"Novice Poles"]
[{"$f":"'NOVICE POLES'!O$15","v":35.475000000000001},{"$f":"'NOVICE POLES'!P$15","v":0},"Novice Poles"]
[{"$f":"'NOVICE POLES'!O$16","v":28.38},{"$f":"'NOVICE POLES'!P$16","v":0},"Novice Poles"]
[{"$f":"'NOVICE POLES'!O$17","v":23.650000000000002},{"$f":"'NOVICE POLES'!P$17","v":0},"Novice Poles"]
[{"$f":"'NOVICE POLES'!O$18","v":18.920000000000002},{"$f":"'NOVICE POLES'!P$18","v":0},"Novice Poles"]
[{"$f":"'NOVICE POLES'!O$19","v":""},{"$f":"'NOVICE POLES'!P$19","v":0},"Novice Poles"]
[{"$f":"'NOVICE POLES'!O$20","v":""},{"$f":"'NOVICE POLES'!P$20","v":0},"Novice Poles"]
[{"$f":"'NOVICE POLES'!O$21","v":""},{"$f":"'NOVICE POLES'!P$21","v":0},"Novice Poles"]
[{"$f":"'NOVICE POLES'!O$22","v":""},{"$f":"'NOVICE POLES'!P$22","v":0},"Novice Poles"]
[{"$f":"'OPEN POLES'!O$13","v":127.71000000000001},{"$f":"'OPEN POLES'!P$13","v":0},"Open Poles"]
[{"$f":"'OPEN POLES'!O$14","v":104.06},{"$f":"'OPEN POLES'!P$14","v":0},"Open Poles"]
[{"$f":"'OPEN POLES'!O$15","v":85.14},{"$f":"'OPEN POLES'!P$15","v":0},"Open Poles"]
[{"$f":"'OPEN POLES'!O$16","v":61.49},{"$f":"'OPEN POLES'!P$16","v":0},"Open Poles"]
[{"$f":"'OPEN POLES'!O$17","v":42.57},{"$f":"'OPEN POLES'!P$17","v":0},"Open Poles"]
[{"$f":"'OPEN POLES'!O$18","v":28.38},{"$f":"'OPEN POLES'!P$18","v":0},"Open Poles"]
[{"$f":"'OPEN POLES'!O$19","v":14.19},{"$f":"'OPEN POLES'!P$19","v":0},"Open Poles"]
[{"$f":"'OPEN POLES'!O$20","v":9.4600000000000009},{"$f":"'OPEN POLES'!P$20","v":0},"Open Poles"]
[{"$f":"'OPEN POLES'!O$21","v":""},{"$f":"'OPEN POLES'!P$21","v":0},"Open Poles"]
[{"$f":"'OPEN POLES'!O$22","v":""},{"$f":"'OPEN POLES'!P$22","v":0},"Open Poles"]
[{"$f":"'3D Barrels'!O13","v":0},{"$f":"'3D Barrels'!P13","v":0},"3D Barrels"]
[{"$f":"'3D Barrels'!O14","v":0},{"$f":"'3D Barrels'!P14","v":0},"3D Barrels"]
[{"$f":"'3D Barrels'!O15","v":0},{"$f":"'3D Barrels'!P15","v":0},"3D Barrels"]
[{"$f":"'3D Barrels'!O16","v":0},{"$f":"'3D Barrels'!P16","v":0},"3D Barrels"]
[{"$f":"'3D Barrels'!O17","v":0},{"$f":"'3D Barrels'!P17","v":0},"3D Barrels"]
[{"$f":"'3D Barrels'!O19","v":0},{"$f":"'3D Barrels'!P19","v":0},"3D Barrels"]
[{"$f":"'3D Barrels'!O20","v":0},{"$f":"'3D Barrels'!P20","v":0},"3D Barrels"]
[{"$f":"'3D Barrels'!O21","v":0},{"$f":"'3D Barrels'!P21","v":0},"3D Barrels"]
[{"$f":"'3D Barrels'!O22","v":0},{"$f":"'3D Barrels'!P22","v":0},"3D Barrels"]
[{"$f":"'3D Barrels'!O23","v":0},{"$f":"'3D Barrels'!P23","v":0},"3D Barrels"]
[{"$f":"'3D Barrels'!O25","v":0},{"$f":"'3D Barrels'!P25","v":0},"3D Barrels"]
[{"$f":"'3D Barrels'!O26","v":0},{"$f":"'3D Barrels'!P26","v":0},"3D Barrels"]
[{"$f":"'3D Barrels'!O27","v":0},{"$f":"'3D Barrels'!P27","v":0},"3D Barrels"]
[{"$f":"'3D Barrels'!O28","v":0},{"$f":"'3D Barrels'!P28","v":0},"3D Barrels"]
[{"$f":"'3D Barrels'!O29","v":0},{"$f":"'3D Barrels'!P29","v":0},"3D Barrels"]
[{"$f":"'Adult Green Barrels'!O$13","v":25.2},{"$f":"'Adult Green Barrels'!P$13","v":0},"Adult Barrels"]
[{"$f":"'Adult Green Barrels'!O$14","v":16.8},{"$f":"'Adult Green Barrels'!P$14","v":0},"Adult Barrels"]
[{"$f":"'Adult Green Barrels'!O$15","v":""},{"$f":"'Adult Green Barrels'!P$15","v":0},"Adult Barrels"]
[{"$f":"'Adult Green Barrels'!O$16","v":""},{"$f":"'Adult Green Barrels'!P$16","v":0},"Adult Barrels"]
[{"$f":"'Adult Green Barrels'!O$17","v":""},{"$f":"'Adult Green Barrels'!P$17","v":0},"Adult Barrels"]
[{"$f":"'Adult Green Barrels'!O$18","v":""},{"$f":"'Adult Green Barrels'!P$18","v":0},"Adult Barrels"]
[{"$f":"'Adult Green Barrels'!O$19","v":""},{"$f":"'Adult Green Barrels'!P$19","v":0},"Adult Barrels"]
[{"$f":"'Adult Green Barrels'!O$20","v":""},{"$f":"'Adult Green Barrels'!P$20","v":0},"Adult Barrels"]
[{"$f":"'ADULT GREEN POLES'!O$13","v":25.2},{"$f":"'ADULT GREEN POLES'!P$13","v":0},"Adult Poles"]
[{"$f":"'ADULT GREEN POLES'!O$14","v":16.8},{"$f":"'ADULT GREEN POLES'!P$14","v":0},"Adult Poles"]
[{"$f":"'ADULT GREEN POLES'!O$15","v":""},{"$f":"'ADULT GREEN POLES'!P$15","v":0},"Adult Poles"]
[{"$f":"'ADULT GREEN POLES'!O$16","v":""},{"$f":"'ADULT GREEN POLES'!P$16","v":0},"Adult Poles"]
[{"$f":"'ADULT GREEN POLES'!O$17","v":""},{"$f":"'ADULT GREEN POLES'!P$17","v":0},"Adult Poles"]
[{"$f":"'ADULT GREEN POLES'!O$18","v":""},{"$f":"'ADULT GREEN POLES'!P$18","v":0},"Adult Poles"]
[{"$f":"'ADULT GREEN POLES'!O$19","v":""},{"$f":"'ADULT GREEN POLES'!P$19","v":0},"Adult Poles"]
[{"$f":"'ADULT GREEN POLES'!O$20","v":""},{"$f":"'ADULT GREEN POLES'!P$20","v":0},"Adult Poles"]

{"sheet":"Show Report","index":19,"n_rows":25,"n_cols":5,"rows_kept":25,"cut":false,"hidden":false,"merged":[[0,0,0,4]]}
["MBRA Jackpot - Windsor - July 24 & 25, 2021"]
[]
["INCOME"]
["Head Fee",2250]
["Drug Fee",225]
["Class Fee Day 1",1090]
["Class Fee Day 2",1120]
["3D",585]
["Added Day 1",600]
["Added Day 2",600]
["3D Sponsor",100]
[]
[null,{"$f":"SUM(B4:B11)","v":6570},null,{"$f":"SUM(B13)","v":6570}]
[]
["EXPENSES"]
["Heather/Timer"]
["Day 1 Payouts (15%)",null,-2124]
["Day 2 Payouts (15%)",null,-1552,null,{"$f":"SUM(C17:C18)","v":-3676}]
["Kids Prizes"]
["Ground Rental"]
["User Fee 69 @ $5"]
[null,null,{"$f":"SUM(C16:C21)","v":-3676},{"$f":"SUM(C22)","v":-3676}]
["Total Income"]
[]
["CASH ON HAND",null,null,{"$f":"SUM(D13:D22)","v":2894}]

{"sheet":"Sheet3","index":20,"n_rows":0,"n_cols":0,"rows_kept":0,"cut":false,"hidden":false,"merged":[]}