{"text_format":"1","workbook":"xlsx","n_sheets":21,"sheets":["Membership #","Stall List","MBRA ","Sheet1","SMALLFRY","PONY","EXHIBITION Barrels","JUNIOR HORSE BARRELS","Adult Green Barrels","ADULT GREEN POLES","YOUTH BARRELS","YOUTH POLES","NOVICE BARRELS","OPEN BARRELS","NOVICE POLES","OPEN POLES","3D Barrels","GT_Custom","Payouts","Show Report","Sheet3"],"not_rendered":{"charts":0,"images":0,"macros":1,"external_links":1,"defined_names":17,"comments":0,"pivot_tables":1},"unopened":[],"bounds":{"document_bytes":16777216,"sheet_cells":100000,"rows_first":2000,"rows_last":500,"rows_between":2000,"halvings":0,"cell_chars":16384,"cell_head_chars":4096},"cells_cut":0,"cells_raw":0,"read":"whole","date_system":"1900"}

{"sheet":"Membership #","index":0,"n_rows":471,"n_cols":3,"rows_kept":471,"cut":false,"hidden":false,"merged":[]}
[19,"Jacie Burke","She's Just That Sassy"]
[77,"Travis Patterson","Dacs Breezin Rome"]
[969,"Kenzie Cook","Pocos Lady Emerald"]
[973,"Sara Ivey","Ms Heavenly Gator"]
[81,"Peyton Lynds","Roxy"]
[82,"Scotia MacEachern","Hick-a-Licious"]
{"$rows_left_out":466}
{"sheet":"Stall List","index":1,"n_rows":116,"n_cols":6,"rows_kept":116,"cut":false,"hidden":false,"merged":[[0,0,0,3]]}
["Tom Burt & Mark McGuire Memorial Jackpot  2021"]
[null,"RING #      ","NAME","HORSE NAME",null,"Stall request info"]
[1,549,{"$f":"IF(B3=\"\",\"\",(VLOOKUP(B3,'Membership #'!$A$1:$C$1005,2,FALSE)))","v":"Chris MacLean"},{"$f":"IF(B3=\"\",\"\",(VLOOKUP(B3,'Membership #'!$A$1:$C$1005,3,FALSE)))","v":"Lena`s Little Hayday"}]
[2,591,{"$f":"IF(B4=\"\",\"\",(VLOOKUP(B4,'Membership #'!$A$1:$C$1005,2,FALSE)))","v":"Wendy MacLean"},{"$f":"IF(B4=\"\",\"\",(VLOOKUP(B4,'Membership #'!$A$1:$C$1005,3,FALSE)))","v":"White Sox N Flyin"}]
[3,532,{"$f":"IF(B5=\"\",\"\",(VLOOKUP(B5,'Membership #'!$A$1:$C$1005,2,FALSE)))","v":"Gracie MacLean"},{"$f":"IF(B5=\"\",\"\",(VLOOKUP(B5,'Membership #'!$A$1:$C$1005,3,FALSE)))","v":"Secret"}]
[4,563,{"$f":"IF(B6=\"\",\"\",(VLOOKUP(B6,'Membership #'!$A$1:$C$1005,2,FALSE)))","v":"Kevin Bateman"},{"$f":"IF(B6=\"\",\"\",(VLOOKUP(B6,'Membership #'!$A$1:$C$1005,3,FALSE)))","v":"Jess Chasin A Hobby"}]
{"$rows_left_out":111}
{"sheet":"MBRA ","index":2,"n_rows":114,"n_cols":24,"rows_kept":114,"cut":false,"hidden":false,"merged":[[0,0,0,12]]}
["Tom Burt & Mark McGuire Memorial JACKPOT Aug 21 & 22, 2021"]
[null,"RING #      ","NAME","HORSE NAME","Exhibition ",null," Day #1 Fee","3-D Barrels","Day /2 Fee","Admin Fee","Drug Fee","Trailer Fee","Total","Etransfrer"]
[1,549,{"$f":"IF(B3=\"\",\"\",(VLOOKUP(B3,'Membership #'!$A$1:$C$1005,2,FALSE)))","v":"Chris MacLean"},{"$f":"IF(B3=\"\",\"\",(VLOOKUP(B3,'Membership #'!$A$1:$C$1005,3,FALSE)))","v":"Lena`s Little Hayday"},null,null,20,15,40,50,5,40,{"$f":"SUM(G3:L3)","v":170},null,null,null,{"$f":"SUM(M3:P3)","v":170}]
[2,591,{"$f":"IF(B4=\"\",\"\",(VLOOKUP(B4,'Membership #'!$A$1:$C$1005,2,FALSE)))","v":"Wendy MacLean"},{"$f":"IF(B4=\"\",\"\",(VLOOKUP(B4,'Membership #'!$A$1:$C$1005,3,FALSE)))","v":"White Sox N Flyin"},null,null,10,15,10,50,5,null,{"$f":"SUM(G4:K4)","v":90},null,null,null,{"$f":"SUM(M4:P4)","v":90}]
[3,532,{"$f":"IF(B5=\"\",\"\",(VLOOKUP(B5,'Membership #'!$A$1:$C$1005,2,FALSE)))","v":"Gracie MacLean"},{"$f":"IF(B5=\"\",\"\",(VLOOKUP(B5,'Membership #'!$A$1:$C$1005,3,FALSE)))","v":"Secret"},null,null,5,null,15,50,5,null,75,null,null,null,75]
[4,563,{"$f":"IF(B6=\"\",\"\",(VLOOKUP(B6,'Membership #'!$A$1:$C$1005,2,FALSE)))","v":"Kevin Bateman"},{"$f":"IF(B6=\"\",\"\",(VLOOKUP(B6,'Membership #'!$A$1:$C$1005,3,FALSE)))","v":"Jess Chasin A Hobby"},null,null,10,15,10,50,5,null,90,null,null,null,90]
{"$rows_left_out":109}
{"sheet":"Sheet1","index":3,"n_rows":0,"n_cols":0,"rows_kept":0,"cut":false,"hidden":false,"merged":[]}

{"sheet":"SMALLFRY","index":4,"n_rows":51,"n_cols":21,"rows_kept":51,"cut":false,"hidden":false,"merged":[[37,1,40,1],[37,7,40,7],[21,0,24,0],[21,2,24,2],[21,3,24,3],[21,4,24,4],[35,1,35,9],[21,1,24,1],[37,8,40,8],[37,9,40,9],[21,5,24,5],[37,0,40,0],[37,2,40,2],[37,3,40,3],[37,4,40,4],[37,5,40,5],[1,20,4,20],[1,11,4,11],[1,12,4,12],[1,13,4,13],[1,14,4,14],[1,15,4,15],[1,16,4,16],[1,19,4,19],[36,1,36,9],[37,6,40,6],[2,0,5,0],[1,17,4,17],[1,18,4,18],[2,3,5,3],[2,4,5,4],[2,5,5,5],[2,7,5,7],[2,8,5,8],[2,2,5,2],[21,6,24,6],[21,7,24,7],[21,8,24,8],[21,9,24,9],[20,1,20,9],[0,1,0,9],[1,1,1,9],[2,1,5,1],[19,1,19,9],[2,6,5,6],[2,9,5,9]]}
[null,"Tom Burt & Mark McGuire Memorial Jackpot Aug 22, 2021",null,null,null,null,null,null,null,null,null,"High Point Smallfry"]
[null,"SMALLFRY  BARRELS",null,null,null,null,null,null,null,null,null,"RING #      ","NAME","HORSE NAME","Barrels","Poles","Dash","Barrels","Poles","Dash","Total"]
["Rand Draw","Running Order","RING #      ","NAME","HORSE NAME","TIME","PENALTY ","TOTAL","PLACINGS","POINTS"]
[]
[]
[null,null,null,null,null,null,null,null,null,null,null,908,{"$f":"IF(L6=\"\",0,(VLOOKUP(L6,'Membership #'!$A$1:$C$1005,2,0)))","v":"Josie Higgins"},{"$f":"IF(L6=\"\",0,(VLOOKUP(L6,'Membership #'!$A$1:$C$1005,3,0)))","v":"Rocket Man"},10,10,10,null,null,null,{"$f":"SUM(O6:T6)","v":30}]
{"$rows_left_out":46}
{"sheet":"PONY","index":5,"n_rows":52,"n_cols":21,"rows_kept":52,"cut":false,"hidden":false,"merged":[[37,0,40,0],[37,2,40,2],[37,3,40,3],[37,4,40,4],[20,0,23,0],[20,2,23,2],[20,3,23,3],[20,4,23,4],[20,1,23,1],[2,0,5,0],[2,3,5,3],[2,4,5,4],[1,20,4,20],[1,11,4,11],[1,12,4,12],[1,13,4,13],[1,14,4,14],[1,15,4,15],[1,16,4,16],[2,1,5,1],[0,1,0,9],[1,1,1,9],[18,1,18,9],[19,1,19,9],[2,9,5,9],[2,5,5,5],[2,7,5,7],[2,8,5,8],[2,6,5,6],[2,2,5,2],[24,12,24,20],[26,12,26,20],[1,17,4,17],[1,18,4,18],[1,19,4,19],[37,6,40,6],[37,7,40,7],[37,8,40,8],[37,1,40,1],[20,7,23,7],[20,8,23,8],[20,6,23,6],[20,5,23,5],[37,5,40,5],[35,1,35,9],[37,9,40,9],[20,9,23,9],[36,1,36,9]]}
[null,"Tom Burt & Mark McGuire Memorial Jackpot Aug 22, 2021",null,null,null,null,null,null,null,null,null,"High Point Pony"]
[null,"PONY  BARRELS",null,null,null,null,null,null,null,null,null,"RING #      ","NAME","HORSE NAME","Barrels","Poles","Dash","Barrels","Poles","Dash","Total"]
["Rand Draw","Running Order","RING #      ","NAME","HORSE NAME","TIME","PENALTY ","TOTAL","PLACINGS","POINTS"]
[]
[]
[null,null,null,null,null,null,null,null,null,null,null,815,{"$f":"IF(L6=\"\",0,(VLOOKUP(L6,'Membership #'!$A$1:$C$1005,2,0)))","v":"Brooke Kennedy"},{"$f":"IF(L6=\"\",0,(VLOOKUP(L6,'Membership #'!$A$1:$C$1005,3,0)))","v":"Tic Toc Teazer"},10,8,5,null,null,null,{"$f":"SUM(O6:T6)","v":23}]
{"$rows_left_out":47}
{"sheet":"EXHIBITION Barrels","index":6,"n_rows":73,"n_cols":13,"rows_kept":73,"cut":false,"hidden":false,"merged":[[5,12,5,15],[0,0,0,10],[1,0,1,10],[2,0,2,3],[2,6,2,10],[3,0,6,0],[3,1,6,1],[3,2,6,2],[3,3,6,3],[3,4,6,4],[3,9,6,9],[3,10,6,10],[3,5,6,5],[3,6,6,6],[3,7,6,7],[3,8,6,8]]}
[2021,null,null,null,null,null,null,null,null,null,null,null,"x=Scratch"]
["EXHIBITION BARREL RACE",null,null,null,null,null,null,null,null,null,null,null,"n=No Time"]
["# Entries:",null,null,null,{"$f":"COUNTIF($D$8:$D$72,\">0\")","v":0}]
["Rand Draw","Seed",null,"RING #      ","NAME","HORSE NAME","TIME","PENALTY ","TOTAL","PLACINGS","POINTS"]
[]
[]
{"$rows_left_out":68}
{"sheet":"JUNIOR HORSE BARRELS","index":7,"n_rows":101,"n_cols":26,"rows_kept":101,"cut":false,"hidden":false,"merged":[[5,12,5,15],[0,0,0,10],[1,0,1,10],[2,0,2,3],[2,6,2,10],[3,0,6,0],[3,1,6,1],[3,2,6,2],[3,3,6,3],[3,4,6,4],[3,9,6,9],[3,10,6,10],[3,5,6,5],[3,6,6,6],[3,7,6,7],[3,8,6,8]]}
["Tom Burt & Mark McGuire Memorial Jackpot Aug 22, 2021",null,null,null,null,null,null,null,null,null,null,null,"x=Scratch"]
["JUNIOR HORSE BARRELS",null,null,null,null,null,null,null,null,null,null,null,"n=No Time"]
["# Enteries:",null,null,null,{"$f":"COUNTIF($D$8:$D$100,\">0\")","v":3},null,null,null,null,null,null,null,null,null,null,null,null,"Don't Erase these numbers below!!"]
["Rand Draw","Seed",null,"RING #      ","NAME","HORSE NAME","TIME","PENALTY ","TOTAL","PLACINGS","POINTS",null,null,null,null,null,null,{"$f":"IF(N9=2,7,IF(N9=3,6,IF(N9=4,5,IF(N9=5,4,IF(AND(N9>5,N11>600),3,IF(AND(N9>5,N11<600,N11>299.99),2,IF(AND(N9>5,N11<300),1,8)))))))","v":6},1,2,3,4,5,6,7,8]
[null,null,null,null,null,null,null,null,null,null,null,null,null,null,null,null,null,null,299,"$300-","$600 -"]
[null,null,null,null,null,null,null,null,null,null,null,null,"JUNIOR HORSE BARRELS",null,null,null,null,null,"or less",599,"More","5 Entries","4 Entries","3 Entries","2 Entries"]
{"$rows_left_out":96}
{"sheet":"Adult Green Barrels","index":8,"n_rows":101,"n_cols":26,"rows_kept":101,"cut":false,"hidden":false,"merged":[[5,12,5,15],[0,0,0,10],[1,0,1,10],[2,0,2,3],[2,6,2,10],[3,0,6,0],[3,1,6,1],[3,2,6,2],[3,3,6,3],[3,4,6,4],[3,9,6,9],[3,10,6,10],[3,5,6,5],[3,6,6,6],[3,7,6,7],[3,8,6,8]]}
["Tom Burt & Mark McGuire Memorial Jackpot Aug 22, 2021",null,null,null,null,null,null,null,null,null,null,null,"x=Scratch"]
["Adult Green Barrels ",null,null,null,null,null,null,null,null,null,null,null,"n=No Time"]
["# Enteries:",null,null,null,{"$f":"COUNTIF($D$8:$D$100,\">0\")","v":1},null,null,null,null,null,null,null,null,null,null,null,null,"Don't Erase these numbers below!!"]
["Rand Draw","Seed",null,"RING #      ","NAME","HORSE NAME","TIME","PENALTY ","TOTAL","PLACINGS","POINTS",null,null,null,null,null,null,{"$f":"IF(N9=2,7,IF(N9=3,6,IF(N9=4,5,IF(N9=5,4,IF(AND(N9>5,N11>600),3,IF(AND(N9>5,N11<600,N11>299.99),2,IF(AND(N9>5,N11<300),1,8)))))))","v":7},1,2,3,4,5,6,7,8]
[null,null,null,null,null,null,null,null,null,null,null,null,null,null,null,null,null,null,299,"$300-","$600 -"]
[null,null,null,null,null,null,null,null,null,null,null,null,"Adult Green Barrels ",null,null,null,null,null,"or less",599,"More","5 Entries","4 Entries","3 Entries","2 Entries"]
{"$rows_left_out":96}
{"sheet":"ADULT GREEN POLES","index":9,"n_rows":101,"n_cols":26,"rows_kept":101,"cut":false,"hidden":false,"merged":[[5,12,5,15],[0,0,0,10],[1,0,1,10],[2,0,2,3],[2,6,2,10],[3,0,6,0],[3,1,6,1],[3,2,6,2],[3,3,6,3],[3,4,6,4],[3,9,6,9],[3,10,6,10],[3,5,6,5],[3,6,6,6],[3,7,6,7],[3,8,6,8]]}
["Tom Burt & Mark McGuire Memorial Jackpot Aug 22, 2021",null,null,null,null,null,null,null,null,null,null,null,"x=Scratch"]
["ADULT GREEN POLES",null,null,null,null,null,null,null,null,null,null,null,"n=No Time"]
["# Enteries:",null,null,null,{"$f":"COUNTIF($D$8:$D$100,\">0\")","v":1},null,null,null,null,null,null,null,null,null,null,null,null,"Don't Erase these numbers below!!"]
["Rand Draw","Seed","Running Order","RING #      ","NAME","HORSE NAME","TIME","PENALTY ","TOTAL","PLACINGS","POINTS",null,null,null,null,null,null,{"$f":"IF(N9=2,7,IF(N9=3,6,IF(N9=4,5,IF(N9=5,4,IF(AND(N9>5,N11>600),3,IF(AND(N9>5,N11<600,N11>299.99),2,IF(AND(N9>5,N11<300),1,8)))))))","v":7},1,2,3,4,5,6,7,8]
[null,null,null,null,null,null,null,null,null,null,null,null,null,null,null,null,null,null,299,"$300-","$600 -"]
[null,null,null,null,null,null,null,null,null,null,null,null,"ADULT GREEN POLES",null,null,null,null,null,"or less",599,"More","5 Entries","4 Entries","3 Entries","2 Entries"]
{"$rows_left_out":96}
{"sheet":"YOUTH BARRELS","index":10,"n_rows":42,"n_cols":26,"rows_kept":42,"cut":false,"hidden":false,"merged":[[3,6,6,6],[3,7,6,7],[3,8,6,8],[5,12,5,15],[0,0,0,10],[1,0,1,10],[2,0,2,3],[2,6,2,10],[3,0,6,0],[3,1,6,1],[3,2,6,2],[3,3,6,3],[3,4,6,4],[3,9,6,9],[3,10,6,10],[3,5,6,5]]}
["Tom Burt & Mark McGuire Memorial Jackpot Aug 22, 2021",null,null,null,null,null,null,null,null,null,null,null,"x=Scratch"]
["YOUTH BARRELS",null,null,null,null,null,null,null,null,null,null,null,"n=No Time"]
["# Enteries:",null,null,null,{"$f":"COUNTIF($D$8:$D$41,\">0\")","v":16},null,null,null,null,null,null,null,null,null,null,null,null,"Don't Erase these numbers below!!"]
["Rand Draw","Seed","Running Order","RING #      ","NAME","HORSE NAME","TIME","PENALTY ","TOTAL","PLACINGS","POINTS",null,null,null,null,null,null,{"$f":"IF(N9=2,7,IF(N9=3,6,IF(N9=4,5,IF(N9=5,4,IF(AND(N9>5,N11>600),3,IF(AND(N9>5,N11<600,N11>299.99),2,IF(AND(N9>5,N11<300),1,8)))))))","v":1},1,2,3,4,5,6,7,8]
[null,null,null,null,null,null,null,null,null,null,null,null,null,null,null,null,null,null,299,"$300-","$600 -"]
[null,null,null,null,null,null,null,null,null,null,null,null,"YOUTH BARRELS",null,null,null,null,null,"or less",599,"More","5 Entries","4 Entries","3 Entries","2 Entries"]
{"$rows_left_out":37}
{"sheet":"YOUTH POLES","index":11,"n_rows":100,"n_cols":26,"rows_kept":100,"cut":false,"hidden":false,"merged":[[5,12,5,15],[0,0,0,10],[1,0,1,10],[2,0,2,3],[2,6,2,10],[3,0,6,0],[3,1,6,1],[3,2,6,2],[3,3,6,3],[3,4,6,4],[3,9,6,9],[3,10,6,10],[3,5,6,5],[3,6,6,6],[3,7,6,7],[3,8,6,8]]}
["Tom Burt & Mark McGuire Memorial Jackpot Aug 22, 2021",null,null,null,null,null,null,null,null,null,null,null,"x=Scratch"]
["YOUTH POLES",null,null,null,null,null,null,null,null,null,null,null,"n=No Time"]
["# Enteries:",null,null,null,{"$f":"COUNTIF($D$8:$D$99,\">0\")","v":15},null,null,null,null,null,null,null,null,null,null,null,null,"Don't Erase these numbers below!!"]
["Rand Draw","Seed","Running Order","RING #      ","NAME","HORSE NAME","TIME","PENALTY ","TOTAL","PLACINGS","POINTS",null,null,null,null,null,null,{"$f":"IF(N9=2,7,IF(N9=3,6,IF(N9=4,5,IF(N9=5,4,IF(AND(N9>5,N11>600),3,IF(AND(N9>5,N11<600,N11>299.99),2,IF(AND(N9>5,N11<300),1,8)))))))","v":1},1,2,3,4,5,6,7,8]
[null,null,null,null,null,null,null,null,null,null,null,null,null,null,null,null,null,null,299,"$300-","$600 -"]
[null,null,null,null,null,null,null,null,null,null,null,null,"YOUTH POLES",null,null,null,null,null,"or less",599,"More","5 Entries","4 Entries","3 Entries","2 Entries"]
{"$rows_left_out":95}
{"sheet":"NOVICE BARRELS","index":12,"n_rows":100,"n_cols":26,"rows_kept":100,"cut":false,"hidden":false,"merged":[[5,12,5,15],[0,0,0,10],[1,0,1,10],[2,0,2,3],[2,6,2,10],[3,0,6,0],[3,1,6,1],[3,2,6,2],[3,3,6,3],[3,4,6,4],[3,9,6,9],[3,10,6,10],[3,5,6,5],[3,6,6,6],[3,7,6,7],[3,8,6,8]]}
["Tom Burt & Mark McGuire Memorial Jackpot Aug 22, 2021",null,null,null,null,null,null,null,null,null,null,null,"x=Scratch"]
["NOVICE BARRELS",null,null,null,null,null,null,null,null,null,null,null,"n=No Time"]
["# Enteries:",null,null,null,{"$f":"COUNTIF($D$8:$D$99,\">0\")","v":26},null,null,null,null,null,null,null,null,null,null,null,null,"Don't Erase these numbers below!!"]
["Rand Draw","Seed","Running Order","RING #      ","NAME","HORSE NAME","TIME","PENALTY ","TOTAL","PLACINGS","POINTS",null,null,null,null,null,null,{"$f":"IF(N9=2,7,IF(N9=3,6,IF(N9=4,5,IF(N9=5,4,IF(AND(N9>5,N11>600),3,IF(AND(N9>5,N11<600,N11>299.99),2,IF(AND(N9>5,N11<300),1,8)))))))","v":1},1,2,3,4,5,6,7,8]
[null,null,null,null,null,null,null,null,null,null,null,null,null,null,null,null,null,null,299,"$300-","$600 -"]
[null,null,null,null,null,null,null,null,null,null,null,null,"NOVICE BARRELS",null,null,null,null,null,"or less",599,"More","5 Entries","4 Entries","3 Entries","2 Entries"]
{"$rows_left_out":95}
{"sheet":"OPEN BARRELS","index":13,"n_rows":96,"n_cols":26,"rows_kept":96,"cut":false,"hidden":false,"merged":[[5,12,5,15],[0,0,0,10],[1,0,1,10],[2,0,2,3],[2,6,2,10],[3,0,6,0],[3,1,6,1],[3,2,6,2],[3,3,6,3],[3,4,6,4],[3,9,6,9],[3,10,6,10],[3,5,6,5],[3,6,6,6],[3,7,6,7],[3,8,6,8]]}
["Tom Burt & Mark McGuire Memorial Jackpot Aug 22, 2021",null,null,null,null,null,null,null,null,null,null,null,"x=Scratch"]
["OPEN BARRELS",null,null,null,null,null,null,null,null,null,null,null,"n=No Time"]
["# Enteries:",null,null,null,{"$f":"COUNTIF($D$8:$D$95,\">0\")","v":28},null,null,null,null,null,null,null,"Sponsored by Clarence Farm Services",null,null,null,null,"Don't Erase these numbers below!!"]
["Rand Draw","Seed",null,"RING #      ","NAME","HORSE NAME","TIME","PENALTY ","TOTAL","PLACINGS","POINTS",null,null,null,null,null,null,{"$f":"IF(N9=2,7,IF(N9=3,6,IF(N9=4,5,IF(N9=5,4,IF(AND(N9>5,N11>600),3,IF(AND(N9>5,N11<600,N11>299.99),2,IF(AND(N9>5,N11<300),1,8)))))))","v":3},1,2,3,4,5,6,7,8]
[null,null,null,null,null,null,null,null,null,null,null,null,null,null,null,null,null,null,299,"$300-","$600 -"]
[null,null,null,null,null,null,null,null,null,null,null,null,"OPEN BARRELS",null,null,null,null,null,"or less",599,"More","5 Entries","4 Entries","3 Entries","2 Entries"]
{"$rows_left_out":91}
{"sheet":"NOVICE POLES","index":14,"n_rows":98,"n_cols":26,"rows_kept":98,"cut":false,"hidden":false,"merged":[[5,12,5,15],[0,0,0,10],[1,0,1,10],[2,0,2,3],[2,6,2,10],[3,0,6,0],[3,1,6,1],[3,2,6,2],[3,3,6,3],[3,4,6,4],[3,9,6,9],[3,10,6,10],[3,5,6,5],[3,6,6,6],[3,7,6,7],[3,8,6,8]]}
["Tom Burt & Mark McGuire Memorial Jackpot Aug 22, 2021",null,null,null,null,null,null,null,null,null,null,null,"x=Scratch"]
["NOVICE POLES",null,null,null,null,null,null,null,null,null,null,null,"n=No Time"]
["# Enteries:",null,null,null,{"$f":"COUNTIF($D$8:$D$97,\">0\")","v":19},null,null,null,null,null,null,null,null,null,null,null,null,"Don't Erase these numbers below!!"]
["Rand Draw","Seed","Running Order","RING #      ","NAME","HORSE NAME","TIME","PENALTY ","TOTAL","PLACINGS","POINTS",null,null,null,null,null,null,{"$f":"IF(N9=2,7,IF(N9=3,6,IF(N9=4,5,IF(N9=5,4,IF(AND(N9>5,N11>600),3,IF(AND(N9>5,N11<600,N11>299.99),2,IF(AND(N9>5,N11<300),1,8)))))))","v":1},1,2,3,4,5,6,7,8]
[null,null,null,null,null,null,null,null,null,null,null,null,null,null,null,null,null,null,299,"$300-","$600 -"]
[null,null,null,null,null,null,null,null,null,null,null,null,"NOVICE POLES",null,null,null,null,null,"or less",599,"More","5 Entries","4 Entries","3 Entries","2 Entries"]
{"$rows_left_out":93}
{"sheet":"OPEN POLES","index":15,"n_rows":101,"n_cols":26,"rows_kept":101,"cut":false,"hidden":false,"merged":[[5,12,5,15],[3,3,6,3],[3,7,6,7],[3,10,6,10],[3,8,6,8],[3,9,6,9],[0,0,0,10],[1,0,1,10],[2,6,2,10],[3,0,6,0],[3,4,6,4],[3,5,6,5],[3,6,6,6],[3,1,6,1],[2,0,2,3],[3,2,6,2]]}
["Tom Burt & Mark McGuire Memorial Jackpot Aug 22, 2021",null,null,null,null,null,null,null,null,null,null,null,"x=Scratch"]
["OPEN POLES",null,null,null,null,null,null,null,null,null,null,null,"n=No Time"]
["# Enteries:",null,null,null,{"$f":"COUNTIF($D$8:$D$100,\">0\")","v":20},null,null,null,null,null,null,null,null,null,null,null,null,"Don't Erase these numbers below!!"]
["Rand Draw","Seed","Running Order","RING #      ","NAME","HORSE NAME","TIME","PENALTY ","TOTAL","PLACINGS","POINTS",null,null,null,null,null,null,{"$f":"IF(N9=2,7,IF(N9=3,6,IF(N9=4,5,IF(N9=5,4,IF(AND(N9>5,N11>600),3,IF(AND(N9>5,N11<600,N11>299.99),2,IF(AND(N9>5,N11<300),1,8)))))))","v":2},1,2,3,4,5,6,7,8]
[null,null,null,null,null,null,null,null,null,null,null,null,null,null,null,null,null,null,299,"$300-","$600 -"]
[null,null,null,null,null,null,null,null,null,null,null,null,"OPEN Poles",null,null,null,null,null,"or less",599,"More","5 Entries","4 Entries","3 Entries","2 Entries"]
{"$rows_left_out":96}
{"sheet":"3D Barrels","index":16,"n_rows":103,"n_cols":22,"rows_kept":103,"cut":false,"hidden":false,"merged":[[5,12,5,15],[0,0,0,10],[1,0,1,10],[2,0,2,3],[2,6,2,10],[3,0,6,0],[3,1,6,1],[3,2,6,2],[3,3,6,3],[3,4,6,4],[3,9,6,9],[3,10,6,10],[3,5,6,5],[3,6,6,6],[3,7,6,7],[3,8,6,8]]}
["Tom Burt & Mark McGuire Memorial Jackpot Aug 21, 2021",null,null,null,null,null,null,null,null,null,null,null,"x=Scratch"]
["3D Barrels",null,null,null,null,null,null,null,null,null,null,null,"n=No Time"]
["# Enteries:",null,null,null,{"$f":"COUNTIF($D$8:$D$102,\">0\")","v":0},null,null,null,null,null,null,null,null,null,null,null,null,"1 -29 horses per class pay 3 placings"]
["Rand Draw","Seed","Running Order","RING #      ","NAME","HORSE NAME","TIME","PENALTY ","TOTAL","PLACINGS","POINTS",null,"3D Sponsored By ",null,null,null,null,"30 -39 horses per class pay 4 placings"]
[null,null,null,null,null,null,null,null,null,null,null,null,null,null,null,null,null,"40 and over horses per class pay 5 placings"]
[null,null,null,null,null,null,null,null,null,null,null,null,"3D Barrels"]
{"$rows_left_out":98}
{"sheet":"GT_Custom","index":17,"n_rows":8,"n_cols":2,"rows_kept":8,"cut":false,"hidden":true,"merged":[]}
["C1","Custom 1"]
["C2","Custom 2"]
["C3","Custom 3"]
["C4","Custom 4"]
["C5","Custom 5"]
["C6","Custom 6"]
{"$rows_left_out":3}
{"sheet":"Payouts","index":18,"n_rows":102,"n_cols":8,"rows_kept":102,"cut":false,"hidden":false,"merged":[]}
["Money","Ring #","Class"]
[{"$f":"'JUNIOR HORSE BARRELS'!O$13","v":34.730000000000004},{"$f":"'JUNIOR HORSE BARRELS'!P$13","v":0},"Jr Horse",null,null,"Sum of Money"]
[{"$f":"'JUNIOR HORSE BARRELS'!O$14","v":25.67},{"$f":"'JUNIOR HORSE BARRELS'!P$14","v":0},"Jr Horse",null,null,"Ring #","Class","Total"]
[{"$f":"'JUNIOR HORSE BARRELS'!O$15","v":15.100000000000001},{"$f":"'JUNIOR HORSE BARRELS'!P$15","v":0},"Jr Horse",null,null,0,"3D Barrels",200.00000000000003]
[{"$f":"'JUNIOR HORSE BARRELS'!O$16","v":""},{"$f":"'JUNIOR HORSE BARRELS'!P$16","v":0},"Jr Horse",null,null,null,"Adult Barrels",25]
[{"$f":"'JUNIOR HORSE BARRELS'!O$17","v":""},{"$f":"'JUNIOR HORSE BARRELS'!P$17","v":0},"Jr Horse",null,null,null,"Adult Poles",25]
{"$rows_left_out":97}
{"sheet":"Show Report","index":19,"n_rows":25,"n_cols":5,"rows_kept":25,"cut":false,"hidden":false,"merged":[[0,0,0,4]]}
["MBRA Jackpot - Windsor - July 24 & 25, 2021"]
[]
["INCOME"]
["Head Fee",2250]
["Drug Fee",225]
["Class Fee Day 1",1090]
{"$rows_left_out":20}
{"sheet":"Sheet3","index":20,"n_rows":0,"n_cols":0,"rows_kept":0,"cut":false,"hidden":false,"merged":[]}