{"text_format":"1","workbook":"xlsx","n_sheets":21,"sheets":["Membership #","Stall List","MBRA ","Sheet1","EXHIBITION Barrels","SMALLFRY","PONY","JUNIOR HORSE BARRELS","Adult Green Barrels","YOUTH BARRELS","NOVICE BARRELS","OPEN BARRELS","ADULT GREEN POLES","YOUTH POLES","NOVICE POLES","OPEN POLES","3D Barrels","GT_Custom","Payouts","Show Report","Sheet3"],"not_rendered":{"charts":0,"images":0,"macros":1,"external_links":1,"defined_names":17,"comments":0,"pivot_tables":1},"unopened":[],"bounds":{"document_bytes":16777216,"sheet_cells":100000,"rows_first":2000,"rows_last":500,"rows_between":2000,"halvings":0,"cell_chars":16384,"cell_head_chars":4096},"cells_cut":0,"cells_raw":0,"read":"whole","date_system":"1900"}

{"sheet":"Membership #","index":0,"n_rows":471,"n_cols":3,"rows_kept":471,"cut":false,"hidden":false,"merged":[]}
[19,"Jacie Burke","She's Just That Sassy"]
[77,"Travis Patterson","Dacs Breezin Rome"]
[969,"Kenzie Cook","Pocos Lady Emeralda"]
[973,"Sara Ivey","Ms Heavenly Gator"]
[81,"Peyton Lynds","Roxy"]
[82,"Scotia MacEachern","Hick-a-Licious"]
[83,"Taylor Dickson","Smarts Hicks"]
[84,"Amber Lloyd","Lilly"]
[85,"Kaelyn Keddy","Sight to Behold"]
[85,"Katelyn Keddy","Sight to Behold"]
[86,"Chantelle Oulton","Jack Sparrow"]
[86,"Chantelle Oulton","Jack Sparrow"]
[87,"Kerissa Martin","Wild Steppin' Phoenix"]
[89,"Hannah Rafuse","Cookie"]
[90,"Tarissa Rafuse","Sparkles"]
[974,"Kerissa Martin","Wild Steppin Phoenix"]
[93,"Nicole Kent","Legacy's Lacy Invite"]
[94,"Ainsley Marshall","JW"]
[97,"MacKenize Hughes","Batmans Famous Bugs"]
[99,"Ella Cowley","Blazin Boots"]
[100,"Taylor Payzant","Money out of my Pocket"]
[501,"Chuck Patterson"]
[501,"Marion MacDonald","Looking for a Pay Day"]
[502,"Ryson Doucette","Plan B"]
[503,"Kate Dew"]
[504,"Pat McLean","Johnny Drama"]
[505,"Chris Bezanson","Miss Conjelena Doc"]
[506,"Elaine MacLean","Fast Tick to Vegas"]
[507,"Jason Wilkins / Alexis Wilkins","PB King Leo Buck"]
[508,"Chris Philips","Justa Blurr ta Fame"]
[509,"Emma Simpson","She's a Myan Princess"]
[510,"Jason Lively","Tip One Back"]
[511,"Elaine MacLean","Wicked Latigo Doc"]
[512,"Kenny Burt"]
[513,"Justin Wade","The Gentleman"]
[514,"Heather Morrison","Black Fire Dash"]
[515,"Ed Grant","I Own A Corona"]
[516,"Laurie Don Reginato","TCR Gold Runny"]
[517,"Jessica Hawkins"]
[518,"Sylvester Weatherbie","J.R."]
[519,"Charlsea Fiske","Lights Out Goys"]
[520,"John McAssey"]
[521,"Royden Naugler","RR Smooth Richochet"]
[522,"Emma Taylor","Takin A Chance"]
[523,"Nicole Dobson","Barbeesimpossibleinprint"]
[524,"Stan Brown","Kicked In Overdrive"]
[525,"Charmaine Gallant","Six Viking"]
[526,"Talor Naugler","Blazing Hot"]
[527,"Royce Naugler","Rockin Ronnie"]
[528,"Talor Naugler","A Touch of Lace"]
[529,"Reese LeBlanc","Badger Bar ToWinSome"]
[530,"Joan Grant","SLS Dash to Holland"]
[531,"Addison Peters","He's A Little Wonder"]
[532,"Gracie MacLean","Secret"]
[533,"Jessica Taylor","Farrells Finest Man"]
[534,"Mary Lou Rankin Dentin","Brandy's Chocolena"]
[535,"Shaun Allen","Fancy"]
[536,"MaryLouRankinDenton","Grey Check Lady"]
[537,"Alka Virick","Corona Identity"]
[538,"Jean DuGas","Pal's Lilguy"]
[539,"Alex Singer","Plain White Trash"]
[540,"NOT TO BE USED"]
[541,"Mark McLean","Mr. Lucky Fame"]
[542,"Kate Madsen","Return Two Fame"]
[543,"Kathleen Zwaneveld","Dirk Digler"]
[544,"Kevin Bateman","Conquistadorwhizchc"]
[545,"Karen MacDonald","Doc Belle Bandit"]
[546,"Charmaine Gallant","Maybull"]
[547,"Lindsay Hilchie"]
[548,"Lindsay Hilchie","Tri Bright Chance"]
[549,"Chris MacLean","Lena`s Little Hayday"]
[550,"Eunice Dykstra"]
[551,"Riley Reginato","Straight Firen Jet"]
[552,"Emily Messenger","Luckys Starlet"]
[553,"Monica Buffett","MB Victory Dance"]
[554,"Ashley Crane","Diesel Powered Jet"]
[555,"Stephanie Clark","OK Den"]
[556,"Stephaine Clark","Perks A Flyin"]
[557,"Paige Angevine","Tac Off"]
[558,"Kevin Eaton","High Country Cricket"]
[559,"Craig Carey","Whistlen Major"]
[560,"Joan Grant","Nonstop Bay Boy"]
[561,"Makiah Sparks","Mr Cookie"]
[562,"Karen Hatcher","Going Postal"]
[563,"Kevin Bateman","Jess Chasin A Hobby"]
[564,"Bree Johnston","Lylebeta Zack"]
[565,"Kristen Beck","Poco Desert Rose"]
[566,"Pat McLean","Chisel Stone"]
[568,"Cathy Rankin","Heza Doc Twists"]
[569,"Kate Dew","Tiny Gay's Dasher"]
[570,"Bobby Stevens","Rico Mancini"]
[571,"Ken Jardine","Bullet"]
[572,"Maureen Murray","Down Home Lady"]
[573,"Lucy  Collier Gallant","Ben Bodacious"]
[574,"Emma Lee Taylor","SAQ Chiefs Two Bit"]
[575,"Robert Eaton","Den"]
[576,"Kevin Eaton","Hy Bred Inheritance"]
[577,"Lorie Angevine","Two Zan Par Silver"]
[578,"Robert Eaton","Impressive Ben"]
[579,"Joanne Scott","Lily"]
[580,"Candace Sakalauskas","LNTS Two Eyed Jackie"]
[581,"Jean DuGas"]
[582,"Roddie Benoit","Bug Bar Bandit"]
[583,"Travis Patterson","JT Rosie"]
[584,"Tammy Young","Sonny Dee Thunder"]
[585,"Brittany McIntyre","Cherry Can Do"]
[586,"Scott McLean","Presto Lee"]
[587,"Erin Groves","Over The Rainbow"]
[588,"Sarah LeBlanc","Down Home Empress"]
[589,"Kim Sellars","Hidden Assets"]
[590,"Charlotte McCarthy","Smokey B Kay"]
[591,"Wendy MacLean","White Sox N Flyin"]
[592,"Jessie Cummings","Jet Tares"]
[593,"Samantha Miller","Sheamos Promise"]
[594,"Hope Angevine","Sulanist Mist"]
[595,"Kyle Beaton","Diesel's Inferno"]
[596,"Lauren Daley","Myas Skippen Redford"]
[597,"Cecile Dykstra","Codys Zippin It Up"]
[598,"Roddie Benoit","Ruled By Bully"]
[599,"Adrienne Benoit","Grey Ghost"]
[600,"Stan Brown","A Perty Sure Thing"]
[601,"Marion MacDonald","Miss Guardian Angel"]
[602,"Laura Croft","Zippo Silver Pine"]
[603,"Stacy Murray","Express Mist"]
[604,"Gordon McCabe","Apache Blue Nugget"]
[605,"Cindy Wamboldt","Salty Bully Express"]
[606,"Tanya Naugler","Driftin Two Dixie"]
[607,"Laura Morrison","Chicks Painted Wagon"]
[608,"Kate Madsen","Slide on Bye"]
[609,"Stacy Murray","JD Grambler"]
[610,"Katherine Horsman","Shiloh"]
[611,"Rebecca Fraser","Granger Dee Doc"]
[612,"Kristen Beck","Diablo's Blue Step"]
[613,"Kelly LeBlanc","Starrs Double King"]
[614,"Georda MacInnis"]
[615,"Judy Bateman","Hollywood Elite"]
[616,"Judy Bateman","HM HollywoodRockstar"]
[617,"Elaine Mahaney","Sabes Lightnin Bug"]
[618,"Audrey MacLeod","Crown Royal JR"]
[619,"Cassie Daniels","Sugar Ray Light Foot"]
[620,"Stephanie Daniels","Fire Ball Max"]
[621,"Nichole Pothier","Born To Boogie"]
[622,"Courtney Parker","BW Rare Kinda Love"]
[623,"Connie Trider","Hollywood Ranson"]
[624,"Dixie Tuffs","Ima Frostee Bay B"]
[625,"Ryson Doucette","Keeper of The Perks"]
[626,"Jeremy Graham","Echo charged"]
[627,"Kaelyn Keddy","Sight to Behold"]
[628,"Amanda Matchett","Smoke M Pardner"]
[629,"Beth O'Leary","Toms Final Dash"]
[630,"Beth O'Leary","Kings Black"]
[631,"Nicole vanDyke","Ima Bully"]
[632,"Breighanne Finlayson","Dee Dun Smart"]
[633,"Ella Cowley","Oscar"]
[634,"Katlyn Benere","He's Got Class"]
[635,"Trudy Hemeon","RS Painted Pretty"]
[636,"Ceilidh Gosse","ELM Silver Crime"]
[637,"Caleb Buffett","JMF Flashdance"]
[638,"Bella Peters","Super Star"]
[639,"Sally King","Watch That Digger Go"]
[640,"April Jollimore/Megan MacDonald","Pilgrim"]
[641,"Ava Harb","Super Rockie"]
[642,"John Blair","Totally Kissed"]
[643,"Willow Brooks","Mr Betta B Ware"]
[644,"Pat Rodney"]
[645,"Tammy Young","Whoa Laredo"]
[646,"Taylor Blair"]
[647,"Courtney Parker","BW Rare Kinda Love"]
[648,"Norman Blanchard","Sheny Bugs"]
[649,"Cara Pettipas","Shezabonafiedbully"]
[650,"Cara Pettipas","Miss Wonder Bully"]
[651,"Olivia MacLean","A Boy Named Sue"]
[652,"Molly O'Grady","Teelano's Twister"]
[653,"Ryson Doucette","Pawnee Kid N Gold"]
[654,"Deavan Chapman","Enlighten"]
[655,"Julia Parker","Boons Feature Star"]
[656,"Willow Brooks","Free Spirit"]
[657,"Laura Morrison","Steal Ta Fame"]
[658,"Heather Morrison","Last Chance"]
[659,"Gloria Carey","True Blue Tivios"]
[660,"Charles Edwards","Rarer Than You Think"]
[661,"Clara Tooley","Chicado Rebel"]
[662,"Shelly Moore","Too Tough Cat"]
[663,"Dixie Tuffs","Running Squirrel"]
[664,"Christine Doane","Maromac Lexis"]
[665,"Robert Eaton","FF Chick"]
[666,"Summer Fraser","Sheza Smokin' Girl"]
[667,"Paige Angevine","Skip"]
[668,"Amanda Young","King Leo Buck"]
[669,"Roddie Benoit","True Blue Slew"]
[670,"Allie Fox","DNA Bold Bediuno"]
[671,"Paige Gray","What's Up Doc"]
[672,"Maureen Murray","Catch My Bones"]
[673,"Kristen Beck","Monster Bunny"]
[674,"Kyle Beaton","Jus For Kicks"]
[675,"Chris Philips","Deacon Eye Boo"]
[676,"Linda Bird","Moony's Black Magic"]
[677,"Jenna Paquet"]
[678,"Jocelyn d'Entremont","KT Ruby N Tin"]
[679,"Clara Tooley","All Hot N Easy"]
[680,"Kathleen Zwaneveld","Ben Bodacious"]
[681,"Kieston Moore","Hollywood Cresent Moon"]
[682,"Roddie Benoit","Vegas Baby"]
[683,"Wayne Strickland","Texas Wrangler"]
[684,"Shann Cox","Jags Cash Flow"]
[685,"Michaela Dove"]
[686,"Royden Naugler","Docs Bobby Jae"]
[687,"Peter Hope","Flashin Passum"]
[688,"Lenee Sampson","Six Dash Run"]
[689,"Samantha Pinkney","Docs Bar Stardust"]
[690,"Emma Wright-Smith","A Real Blonde Babe"]
[691,"Vincent Croft","Rockets Hollywood"]
[692,"Taylor Dickson","Smart Hicks"]
[693,"Adrienne Benoit","Texas Wrangler"]
[694,"Briana Dillman","Gonna Get Buckwild"]
[695,"Tessa Dicks","Charge's Dusty Luck"]
[696,"Kyle Sakalauskas","Doc Oscar"]
[697,"Sarah Marcus","Redico Dixie"]
[698,"Kaleigh Denton","Coleasaki"]
[699,"Laura Morrison","MDC Dark Revelation"]
[700,"Lindsay Baker","Boons Laughing Boy"]
[701,"Gracie Marinelle","Runnin Outta Moonlight"]
[702,"Jenna Proctor","Painted to Perfection"]
[703,"Chris Baker","Jamer All Fired Up"]
[704,"Amanda HickeyLeblance","Ultimate Lil Fox"]
[705,"Pat McLean","Quick on the Lead"]
[706,"Shelby Gatti","Maybull"]
[707,"Cory Mapplebeck","Maxs Final Affair"]
[708,"Nick Campbell","Playboys Fun"]
[709,"John Foley","Billy"]
[710,"Owen Baker","Tip It Back"]
["710b","Isla Baker","Tip It Back"]
[711,"Allie Fox","DNA Bold Bediuno"]
[712,"Cassidy Stevens","Lady"]
[713,"Sierra Thibault","Gunsmoke"]
[714,"Amanda HickeyLeblance","Luna"]
[715,"Alyssa Mills","River Renegade"]
[716,"Kayla Martin","Dash Ta Home"]
[717,"Sierra Thibault","Gold Digger"]
[718,"Samantha Pinkney","Smokin Okie"]
[719,"Molly/Emily O'Grady","Teelano's Twister"]
[720,"Tammy Beck","Call Me Flashy Zip"]
[721,"Jeremy Graham","Smooth Ike"]
[722,"Amanda Thurber","Painted Pretty Mercedes"]
[723,"Christine Carter/Belle","American Honey"]
[724,"Christine Carter","Ima Brimmerton Also"]
[725,"Belle Carter","Neon Mist"]
[726,"Shelby Antle"]
[727,"Sheldon Antle","Three Spots"]
[728,"Barb Taylor","Painted Escape"]
[729,"Kristen Pyke","High Maintenance Chick"]
[730,"Rhonda Chambers","Booms Pep See"]
[731,"Gail Williams","Sheza Jazzy Girl"]
[732,"Brenna Carrigan","Carlos"]
[733,"Bryanna Cole","Dash of Impluse"]
[734,"Daniel Webb","Heza Doc Twists"]
[735,"Zoey Manuel","Miss Top Notch Zip"]
[736,"Jasmine McLean","I'm A Super Starr"]
[737,"Tori-Anne Devine","Peptovilla"]
[738,"Brad Moore","Heza Holly Hobby"]
[739,"Alka Virick","Elm Texas Wrangler"]
[740,"Bart Lausanne","Bud"]
[741,"Breighanne Finlayson","Major Six Moons"]
[742,"Charlotte Robicheau","SV Twisted Scotch Lad"]
[743,"Shelby Antle","Cool Impulse Bunny"]
[744,"Briana Dillman","Woodmere Wee Annie"]
[745,"Josie Dean","DF Coke Olena"]
[746,"Cassie MacDonald","Sandy Dew"]
[747,"Gary Latimer","Edith Special Rare"]
[748,"Meredith Smith","Max's Formal Affair"]
[749,"Chrissy Linsdsay","Two Creeks Dandy Bar"]
[750,"Tanya Kennedy","Old Stations Pride"]
[751,"Breighanne Finlayson","Charismatic King"]
[752,"Felicia MacEachern","Ruger"]
[753,"Kayla Boudreau","Lady Jane"]
[754,"Megan McConnell","Cuda Ben Adiamond"]
[755,"Megan McConnell","Gotta Pretty Lady"]
[756,"Megan Simpson","Mr. Taco-tastic"]
[757,"Ryan MacLellan","Shadow"]
[758,"Makayla Dixon","Extreme Minnie"]
[759,"Brook Darragh","Leroy"]
[760,"Allison Moffatt","Miss Fancy Pants"]
[761,"Alissa Doucette","Need for Speed"]
[762,"Sandy Doucette","Sugar N Spice"]
[763,"Reese LeBlanc","Badger Bar Towinsome"]
[764,"Alissa Doucette","Need For Speed"]
[765,"Kyann Doucette","Fatal Attraction"]
[766,"Karen Hatcher","Six Dash Run"]
[767,"Judy McCormack","Budding Reality Star"]
[768,"Tracey Higgins","Iza Wicked Wind"]
[769,"Charlsea Fiske","Jailhouse Rockinic"]
[770,"Arielle Sherman","Lacey"]
[771,"Madison Doucette","Daddy's Money"]
[772,"Robyn McDonald","LDF Ratchett To Go"]
[773,"Hunter Lepper","Willow"]
[774,"Bobby Stevens","Sheza Fast Six"]
[775,"Belle Carter","Kickin Sunshine Party"]
[776,"Karli Slaunwhite","Pocos Candy Queen"]
[777,"Julia Parker","Doc's Spirit Prairie"]
[778,"Jillian Comeau","Pocos Flashy Thor"]
[779,"Tim Amero","Miss Flashy T"]
[780,"Bobby Stevens"]
[781,"Amanda Tweedy","Hero"]
[782,"Greg Hatt","Sabres Major Leo"]
[783,"Raeann Young","Black Beauty"]
[784,"Gordon McCabe","Bunchy Munchy"]
[785,"Natalie Schnare/Jenna","Made Pretty Fancy"]
[786,"Rileigh Conrod","Scotches Harley"]
[787,"Darlene Junkowski","Jade"]
[788,"Taylor Chase","The Firestorm"]
[789,"Sandy Gardiner","Carmaletta Dash"]
[790,"Allie Ferneyhough","Rockets Blaze Of Glory"]
[791,"Megan Graves","Kay Doe Nota Chance"]
[792,"Kristen Pyke","Playguns Quixote Cat"]
[793,"Chayann Doucette","Razmatazz"]
[794,"Ashton Rushton","Mon Amie"]
[795,"Taylor Pollock","Ropin The Winds"]
[796,"Katie MacIsaac","Identity First"]
[797,"Emma Sullivan","Lightning McQueen"]
[798,"Amanda Gillis","Miss America"]
[799,"Lisa Everett","B Kays Bonsai"]
[800,"Sabrina Bauer","Talk of The Town"]
[801,"Brittany Spears","Riskey At The Bar"]
[802,"Ava Reginato","Jacs Last Flash"]
[803,"Raeann Young","Little Orphan Annie"]
[804,"Shelby Beaton","Rosie   "]
[805,"Brenna Carrigan","Crime of Fire"]
[806,"Christina Marr","Jack "]
[807,"Joseph Upshaw","JTK Smoking Classic"]
[808,"Chantelle Oulton","Little Miss Sunshine"]
[809,"Dawn Schnare","Teah Salty Bars"]
[810,"Kevin Bateman","SV Twisted Scotch Lad"]
[811,"Mariah Hume","Ratchetts Wimpy Dude"]
[812,"Meghan Hume","Betsys Lemonade"]
[813,"Mariah Hume","Plan B"]
[814,"Megan Graves","Miss Otoes Fan"]
[815,"Brooke Kennedy","Tic Toc Teazer"]
[816,"Elaine MacLean","Moneys Cowboy Cash"]
[817,"Nicole Crowell","Playboy Dunit Again"]
[818,"Kayden Mosher","Cookie"]
[819,"Braydon Lockhart","True Blue Slew"]
[820,"Kim Sellars","Legacy"]
[821,"Nick Lockhart","Zan Freckles Cowboy"]
[822,"Cheryl Matheson","Diamonds Array"]
[823,"Gracie Yorke","Ima Flashy Queen"]
[824,"Ivy Cushing","Bitter Sweet Brandy"]
[825,"Brittany Atwood","Jac Up Hollywood"]
[826,"Raymond Hache","Callaway Jack"]
[827,"Josie Dean","Gray Check Lady"]
[828,"Victoria McNutt","Jazz It Up Jupiter"]
[829,"Jordon Fillmore","Montaego Bo Jet"]
[830,"Bart Lusanne","Little Miss Lightfoot"]
[831,"Mallory Maxwell","Colonel Gunslinger"]
[832,"Elizabeth Hogg","Willie Bee Kanata"]
[833,"Emily Sutherland"]
[834,"Tessa MacIsaac","Uptown Girl"]
[835,"Noah MacAskill"]
[836,"Sarah Justason","Hobo"]
[837,"Lisa Murray","Maws Grey Needles"]
[838,"Wanda Mitchelitis","Zoom Away Now"]
[839,"Shania Putnum","Zan Freckles Cowboy"]
[840,{"$f":"IF(A362=\"\",\"\",(VLOOKUP(A362,'[1]Membership #'!$A$1:$C$378,2,FALSE)))","v":"Kristen Ossinger"},{"$f":"IF(A362=\"\",\"\",(VLOOKUP(A362,'[1]Membership #'!$A$1:$C$378,3,FALSE)))","v":"Bailey's Irish Cream"}]
[841,"Isabelle McNutt","Budda"]
[842,"Deavan Chapman","Inlighten"]
[843,"Eric Lavoie","Roller Can Get It"]
[844,"Sarah Metcalf","Sabers True Aliby"]
[845,"Sheila Lechasseur","Roll Easy Cash"]
[846,"Morgan Smith","Hello Dolly Mac"]
[847,"Morgan Beaton","Kay Doe Doc Slick"]
[848,"Holly McSavaney","Doctor Frenchman"]
[849,"Chris MacLean","Lena`s Little Hayday"]
[850,"Charlsea Fiske","Master of the Moon"]
[851,"Daphne Hamm","Made By Design"]
[852,"Kennedy Meagher","Canadian Maple"]
[853,"Sarah Ross","Fames Little Star"]
[854,"Lily Sutherland","I'm A Sugar Crime"]
[855,"Jenelle Collier","Peppy Sans Surprise"]
[856,"Ava Foote","Willow"]
[857,"June Tattrie","Country Girl"]
[858,"Chloe Fagan","Heza Poco Champ"]
[859,"Jean DuGas"]
[860,"Gail Williams","LeeO"]
[861,"Maddy Smith ","Twisted Temptation"]
[862,"Jenna Burge","Shiners Hangover"]
[863,"Charlotte Mingo","Willy"]
[864,"Taylor Pollock","Ladys Tip One Back"]
[865,"Kaila Gosby","Powder Holly Pine"]
[866,"Terry Lynn McNutt","Cali"]
[867,"Layla MacEachem","Shes a gem"]
[868,"Brooke MacNeil","SLS Dash to Holland"]
[869,"Lisa Murray","Hickory's Smart and Mad"]
[870,"Rileigh O'Leary","Dolly "]
[871,"Serena Sears","Sierra"]
[872,"Drew Rushton","Mocho's Golden Ticket"]
[873,"Danielle Pike","Tinsel on The Pines"]
[874,"Samantha Francis","Frostee"]
[875,"April Jollimore","Cash Assurance"]
[876,"Brittany Spears","Lopin N My Blue Jeans"]
[877,"Gracie Yorke","Tip Top 'n' Flashy"]
[878,"Ella Rogers","Lightning     "]
[879]
[880,"Kiersten Moore","Hollywood Cresent Moon"]
[881,"Eric Lavoie","A Nuther Roll of Cash"]
[882,"Kevin Bateman","Serenas Hickory"]
[883,"Ella Cowley","Guss"]
[884,"Kayden Mosher","Zigby"]
[885,"Samantha Francis","Tank"]
[886,"Ben Peters/Graham Peters","High Hopes"]
[887,"Allie Fox","Shadow"]
[888,"Ariel Fraser","Kay's Last Kid"]
[889,"Adelaine Cowley","Frenchman's Promise"]
[890,"Karli Slaunwhite","Pocos Candy Queen"]
[891,"Krista MacGillivary","Hot Topic"]
[892,"Donnie MacNeil","Gifted Go Gold"]
[893,"Lisa Murray","Coosas Texas Tango"]
[894,"Drew Rushton","BonChance Dads Dream"]
[896,"Kati MacIsaac","Fish'n for Coronas"]
[897]
[898]
[899,"Miranda Cooke","Jig Time Two Largo"]
[900,"Olivia MacLean","Velvet"]
[901,"Monique Buffett"]
[904,"Ella Cowley","Blazin Boots"]
[905,"Adeline Cowley","Smokin Okie"]
[907]
[908,"Josie Higgins","Rocket Man"]
[909,"Rebecca Gillis","Martha's Tivio Moon"]
["909b","Bryden MacNeil","Martha's Tivio Moon"]
[910,"Cassidy Stevens","Lady"]
[911,"Brennan Crowe","Time to Dance"]
[912,"Ed Grant","Chasin The Ace"]
[913,"Morgan Beaton","All Shook Up"]
[914,"Shelby MacPherson","Shelbys Badger Bar"]
[915]
[916,"Rebecca Fraser","Legacy's Gold Lady"]
[917,"Travis Benoit","Whiisper"]
[918,"Keira Rose","LL Its All About Red"]
[919,"Kristie Bolivar","Pretty"]
[920,"Cara Pettipas","Shezabonafiedbully"]
[921,"Shelby Gatti","Just Roll The Dice"]
[922,"Stevi Jardine","Paytons Pretty Cool"]
[923,"Monica Buffett","Victory Dance"]
[924,"Caleb Buffett","JMF Flashdance"]
[925]
[926,"Sara Ivey","A Shot A Whiskey"]
[927]
[928,"Tessa Dicks","ELM Dash of Crime"]
[929]
[930]
[931]
[932,"James Whitman","This Bugs on Fire"]
[941,"Taylor Hurley","Nacho Business"]
[942,"Miles Joudrey","Royal Cash Ransom"]
[945,"Taylor Cameron","Monster Bunny"]
[947,"Leanna Horsnell","Bobs Ya Uncle"]
[950,"Tracey Higgins","Pocos Candy Queen"]
[954,"Scotia MacEachern","Hick-a-Licious"]
[958,"Peyton Lynds","Roxy"]
[961,"Jacie Burke","She's Just That Sassy"]
[962,"Hariin Burke","Olds Bold Impulse"]
[963,"Leighton Burke","Boot Scootin Boogie"]
[966,"Ava Anderson","Black Sass"]
[967,"Marissa Hillier","Notice Betty Boop"]
[968,"Madison Pelly","Westin"]
[971,"Arielle Burke","Elm Sally"]
["710a","Isla Baker","Tip It Back"]
["733b","Terry Cole","Dash of Impluse"]
[78,"Stephanie Rich","Texas Mickey"]
[]
["958b","Shantel Hankey","Roxy"]
["97a","Christine Doane","Batmans Famous Bugs"]

{"sheet":"Stall List","index":1,"n_rows":113,"n_cols":6,"rows_kept":113,"cut":false,"hidden":false,"merged":[[0,0,0,3]]}
["Tom Burt & Mark McGuire Memorial Jackpot  2021"]
[null,"RING #      ","NAME","HORSE NAME",null,"Stall request info"]
[1,591,{"$f":"IF(B3=\"\",\"\",(VLOOKUP(B3,'Membership #'!$A$1:$C$1005,2,FALSE)))","v":"Wendy MacLean"},{"$f":"IF(B3=\"\",\"\",(VLOOKUP(B3,'Membership #'!$A$1:$C$1005,3,FALSE)))","v":"White Sox N Flyin"}]
[2,532,{"$f":"IF(B4=\"\",\"\",(VLOOKUP(B4,'Membership #'!$A$1:$C$1005,2,FALSE)))","v":"Gracie MacLean"},{"$f":"IF(B4=\"\",\"\",(VLOOKUP(B4,'Membership #'!$A$1:$C$1005,3,FALSE)))","v":"Secret"}]
[3,563,{"$f":"IF(B5=\"\",\"\",(VLOOKUP(B5,'Membership #'!$A$1:$C$1005,2,FALSE)))","v":"Kevin Bateman"},{"$f":"IF(B5=\"\",\"\",(VLOOKUP(B5,'Membership #'!$A$1:$C$1005,3,FALSE)))","v":"Jess Chasin A Hobby"}]
[4,616,{"$f":"IF(B6=\"\",\"\",(VLOOKUP(B6,'Membership #'!$A$1:$C$1005,2,FALSE)))","v":"Judy Bateman"},{"$f":"IF(B6=\"\",\"\",(VLOOKUP(B6,'Membership #'!$A$1:$C$1005,3,FALSE)))","v":"HM HollywoodRockstar"}]
[5,530,{"$f":"IF(B7=\"\",\"\",(VLOOKUP(B7,'Membership #'!$A$1:$C$1005,2,FALSE)))","v":"Joan Grant"},{"$f":"IF(B7=\"\",\"\",(VLOOKUP(B7,'Membership #'!$A$1:$C$1005,3,FALSE)))","v":"SLS Dash to Holland"}]
[6,968,{"$f":"IF(B8=\"\",\"\",(VLOOKUP(B8,'Membership #'!$A$1:$C$1005,2,FALSE)))","v":"Madison Pelly"},{"$f":"IF(B8=\"\",\"\",(VLOOKUP(B8,'Membership #'!$A$1:$C$1005,3,FALSE)))","v":"Westin"}]
[7,768,{"$f":"IF(B9=\"\",\"\",(VLOOKUP(B9,'Membership #'!$A$1:$C$1005,2,FALSE)))","v":"Tracey Higgins"},{"$f":"IF(B9=\"\",\"\",(VLOOKUP(B9,'Membership #'!$A$1:$C$1005,3,FALSE)))","v":"Iza Wicked Wind"}]
[8,908,{"$f":"IF(B10=\"\",\"\",(VLOOKUP(B10,'Membership #'!$A$1:$C$1005,2,FALSE)))","v":"Josie Higgins"},{"$f":"IF(B10=\"\",\"\",(VLOOKUP(B10,'Membership #'!$A$1:$C$1005,3,FALSE)))","v":"Rocket Man"}]
[9,627,{"$f":"IF(B11=\"\",\"\",(VLOOKUP(B11,'Membership #'!$A$1:$C$1005,2,FALSE)))","v":"Kaelyn Keddy"},{"$f":"IF(B11=\"\",\"\",(VLOOKUP(B11,'Membership #'!$A$1:$C$1005,3,FALSE)))","v":"Sight to Behold"}]
[10,969,{"$f":"IF(B12=\"\",\"\",(VLOOKUP(B12,'Membership #'!$A$1:$C$1005,2,FALSE)))","v":"Kenzie Cook"},{"$f":"IF(B12=\"\",\"\",(VLOOKUP(B12,'Membership #'!$A$1:$C$1005,3,FALSE)))","v":"Pocos Lady Emeralda"}]
[11,815,{"$f":"IF(B13=\"\",\"\",(VLOOKUP(B13,'Membership #'!$A$1:$C$1005,2,FALSE)))","v":"Brooke Kennedy"},{"$f":"IF(B13=\"\",\"\",(VLOOKUP(B13,'Membership #'!$A$1:$C$1005,3,FALSE)))","v":"Tic Toc Teazer"}]
[12,750,{"$f":"IF(B14=\"\",\"\",(VLOOKUP(B14,'Membership #'!$A$1:$C$1005,2,FALSE)))","v":"Tanya Kennedy"},{"$f":"IF(B14=\"\",\"\",(VLOOKUP(B14,'Membership #'!$A$1:$C$1005,3,FALSE)))","v":"Old Stations Pride"}]
[13,753,{"$f":"IF(B15=\"\",\"\",(VLOOKUP(B15,'Membership #'!$A$1:$C$1005,2,FALSE)))","v":"Kayla Boudreau"},{"$f":"IF(B15=\"\",\"\",(VLOOKUP(B15,'Membership #'!$A$1:$C$1005,3,FALSE)))","v":"Lady Jane"}]
[14,954,{"$f":"IF(B16=\"\",\"\",(VLOOKUP(B16,'Membership #'!$A$1:$C$1005,2,FALSE)))","v":"Scotia MacEachern"},{"$f":"IF(B16=\"\",\"\",(VLOOKUP(B16,'Membership #'!$A$1:$C$1005,3,FALSE)))","v":"Hick-a-Licious"}]
[15,684,{"$f":"IF(B17=\"\",\"\",(VLOOKUP(B17,'Membership #'!$A$1:$C$1005,2,FALSE)))","v":"Shann Cox"},{"$f":"IF(B17=\"\",\"\",(VLOOKUP(B17,'Membership #'!$A$1:$C$1005,3,FALSE)))","v":"Jags Cash Flow"}]
[16,688,{"$f":"IF(B18=\"\",\"\",(VLOOKUP(B18,'Membership #'!$A$1:$C$1005,2,FALSE)))","v":"Lenee Sampson"},{"$f":"IF(B18=\"\",\"\",(VLOOKUP(B18,'Membership #'!$A$1:$C$1005,3,FALSE)))","v":"Six Dash Run"}]
[17,973,{"$f":"IF(B19=\"\",\"\",(VLOOKUP(B19,'Membership #'!$A$1:$C$1005,2,FALSE)))","v":"Sara Ivey"},{"$f":"IF(B19=\"\",\"\",(VLOOKUP(B19,'Membership #'!$A$1:$C$1005,3,FALSE)))","v":"Ms Heavenly Gator"}]
[18,922,{"$f":"IF(B20=\"\",\"\",(VLOOKUP(B20,'Membership #'!$A$1:$C$1005,2,FALSE)))","v":"Stevi Jardine"},{"$f":"IF(B20=\"\",\"\",(VLOOKUP(B20,'Membership #'!$A$1:$C$1005,3,FALSE)))","v":"Paytons Pretty Cool"}]
[19,777,{"$f":"IF(B21=\"\",\"\",(VLOOKUP(B21,'Membership #'!$A$1:$C$1005,2,FALSE)))","v":"Julia Parker"},{"$f":"IF(B21=\"\",\"\",(VLOOKUP(B21,'Membership #'!$A$1:$C$1005,3,FALSE)))","v":"Doc's Spirit Prairie"}]
[20,655,{"$f":"IF(B22=\"\",\"\",(VLOOKUP(B22,'Membership #'!$A$1:$C$1005,2,FALSE)))","v":"Julia Parker"},{"$f":"IF(B22=\"\",\"\",(VLOOKUP(B22,'Membership #'!$A$1:$C$1005,3,FALSE)))","v":"Boons Feature Star"}]
[21,647,{"$f":"IF(B23=\"\",\"\",(VLOOKUP(B23,'Membership #'!$A$1:$C$1005,2,FALSE)))","v":"Courtney Parker"},{"$f":"IF(B23=\"\",\"\",(VLOOKUP(B23,'Membership #'!$A$1:$C$1005,3,FALSE)))","v":"BW Rare Kinda Love"}]
[22,652,{"$f":"IF(B24=\"\",\"\",(VLOOKUP(B24,'Membership #'!$A$1:$C$1005,2,FALSE)))","v":"Molly O'Grady"},{"$f":"IF(B24=\"\",\"\",(VLOOKUP(B24,'Membership #'!$A$1:$C$1005,3,FALSE)))","v":"Teelano's Twister"}]
[23,700,{"$f":"IF(B25=\"\",\"\",(VLOOKUP(B25,'Membership #'!$A$1:$C$1005,2,FALSE)))","v":"Lindsay Baker"},{"$f":"IF(B25=\"\",\"\",(VLOOKUP(B25,'Membership #'!$A$1:$C$1005,3,FALSE)))","v":"Boons Laughing Boy"}]
[24,703,{"$f":"IF(B26=\"\",\"\",(VLOOKUP(B26,'Membership #'!$A$1:$C$1005,2,FALSE)))","v":"Chris Baker"},{"$f":"IF(B26=\"\",\"\",(VLOOKUP(B26,'Membership #'!$A$1:$C$1005,3,FALSE)))","v":"Jamer All Fired Up"}]
[25,710,{"$f":"IF(B27=\"\",\"\",(VLOOKUP(B27,'Membership #'!$A$1:$C$1005,2,FALSE)))","v":"Owen Baker"},{"$f":"IF(B27=\"\",\"\",(VLOOKUP(B27,'Membership #'!$A$1:$C$1005,3,FALSE)))","v":"Tip It Back"}]
[26,702,{"$f":"IF(B28=\"\",\"\",(VLOOKUP(B28,'Membership #'!$A$1:$C$1005,2,FALSE)))","v":"Jenna Proctor"},{"$f":"IF(B28=\"\",\"\",(VLOOKUP(B28,'Membership #'!$A$1:$C$1005,3,FALSE)))","v":"Painted to Perfection"}]
[27,786,{"$f":"IF(B29=\"\",\"\",(VLOOKUP(B29,'Membership #'!$A$1:$C$1005,2,FALSE)))","v":"Rileigh Conrod"},{"$f":"IF(B29=\"\",\"\",(VLOOKUP(B29,'Membership #'!$A$1:$C$1005,3,FALSE)))","v":"Scotches Harley"}]
[28,974,{"$f":"IF(B30=\"\",\"\",(VLOOKUP(B30,'Membership #'!$A$1:$C$1005,2,FALSE)))","v":"Kerissa Martin"},{"$f":"IF(B30=\"\",\"\",(VLOOKUP(B30,'Membership #'!$A$1:$C$1005,3,FALSE)))","v":"Wild Steppin Phoenix"}]
[29,638,{"$f":"IF(B31=\"\",\"\",(VLOOKUP(B31,'Membership #'!$A$1:$C$1005,2,FALSE)))","v":"Bella Peters"},{"$f":"IF(B31=\"\",\"\",(VLOOKUP(B31,'Membership #'!$A$1:$C$1005,3,FALSE)))","v":"Super Star"}]
[30,516,{"$f":"IF(B32=\"\",\"\",(VLOOKUP(B32,'Membership #'!$A$1:$C$1005,2,FALSE)))","v":"Laurie Don Reginato"},{"$f":"IF(B32=\"\",\"\",(VLOOKUP(B32,'Membership #'!$A$1:$C$1005,3,FALSE)))","v":"TCR Gold Runny"}]
[31,531,{"$f":"IF(B33=\"\",\"\",(VLOOKUP(B33,'Membership #'!$A$1:$C$1005,2,FALSE)))","v":"Addison Peters"},{"$f":"IF(B33=\"\",\"\",(VLOOKUP(B33,'Membership #'!$A$1:$C$1005,3,FALSE)))","v":"He's A Little Wonder"}]
[32,746,{"$f":"IF(B34=\"\",\"\",(VLOOKUP(B34,'Membership #'!$A$1:$C$1005,2,FALSE)))","v":"Cassie MacDonald"},{"$f":"IF(B34=\"\",\"\",(VLOOKUP(B34,'Membership #'!$A$1:$C$1005,3,FALSE)))","v":"Sandy Dew"}]
[33,914,{"$f":"IF(B35=\"\",\"\",(VLOOKUP(B35,'Membership #'!$A$1:$C$1005,2,FALSE)))","v":"Shelby MacPherson"},{"$f":"IF(B35=\"\",\"\",(VLOOKUP(B35,'Membership #'!$A$1:$C$1005,3,FALSE)))","v":"Shelbys Badger Bar"}]
[34,600,{"$f":"IF(B36=\"\",\"\",(VLOOKUP(B36,'Membership #'!$A$1:$C$1005,2,FALSE)))","v":"Stan Brown"},{"$f":"IF(B36=\"\",\"\",(VLOOKUP(B36,'Membership #'!$A$1:$C$1005,3,FALSE)))","v":"A Perty Sure Thing"}]
[35,698,{"$f":"IF(B37=\"\",\"\",(VLOOKUP(B37,'Membership #'!$A$1:$C$1005,2,FALSE)))","v":"Kaleigh Denton"},{"$f":"IF(B37=\"\",\"\",(VLOOKUP(B37,'Membership #'!$A$1:$C$1005,3,FALSE)))","v":"Coleasaki"}]
[36,534,{"$f":"IF(B38=\"\",\"\",(VLOOKUP(B38,'Membership #'!$A$1:$C$1005,2,FALSE)))","v":"Mary Lou Rankin Dentin"},{"$f":"IF(B38=\"\",\"\",(VLOOKUP(B38,'Membership #'!$A$1:$C$1005,3,FALSE)))","v":"Brandy's Chocolena"}]
[37,918,{"$f":"IF(B39=\"\",\"\",(VLOOKUP(B39,'Membership #'!$A$1:$C$1005,2,FALSE)))","v":"Keira Rose"},{"$f":"IF(B39=\"\",\"\",(VLOOKUP(B39,'Membership #'!$A$1:$C$1005,3,FALSE)))","v":"LL Its All About Red"}]
[38,967,{"$f":"IF(B40=\"\",\"\",(VLOOKUP(B40,'Membership #'!$A$1:$C$1005,2,FALSE)))","v":"Marissa Hillier"},{"$f":"IF(B40=\"\",\"\",(VLOOKUP(B40,'Membership #'!$A$1:$C$1005,3,FALSE)))","v":"Notice Betty Boop"}]
[39,695,{"$f":"IF(B41=\"\",\"\",(VLOOKUP(B41,'Membership #'!$A$1:$C$1005,2,FALSE)))","v":"Tessa Dicks"},{"$f":"IF(B41=\"\",\"\",(VLOOKUP(B41,'Membership #'!$A$1:$C$1005,3,FALSE)))","v":"Charge's Dusty Luck"}]
[40,928,{"$f":"IF(B42=\"\",\"\",(VLOOKUP(B42,'Membership #'!$A$1:$C$1005,2,FALSE)))","v":"Tessa Dicks"},{"$f":"IF(B42=\"\",\"\",(VLOOKUP(B42,'Membership #'!$A$1:$C$1005,3,FALSE)))","v":"ELM Dash of Crime"}]
[41,971,{"$f":"IF(B43=\"\",\"\",(VLOOKUP(B43,'Membership #'!$A$1:$C$1005,2,FALSE)))","v":"Arielle Burke"},{"$f":"IF(B43=\"\",\"\",(VLOOKUP(B43,'Membership #'!$A$1:$C$1005,3,FALSE)))","v":"Elm Sally"}]
[42,78,{"$f":"IF(B44=\"\",\"\",(VLOOKUP(B44,'Membership #'!$A$1:$C$1005,2,FALSE)))","v":"Stephanie Rich"},{"$f":"IF(B44=\"\",\"\",(VLOOKUP(B44,'Membership #'!$A$1:$C$1005,3,FALSE)))","v":"Texas Mickey"}]
[43,732,{"$f":"IF(B45=\"\",\"\",(VLOOKUP(B45,'Membership #'!$A$1:$C$1005,2,FALSE)))","v":"Brenna Carrigan"},{"$f":"IF(B45=\"\",\"\",(VLOOKUP(B45,'Membership #'!$A$1:$C$1005,3,FALSE)))","v":"Carlos"}]
[44,855,{"$f":"IF(B46=\"\",\"\",(VLOOKUP(B46,'Membership #'!$A$1:$C$1005,2,FALSE)))","v":"Jenelle Collier"},{"$f":"IF(B46=\"\",\"\",(VLOOKUP(B46,'Membership #'!$A$1:$C$1005,3,FALSE)))","v":"Peppy Sans Surprise"}]
[45,518,{"$f":"IF(B47=\"\",\"\",(VLOOKUP(B47,'Membership #'!$A$1:$C$1005,2,FALSE)))","v":"Sylvester Weatherbie"},{"$f":"IF(B47=\"\",\"\",(VLOOKUP(B47,'Membership #'!$A$1:$C$1005,3,FALSE)))","v":"J.R."}]
[46,657,{"$f":"IF(B48=\"\",\"\",(VLOOKUP(B48,'Membership #'!$A$1:$C$1005,2,FALSE)))","v":"Laura Morrison"},{"$f":"IF(B48=\"\",\"\",(VLOOKUP(B48,'Membership #'!$A$1:$C$1005,3,FALSE)))","v":"Steal Ta Fame"}]
[47,699,{"$f":"IF(B49=\"\",\"\",(VLOOKUP(B49,'Membership #'!$A$1:$C$1005,2,FALSE)))","v":"Laura Morrison"},{"$f":"IF(B49=\"\",\"\",(VLOOKUP(B49,'Membership #'!$A$1:$C$1005,3,FALSE)))","v":"MDC Dark Revelation"}]
[48,514,{"$f":"IF(B50=\"\",\"\",(VLOOKUP(B50,'Membership #'!$A$1:$C$1005,2,FALSE)))","v":"Heather Morrison"},{"$f":"IF(B50=\"\",\"\",(VLOOKUP(B50,'Membership #'!$A$1:$C$1005,3,FALSE)))","v":"Black Fire Dash"}]
[49,636,{"$f":"IF(B51=\"\",\"\",(VLOOKUP(B51,'Membership #'!$A$1:$C$1005,2,FALSE)))","v":"Ceilidh Gosse"},{"$f":"IF(B51=\"\",\"\",(VLOOKUP(B51,'Membership #'!$A$1:$C$1005,3,FALSE)))","v":"ELM Silver Crime"}]
[50,867,{"$f":"IF(B52=\"\",\"\",(VLOOKUP(B52,'Membership #'!$A$1:$C$1005,2,FALSE)))","v":"Layla MacEachem"},{"$f":"IF(B52=\"\",\"\",(VLOOKUP(B52,'Membership #'!$A$1:$C$1005,3,FALSE)))","v":"Shes a gem"}]
[51,892,{"$f":"IF(B53=\"\",\"\",(VLOOKUP(B53,'Membership #'!$A$1:$C$1005,2,FALSE)))","v":"Donnie MacNeil"},{"$f":"IF(B53=\"\",\"\",(VLOOKUP(B53,'Membership #'!$A$1:$C$1005,3,FALSE)))","v":"Gifted Go Gold"}]
[52,556,{"$f":"IF(B54=\"\",\"\",(VLOOKUP(B54,'Membership #'!$A$1:$C$1005,2,FALSE)))","v":"Stephaine Clark"},{"$f":"IF(B54=\"\",\"\",(VLOOKUP(B54,'Membership #'!$A$1:$C$1005,3,FALSE)))","v":"Perks A Flyin"}]
[53,666,{"$f":"IF(B55=\"\",\"\",(VLOOKUP(B55,'Membership #'!$A$1:$C$1005,2,FALSE)))","v":"Summer Fraser"},{"$f":"IF(B55=\"\",\"\",(VLOOKUP(B55,'Membership #'!$A$1:$C$1005,3,FALSE)))","v":"Sheza Smokin' Girl"}]
[54,961,{"$f":"IF(B56=\"\",\"\",(VLOOKUP(B56,'Membership #'!$A$1:$C$1005,2,FALSE)))","v":"Jacie Burke"},{"$f":"IF(B56=\"\",\"\",(VLOOKUP(B56,'Membership #'!$A$1:$C$1005,3,FALSE)))","v":"She's Just That Sassy"}]
[55,962,{"$f":"IF(B57=\"\",\"\",(VLOOKUP(B57,'Membership #'!$A$1:$C$1005,2,FALSE)))","v":"Hariin Burke"},{"$f":"IF(B57=\"\",\"\",(VLOOKUP(B57,'Membership #'!$A$1:$C$1005,3,FALSE)))","v":"Olds Bold Impulse"}]
[56,963,{"$f":"IF(B58=\"\",\"\",(VLOOKUP(B58,'Membership #'!$A$1:$C$1005,2,FALSE)))","v":"Leighton Burke"},{"$f":"IF(B58=\"\",\"\",(VLOOKUP(B58,'Membership #'!$A$1:$C$1005,3,FALSE)))","v":"Boot Scootin Boogie"}]
[57,909,{"$f":"IF(B59=\"\",\"\",(VLOOKUP(B59,'Membership #'!$A$1:$C$1005,2,FALSE)))","v":"Rebecca Gillis"},{"$f":"IF(B59=\"\",\"\",(VLOOKUP(B59,'Membership #'!$A$1:$C$1005,3,FALSE)))","v":"Martha's Tivio Moon"}]
[58,802,{"$f":"IF(B60=\"\",\"\",(VLOOKUP(B60,'Membership #'!$A$1:$C$1005,2,FALSE)))","v":"Ava Reginato"},{"$f":"IF(B60=\"\",\"\",(VLOOKUP(B60,'Membership #'!$A$1:$C$1005,3,FALSE)))","v":"Jacs Last Flash"}]
[59,537,{"$f":"IF(B61=\"\",\"\",(VLOOKUP(B61,'Membership #'!$A$1:$C$1005,2,FALSE)))","v":"Alka Virick"},{"$f":"IF(B61=\"\",\"\",(VLOOKUP(B61,'Membership #'!$A$1:$C$1005,3,FALSE)))","v":"Corona Identity"}]
[60,941,{"$f":"IF(B62=\"\",\"\",(VLOOKUP(B62,'Membership #'!$A$1:$C$1005,2,FALSE)))","v":"Taylor Hurley"},{"$f":"IF(B62=\"\",\"\",(VLOOKUP(B62,'Membership #'!$A$1:$C$1005,3,FALSE)))","v":"Nacho Business"}]
[61,904,{"$f":"IF(B63=\"\",\"\",(VLOOKUP(B63,'Membership #'!$A$1:$C$1005,2,FALSE)))","v":"Ella Cowley"},{"$f":"IF(B63=\"\",\"\",(VLOOKUP(B63,'Membership #'!$A$1:$C$1005,3,FALSE)))","v":"Blazin Boots"}]
[62,889,{"$f":"IF(B64=\"\",\"\",(VLOOKUP(B64,'Membership #'!$A$1:$C$1005,2,FALSE)))","v":"Adelaine Cowley"},{"$f":"IF(B64=\"\",\"\",(VLOOKUP(B64,'Membership #'!$A$1:$C$1005,3,FALSE)))","v":"Frenchman's Promise"}]
[63,966,{"$f":"IF(B65=\"\",\"\",(VLOOKUP(B65,'Membership #'!$A$1:$C$1005,2,FALSE)))","v":"Ava Anderson"},{"$f":"IF(B65=\"\",\"\",(VLOOKUP(B65,'Membership #'!$A$1:$C$1005,3,FALSE)))","v":"Black Sass"}]
[64,674,{"$f":"IF(B66=\"\",\"\",(VLOOKUP(B66,'Membership #'!$A$1:$C$1005,2,FALSE)))","v":"Kyle Beaton"},{"$f":"IF(B66=\"\",\"\",(VLOOKUP(B66,'Membership #'!$A$1:$C$1005,3,FALSE)))","v":"Jus For Kicks"}]
[65,716,{"$f":"IF(B67=\"\",\"\",(VLOOKUP(B67,'Membership #'!$A$1:$C$1005,2,FALSE)))","v":"Kayla Martin"},{"$f":"IF(B67=\"\",\"\",(VLOOKUP(B67,'Membership #'!$A$1:$C$1005,3,FALSE)))","v":"Dash Ta Home"}]
[66,538,{"$f":"IF(B68=\"\",\"\",(VLOOKUP(B68,'Membership #'!$A$1:$C$1005,2,FALSE)))","v":"Jean DuGas"},{"$f":"IF(B68=\"\",\"\",(VLOOKUP(B68,'Membership #'!$A$1:$C$1005,3,FALSE)))","v":"Pal's Lilguy"}]
[67,null,null,{"$f":"IF(B69=\"\",\"\",(VLOOKUP(B69,'Membership #'!$A$1:$C$1005,3,FALSE)))","v":""}]
[68,null,null,{"$f":"IF(B70=\"\",\"\",(VLOOKUP(B70,'Membership #'!$A$1:$C$1005,3,FALSE)))","v":""}]
[69,null,null,{"$f":"IF(B71=\"\",\"\",(VLOOKUP(B71,'Membership #'!$A$1:$C$1005,3,FALSE)))","v":""}]
[70,null,null,{"$f":"IF(B72=\"\",\"\",(VLOOKUP(B72,'Membership #'!$A$1:$C$1005,3,FALSE)))","v":""}]
[71,null,null,{"$f":"IF(B73=\"\",\"\",(VLOOKUP(B73,'Membership #'!$A$1:$C$1005,3,FALSE)))","v":""}]
[72,null,null,{"$f":"IF(B74=\"\",\"\",(VLOOKUP(B74,'Membership #'!$A$1:$C$1005,3,FALSE)))","v":""}]
[73,null,null,{"$f":"IF(B75=\"\",\"\",(VLOOKUP(B75,'Membership #'!$A$1:$C$1005,3,FALSE)))","v":""}]
[74,null,null,{"$f":"IF(B76=\"\",\"\",(VLOOKUP(B76,'Membership #'!$A$1:$C$1005,3,FALSE)))","v":""}]
[75,null,null,{"$f":"IF(B77=\"\",\"\",(VLOOKUP(B77,'Membership #'!$A$1:$C$1005,3,FALSE)))","v":""}]
[76,null,null,{"$f":"IF(B78=\"\",\"\",(VLOOKUP(B78,'Membership #'!$A$1:$C$1005,3,FALSE)))","v":""}]
[77,null,null,{"$f":"IF(B79=\"\",\"\",(VLOOKUP(B79,'Membership #'!$A$1:$C$1005,3,FALSE)))","v":""}]
[78,null,null,{"$f":"IF(B80=\"\",\"\",(VLOOKUP(B80,'Membership #'!$A$1:$C$1005,3,FALSE)))","v":""}]
[79,null,null,{"$f":"IF(B81=\"\",\"\",(VLOOKUP(B81,'Membership #'!$A$1:$C$1005,3,FALSE)))","v":""}]
[80,null,null,{"$f":"IF(B82=\"\",\"\",(VLOOKUP(B82,'Membership #'!$A$1:$C$1005,3,FALSE)))","v":""}]
[81,null,null,{"$f":"IF(B83=\"\",\"\",(VLOOKUP(B83,'Membership #'!$A$1:$C$1005,3,FALSE)))","v":""}]
[82,null,null,{"$f":"IF(B84=\"\",\"\",(VLOOKUP(B84,'Membership #'!$A$1:$C$1005,3,FALSE)))","v":""}]
[83,null,null,{"$f":"IF(B85=\"\",\"\",(VLOOKUP(B85,'Membership #'!$A$1:$C$1005,3,FALSE)))","v":""}]
[84,null,null,{"$f":"IF(B86=\"\",\"\",(VLOOKUP(B86,'Membership #'!$A$1:$C$1005,3,FALSE)))","v":""}]
[85,null,null,{"$f":"IF(B87=\"\",\"\",(VLOOKUP(B87,'Membership #'!$A$1:$C$1005,3,FALSE)))","v":""}]
[86,null,null,{"$f":"IF(B88=\"\",\"\",(VLOOKUP(B88,'Membership #'!$A$1:$C$1005,3,FALSE)))","v":""}]
[87,null,null,{"$f":"IF(B89=\"\",\"\",(VLOOKUP(B89,'Membership #'!$A$1:$C$1005,3,FALSE)))","v":""}]
[88,null,null,{"$f":"IF(B90=\"\",\"\",(VLOOKUP(B90,'Membership #'!$A$1:$C$1005,3,FALSE)))","v":""}]
[89,null,null,{"$f":"IF(B91=\"\",\"\",(VLOOKUP(B91,'Membership #'!$A$1:$C$1005,3,FALSE)))","v":""}]
[90,null,null,{"$f":"IF(B92=\"\",\"\",(VLOOKUP(B92,'Membership #'!$A$1:$C$1005,3,FALSE)))","v":""}]
[91,null,null,{"$f":"IF(B93=\"\",\"\",(VLOOKUP(B93,'Membership #'!$A$1:$C$1005,3,FALSE)))","v":""}]
[92,null,null,{"$f":"IF(B94=\"\",\"\",(VLOOKUP(B94,'Membership #'!$A$1:$C$1005,3,FALSE)))","v":""}]
[93,null,null,{"$f":"IF(B95=\"\",\"\",(VLOOKUP(B95,'Membership #'!$A$1:$C$1005,3,FALSE)))","v":""}]
[94,null,null,{"$f":"IF(B96=\"\",\"\",(VLOOKUP(B96,'Membership #'!$A$1:$C$1005,3,FALSE)))","v":""}]
[95,null,null,{"$f":"IF(B97=\"\",\"\",(VLOOKUP(B97,'Membership #'!$A$1:$C$1005,3,FALSE)))","v":""}]
[96,null,null,{"$f":"IF(B98=\"\",\"\",(VLOOKUP(B98,'Membership #'!$A$1:$C$1005,3,FALSE)))","v":""}]
[97,null,null,{"$f":"IF(B99=\"\",\"\",(VLOOKUP(B99,'Membership #'!$A$1:$C$1005,3,FALSE)))","v":""}]
[98,null,null,{"$f":"IF(B100=\"\",\"\",(VLOOKUP(B100,'Membership #'!$A$1:$C$1005,3,FALSE)))","v":""}]
[99,null,null,{"$f":"IF(B101=\"\",\"\",(VLOOKUP(B101,'Membership #'!$A$1:$C$1005,3,FALSE)))","v":""}]
[100,null,null,{"$f":"IF(B102=\"\",\"\",(VLOOKUP(B102,'Membership #'!$A$1:$C$1005,3,FALSE)))","v":""}]
[101,null,null,{"$f":"IF(B103=\"\",\"\",(VLOOKUP(B103,'Membership #'!$A$1:$C$1005,3,FALSE)))","v":""}]
[102,null,null,{"$f":"IF(B104=\"\",\"\",(VLOOKUP(B104,'Membership #'!$A$1:$C$1005,3,FALSE)))","v":""}]
[103,null,null,{"$f":"IF(B105=\"\",\"\",(VLOOKUP(B105,'Membership #'!$A$1:$C$1005,3,FALSE)))","v":""}]
[104,null,null,{"$f":"IF(B106=\"\",\"\",(VLOOKUP(B106,'Membership #'!$A$1:$C$1005,3,FALSE)))","v":""}]
[105,null,null,{"$f":"IF(B107=\"\",\"\",(VLOOKUP(B107,'Membership #'!$A$1:$C$1005,3,FALSE)))","v":""}]
[106,null,null,{"$f":"IF(B108=\"\",\"\",(VLOOKUP(B108,'Membership #'!$A$1:$C$1005,3,FALSE)))","v":""}]
[107,null,null,{"$f":"IF(B109=\"\",\"\",(VLOOKUP(B109,'Membership #'!$A$1:$C$1005,3,FALSE)))","v":""}]
[108,null,null,{"$f":"IF(B110=\"\",\"\",(VLOOKUP(B110,'Membership #'!$A$1:$C$1005,3,FALSE)))","v":""}]
[null,null,null,{"$f":"IF(B111=\"\",\"\",(VLOOKUP(B111,'Membership #'!$A$1:$C$1005,3,FALSE)))","v":""}]
[null,null,{"$f":"IF(B112=\"\",\"\",(VLOOKUP(B112,'Membership #'!$A$1:$C$377,2,FALSE)))","v":""},{"$f":"IF(B112=\"\",\"\",(VLOOKUP(B112,'Membership #'!$A$1:$C$377,3,FALSE)))","v":""}]
[null,null,{"$f":"IF(B113=\"\",\"\",(VLOOKUP(B113,'Membership #'!$A$1:$C$377,2,FALSE)))","v":""},{"$f":"IF(B113=\"\",\"\",(VLOOKUP(B113,'Membership #'!$A$1:$C$377,3,FALSE)))","v":""}]

{"sheet":"MBRA ","index":2,"n_rows":108,"n_cols":18,"rows_kept":108,"cut":false,"hidden":false,"merged":[[0,0,0,12]]}
["Tom Burt & Mark McGuire Memorial JACKPOT Aug 21 & 22, 2021"]
[null,"RING #      ","NAME","HORSE NAME","Exhibition ",null," Day #1 Fee","3-D Barrels","Day /2 Fee","Admin Fee","Drug Fee","Trailer Fee","Total","Etransfrer"]
[1,78,{"$f":"IF(B3=\"\",\"\",(VLOOKUP(B3,'Membership #'!$A$1:$C$1005,2,FALSE)))","v":"Stephanie Rich"},{"$f":"IF(B3=\"\",\"\",(VLOOKUP(B3,'Membership #'!$A$1:$C$1005,3,FALSE)))","v":"Texas Mickey"},null,null,60,null,60,50,5,null,{"$f":"SUM(G3:L3)","v":175},-175,null,null,{"$f":"SUM(M3:P3)","v":0}]
[2,514,{"$f":"IF(B4=\"\",\"\",(VLOOKUP(B4,'Membership #'!$A$1:$C$1005,2,FALSE)))","v":"Heather Morrison"},{"$f":"IF(B4=\"\",\"\",(VLOOKUP(B4,'Membership #'!$A$1:$C$1005,3,FALSE)))","v":"Black Fire Dash"},null,null,10,15,10,50,5,40,130,null,null,null,130]
[3,516,{"$f":"IF(B5=\"\",\"\",(VLOOKUP(B5,'Membership #'!$A$1:$C$1005,2,FALSE)))","v":"Laurie Don Reginato"},{"$f":"IF(B5=\"\",\"\",(VLOOKUP(B5,'Membership #'!$A$1:$C$1005,3,FALSE)))","v":"TCR Gold Runny"},null,null,40,15,40,50,5,null,150,null,null,null,150]
[4,518,{"$f":"IF(B6=\"\",\"\",(VLOOKUP(B6,'Membership #'!$A$1:$C$1005,2,FALSE)))","v":"Sylvester Weatherbie"},{"$f":"IF(B6=\"\",\"\",(VLOOKUP(B6,'Membership #'!$A$1:$C$1005,3,FALSE)))","v":"J.R."},null,null,20,15,20,50,5,40,150,-150,null,null,0]
[5,530,{"$f":"IF(B7=\"\",\"\",(VLOOKUP(B7,'Membership #'!$A$1:$C$1005,2,FALSE)))","v":"Joan Grant"},{"$f":"IF(B7=\"\",\"\",(VLOOKUP(B7,'Membership #'!$A$1:$C$1005,3,FALSE)))","v":"SLS Dash to Holland"},null,null,20,15,20,50,5,null,110,-110,null,null,0]
[6,531,{"$f":"IF(B8=\"\",\"\",(VLOOKUP(B8,'Membership #'!$A$1:$C$1005,2,FALSE)))","v":"Addison Peters"},{"$f":"IF(B8=\"\",\"\",(VLOOKUP(B8,'Membership #'!$A$1:$C$1005,3,FALSE)))","v":"He's A Little Wonder"},null,null,null,null,null,50,5,null,55,null,null,null,55]
[7,532,{"$f":"IF(B9=\"\",\"\",(VLOOKUP(B9,'Membership #'!$A$1:$C$1005,2,FALSE)))","v":"Gracie MacLean"},{"$f":"IF(B9=\"\",\"\",(VLOOKUP(B9,'Membership #'!$A$1:$C$1005,3,FALSE)))","v":"Secret"},null,null,5,null,5,50,5,40,105,-145,null,null,-40,"you owe him $40"]
[8,534,{"$f":"IF(B10=\"\",\"\",(VLOOKUP(B10,'Membership #'!$A$1:$C$1005,2,FALSE)))","v":"Mary Lou Rankin Dentin"},{"$f":"IF(B10=\"\",\"\",(VLOOKUP(B10,'Membership #'!$A$1:$C$1005,3,FALSE)))","v":"Brandy's Chocolena"},null,null,20,15,20,50,5,40,150,-150,null,null,0]
[9,537,{"$f":"IF(B11=\"\",\"\",(VLOOKUP(B11,'Membership #'!$A$1:$C$1005,2,FALSE)))","v":"Alka Virick"},{"$f":"IF(B11=\"\",\"\",(VLOOKUP(B11,'Membership #'!$A$1:$C$1005,3,FALSE)))","v":"Corona Identity"},null,null,30,null,30,50,5,40,155,-150,null,null,5,"you owe her $5"]
[10,538,{"$f":"IF(B12=\"\",\"\",(VLOOKUP(B12,'Membership #'!$A$1:$C$1005,2,FALSE)))","v":"Jean DuGas"},{"$f":"IF(B12=\"\",\"\",(VLOOKUP(B12,'Membership #'!$A$1:$C$1005,3,FALSE)))","v":"Pal's Lilguy"},null,null,40,15,null,25,5,null,85,-110,null,null,-25,"you owe her $25"]
[11,556,{"$f":"IF(B13=\"\",\"\",(VLOOKUP(B13,'Membership #'!$A$1:$C$1005,2,FALSE)))","v":"Stephaine Clark"},{"$f":"IF(B13=\"\",\"\",(VLOOKUP(B13,'Membership #'!$A$1:$C$1005,3,FALSE)))","v":"Perks A Flyin"},null,null,30,15,30,50,5,40,170,null,null,null,170]
[12,563,{"$f":"IF(B14=\"\",\"\",(VLOOKUP(B14,'Membership #'!$A$1:$C$1005,2,FALSE)))","v":"Kevin Bateman"},{"$f":"IF(B14=\"\",\"\",(VLOOKUP(B14,'Membership #'!$A$1:$C$1005,3,FALSE)))","v":"Jess Chasin A Hobby"},null,null,10,15,10,50,5,null,90,-90,null,null,0]
[13,591,{"$f":"IF(B15=\"\",\"\",(VLOOKUP(B15,'Membership #'!$A$1:$C$1005,2,FALSE)))","v":"Wendy MacLean"},{"$f":"IF(B15=\"\",\"\",(VLOOKUP(B15,'Membership #'!$A$1:$C$1005,3,FALSE)))","v":"White Sox N Flyin"},null,null,10,15,10,50,5,null,90,-90,null,null,0]
[14,600,{"$f":"IF(B16=\"\",\"\",(VLOOKUP(B16,'Membership #'!$A$1:$C$1005,2,FALSE)))","v":"Stan Brown"},{"$f":"IF(B16=\"\",\"\",(VLOOKUP(B16,'Membership #'!$A$1:$C$1005,3,FALSE)))","v":"A Perty Sure Thing"},null,null,20,15,20,50,5,null,110,-110,null,null,0]
[15,616,{"$f":"IF(B17=\"\",\"\",(VLOOKUP(B17,'Membership #'!$A$1:$C$1005,2,FALSE)))","v":"Judy Bateman"},{"$f":"IF(B17=\"\",\"\",(VLOOKUP(B17,'Membership #'!$A$1:$C$1005,3,FALSE)))","v":"HM HollywoodRockstar"},null,null,40,15,40,50,5,40,190,-190,null,null,0]
[16,627,{"$f":"IF(B18=\"\",\"\",(VLOOKUP(B18,'Membership #'!$A$1:$C$1005,2,FALSE)))","v":"Kaelyn Keddy"},{"$f":"IF(B18=\"\",\"\",(VLOOKUP(B18,'Membership #'!$A$1:$C$1005,3,FALSE)))","v":"Sight to Behold"},null,null,null,null,null,50,5,null,55,-55,null,null,0]
[17,636,{"$f":"IF(B19=\"\",\"\",(VLOOKUP(B19,'Membership #'!$A$1:$C$1005,2,FALSE)))","v":"Ceilidh Gosse"},{"$f":"IF(B19=\"\",\"\",(VLOOKUP(B19,'Membership #'!$A$1:$C$1005,3,FALSE)))","v":"ELM Silver Crime"},null,null,10,15,10,50,5,null,90,-75,null,null,15,"she owes you $15"]
[18,638,{"$f":"IF(B20=\"\",\"\",(VLOOKUP(B20,'Membership #'!$A$1:$C$1005,2,FALSE)))","v":"Bella Peters"},{"$f":"IF(B20=\"\",\"\",(VLOOKUP(B20,'Membership #'!$A$1:$C$1005,3,FALSE)))","v":"Super Star"},null,null,10,15,10,50,5,null,90,null,null,null,90]
[19,647,{"$f":"IF(B21=\"\",\"\",(VLOOKUP(B21,'Membership #'!$A$1:$C$1005,2,FALSE)))","v":"Courtney Parker"},{"$f":"IF(B21=\"\",\"\",(VLOOKUP(B21,'Membership #'!$A$1:$C$1005,3,FALSE)))","v":"BW Rare Kinda Love"},null,null,20,15,20,50,5,null,110,-110,null,null,0]
[20,652,{"$f":"IF(B22=\"\",\"\",(VLOOKUP(B22,'Membership #'!$A$1:$C$1005,2,FALSE)))","v":"Molly O'Grady"},{"$f":"IF(B22=\"\",\"\",(VLOOKUP(B22,'Membership #'!$A$1:$C$1005,3,FALSE)))","v":"Teelano's Twister"},null,null,30,null,30,50,5,null,115,-115,null,null,0]
[21,655,{"$f":"IF(B23=\"\",\"\",(VLOOKUP(B23,'Membership #'!$A$1:$C$1005,2,FALSE)))","v":"Julia Parker"},{"$f":"IF(B23=\"\",\"\",(VLOOKUP(B23,'Membership #'!$A$1:$C$1005,3,FALSE)))","v":"Boons Feature Star"},null,null,30,15,30,50,5,null,130,-130,null,null,0]
[22,657,{"$f":"IF(B24=\"\",\"\",(VLOOKUP(B24,'Membership #'!$A$1:$C$1005,2,FALSE)))","v":"Laura Morrison"},{"$f":"IF(B24=\"\",\"\",(VLOOKUP(B24,'Membership #'!$A$1:$C$1005,3,FALSE)))","v":"Steal Ta Fame"},null,null,20,15,20,50,5,null,110,-110,null,null,0]
[23,666,{"$f":"IF(B25=\"\",\"\",(VLOOKUP(B25,'Membership #'!$A$1:$C$1005,2,FALSE)))","v":"Summer Fraser"},{"$f":"IF(B25=\"\",\"\",(VLOOKUP(B25,'Membership #'!$A$1:$C$1005,3,FALSE)))","v":"Sheza Smokin' Girl"},null,null,10,null,10,50,5,null,75,-75,null,null,0]
[24,674,{"$f":"IF(B26=\"\",\"\",(VLOOKUP(B26,'Membership #'!$A$1:$C$1005,2,FALSE)))","v":"Kyle Beaton"},{"$f":"IF(B26=\"\",\"\",(VLOOKUP(B26,'Membership #'!$A$1:$C$1005,3,FALSE)))","v":"Jus For Kicks"},null,null,40,null,40,50,5,null,135,-135,null,null,0]
[25,684,{"$f":"IF(B27=\"\",\"\",(VLOOKUP(B27,'Membership #'!$A$1:$C$1005,2,FALSE)))","v":"Shann Cox"},{"$f":"IF(B27=\"\",\"\",(VLOOKUP(B27,'Membership #'!$A$1:$C$1005,3,FALSE)))","v":"Jags Cash Flow"},null,null,40,15,40,50,5,null,150,-150,null,null,0]
[26,688,{"$f":"IF(B28=\"\",\"\",(VLOOKUP(B28,'Membership #'!$A$1:$C$1005,2,FALSE)))","v":"Lenee Sampson"},{"$f":"IF(B28=\"\",\"\",(VLOOKUP(B28,'Membership #'!$A$1:$C$1005,3,FALSE)))","v":"Six Dash Run"},null,null,30,15,25,50,5,null,125,-125,null,null,0]
[27,695,{"$f":"IF(B29=\"\",\"\",(VLOOKUP(B29,'Membership #'!$A$1:$C$1005,2,FALSE)))","v":"Tessa Dicks"},{"$f":"IF(B29=\"\",\"\",(VLOOKUP(B29,'Membership #'!$A$1:$C$1005,3,FALSE)))","v":"Charge's Dusty Luck"},null,null,40,15,40,50,5,null,150,-150,null,null,0]
[28,698,{"$f":"IF(B30=\"\",\"\",(VLOOKUP(B30,'Membership #'!$A$1:$C$1005,2,FALSE)))","v":"Kaleigh Denton"},{"$f":"IF(B30=\"\",\"\",(VLOOKUP(B30,'Membership #'!$A$1:$C$1005,3,FALSE)))","v":"Coleasaki"},null,null,40,15,40,50,5,null,150,-150,null,null,0]
[29,699,{"$f":"IF(B31=\"\",\"\",(VLOOKUP(B31,'Membership #'!$A$1:$C$1005,2,FALSE)))","v":"Laura Morrison"},{"$f":"IF(B31=\"\",\"\",(VLOOKUP(B31,'Membership #'!$A$1:$C$1005,3,FALSE)))","v":"MDC Dark Revelation"},null,null,10,15,10,50,5,null,90,-90,null,null,0]
[30,700,{"$f":"IF(B32=\"\",\"\",(VLOOKUP(B32,'Membership #'!$A$1:$C$1005,2,FALSE)))","v":"Lindsay Baker"},{"$f":"IF(B32=\"\",\"\",(VLOOKUP(B32,'Membership #'!$A$1:$C$1005,3,FALSE)))","v":"Boons Laughing Boy"},null,null,40,15,40,50,5,null,150,-150,null,null,0]
[31,702,{"$f":"IF(B33=\"\",\"\",(VLOOKUP(B33,'Membership #'!$A$1:$C$1005,2,FALSE)))","v":"Jenna Proctor"},{"$f":"IF(B33=\"\",\"\",(VLOOKUP(B33,'Membership #'!$A$1:$C$1005,3,FALSE)))","v":"Painted to Perfection"},null,null,null,15,null,50,5,null,70,-70,null,null,0]
[32,703,{"$f":"IF(B34=\"\",\"\",(VLOOKUP(B34,'Membership #'!$A$1:$C$1005,2,FALSE)))","v":"Chris Baker"},{"$f":"IF(B34=\"\",\"\",(VLOOKUP(B34,'Membership #'!$A$1:$C$1005,3,FALSE)))","v":"Jamer All Fired Up"},null,null,40,15,40,50,5,40,190,-190,null,null,0]
[33,710,{"$f":"IF(B35=\"\",\"\",(VLOOKUP(B35,'Membership #'!$A$1:$C$1005,2,FALSE)))","v":"Owen Baker"},{"$f":"IF(B35=\"\",\"\",(VLOOKUP(B35,'Membership #'!$A$1:$C$1005,3,FALSE)))","v":"Tip It Back"},null,null,null,null,null,50,5,null,{"$f":"SUM(G35:L35)","v":55},-55,null,null,{"$f":"SUM(M35:P35)","v":0}]
[34,716,{"$f":"IF(B36=\"\",\"\",(VLOOKUP(B36,'Membership #'!$A$1:$C$1005,2,FALSE)))","v":"Kayla Martin"},{"$f":"IF(B36=\"\",\"\",(VLOOKUP(B36,'Membership #'!$A$1:$C$1005,3,FALSE)))","v":"Dash Ta Home"},null,null,20,15,20,50,5,null,110,-110,null,null,0]
[35,732,{"$f":"IF(B37=\"\",\"\",(VLOOKUP(B37,'Membership #'!$A$1:$C$1005,2,FALSE)))","v":"Brenna Carrigan"},{"$f":"IF(B37=\"\",\"\",(VLOOKUP(B37,'Membership #'!$A$1:$C$1005,3,FALSE)))","v":"Carlos"},null,null,60,15,60,50,5,null,190,-190,null,null,0]
[36,746,{"$f":"IF(B38=\"\",\"\",(VLOOKUP(B38,'Membership #'!$A$1:$C$1005,2,FALSE)))","v":"Cassie MacDonald"},{"$f":"IF(B38=\"\",\"\",(VLOOKUP(B38,'Membership #'!$A$1:$C$1005,3,FALSE)))","v":"Sandy Dew"},null,null,20,null,20,50,5,null,95,null,null,null,95]
[37,750,{"$f":"IF(B39=\"\",\"\",(VLOOKUP(B39,'Membership #'!$A$1:$C$1005,2,FALSE)))","v":"Tanya Kennedy"},{"$f":"IF(B39=\"\",\"\",(VLOOKUP(B39,'Membership #'!$A$1:$C$1005,3,FALSE)))","v":"Old Stations Pride"},null,null,30,15,30,50,5,40,170,-170,null,null,0]
[38,753,{"$f":"IF(B40=\"\",\"\",(VLOOKUP(B40,'Membership #'!$A$1:$C$1005,2,FALSE)))","v":"Kayla Boudreau"},{"$f":"IF(B40=\"\",\"\",(VLOOKUP(B40,'Membership #'!$A$1:$C$1005,3,FALSE)))","v":"Lady Jane"},null,null,20,15,20,50,5,null,110,-110,null,null,0]
[39,768,{"$f":"IF(B41=\"\",\"\",(VLOOKUP(B41,'Membership #'!$A$1:$C$1005,2,FALSE)))","v":"Tracey Higgins"},{"$f":"IF(B41=\"\",\"\",(VLOOKUP(B41,'Membership #'!$A$1:$C$1005,3,FALSE)))","v":"Iza Wicked Wind"},null,null,10,15,10,50,5,40,130,-130,null,null,0]
[40,777,{"$f":"IF(B42=\"\",\"\",(VLOOKUP(B42,'Membership #'!$A$1:$C$1005,2,FALSE)))","v":"Julia Parker"},{"$f":"IF(B42=\"\",\"\",(VLOOKUP(B42,'Membership #'!$A$1:$C$1005,3,FALSE)))","v":"Doc's Spirit Prairie"},null,null,40,15,40,50,5,40,190,-190,null,null,0]
[41,786,{"$f":"IF(B43=\"\",\"\",(VLOOKUP(B43,'Membership #'!$A$1:$C$1005,2,FALSE)))","v":"Rileigh Conrod"},{"$f":"IF(B43=\"\",\"\",(VLOOKUP(B43,'Membership #'!$A$1:$C$1005,3,FALSE)))","v":"Scotches Harley"},null,null,10,15,10,50,5,null,90,-90,null,null,0]
[42,802,{"$f":"IF(B44=\"\",\"\",(VLOOKUP(B44,'Membership #'!$A$1:$C$1005,2,FALSE)))","v":"Ava Reginato"},{"$f":"IF(B44=\"\",\"\",(VLOOKUP(B44,'Membership #'!$A$1:$C$1005,3,FALSE)))","v":"Jacs Last Flash"},null,null,null,null,null,50,5,null,55,-55,null,null,0]
[43,815,{"$f":"IF(B45=\"\",\"\",(VLOOKUP(B45,'Membership #'!$A$1:$C$1005,2,FALSE)))","v":"Brooke Kennedy"},{"$f":"IF(B45=\"\",\"\",(VLOOKUP(B45,'Membership #'!$A$1:$C$1005,3,FALSE)))","v":"Tic Toc Teazer"},null,null,10,15,10,50,5,null,90,-90,null,null,0]
[44,855,{"$f":"IF(B46=\"\",\"\",(VLOOKUP(B46,'Membership #'!$A$1:$C$1005,2,FALSE)))","v":"Jenelle Collier"},{"$f":"IF(B46=\"\",\"\",(VLOOKUP(B46,'Membership #'!$A$1:$C$1005,3,FALSE)))","v":"Peppy Sans Surprise"},null,null,40,15,40,50,5,null,150,-150,null,null,0]
[45,867,{"$f":"IF(B47=\"\",\"\",(VLOOKUP(B47,'Membership #'!$A$1:$C$1005,2,FALSE)))","v":"Layla MacEachem"},{"$f":"IF(B47=\"\",\"\",(VLOOKUP(B47,'Membership #'!$A$1:$C$1005,3,FALSE)))","v":"Shes a gem"},null,null,10,15,10,50,5,40,130,-130,null,null,0]
[46,889,{"$f":"IF(B48=\"\",\"\",(VLOOKUP(B48,'Membership #'!$A$1:$C$1005,2,FALSE)))","v":"Adelaine Cowley"},{"$f":"IF(B48=\"\",\"\",(VLOOKUP(B48,'Membership #'!$A$1:$C$1005,3,FALSE)))","v":"Frenchman's Promise"},null,null,20,15,20,50,5,null,110,null,null,null,110]
[47,892,{"$f":"IF(B49=\"\",\"\",(VLOOKUP(B49,'Membership #'!$A$1:$C$1005,2,FALSE)))","v":"Donnie MacNeil"},{"$f":"IF(B49=\"\",\"\",(VLOOKUP(B49,'Membership #'!$A$1:$C$1005,3,FALSE)))","v":"Gifted Go Gold"},null,null,50,15,50,50,5,40,210,-210,null,null,0]
[48,904,{"$f":"IF(B50=\"\",\"\",(VLOOKUP(B50,'Membership #'!$A$1:$C$1005,2,FALSE)))","v":"Ella Cowley"},{"$f":"IF(B50=\"\",\"\",(VLOOKUP(B50,'Membership #'!$A$1:$C$1005,3,FALSE)))","v":"Blazin Boots"},null,null,70,15,70,50,5,null,210,null,null,null,210]
[49,908,{"$f":"IF(B51=\"\",\"\",(VLOOKUP(B51,'Membership #'!$A$1:$C$1005,2,FALSE)))","v":"Josie Higgins"},{"$f":"IF(B51=\"\",\"\",(VLOOKUP(B51,'Membership #'!$A$1:$C$1005,3,FALSE)))","v":"Rocket Man"},null,null,null,null,null,50,5,null,55,-55,null,null,0]
[50,909,{"$f":"IF(B52=\"\",\"\",(VLOOKUP(B52,'Membership #'!$A$1:$C$1005,2,FALSE)))","v":"Rebecca Gillis"},{"$f":"IF(B52=\"\",\"\",(VLOOKUP(B52,'Membership #'!$A$1:$C$1005,3,FALSE)))","v":"Martha's Tivio Moon"},null,null,40,15,40,50,5,null,150,-150,null,null,0]
[51,914,{"$f":"IF(B53=\"\",\"\",(VLOOKUP(B53,'Membership #'!$A$1:$C$1005,2,FALSE)))","v":"Shelby MacPherson"},{"$f":"IF(B53=\"\",\"\",(VLOOKUP(B53,'Membership #'!$A$1:$C$1005,3,FALSE)))","v":"Shelbys Badger Bar"},null,null,50,15,50,50,5,null,170,-170,null,null,0]
[52,918,{"$f":"IF(B54=\"\",\"\",(VLOOKUP(B54,'Membership #'!$A$1:$C$1005,2,FALSE)))","v":"Keira Rose"},{"$f":"IF(B54=\"\",\"\",(VLOOKUP(B54,'Membership #'!$A$1:$C$1005,3,FALSE)))","v":"LL Its All About Red"},null,null,10,15,10,50,5,null,90,-90,null,null,0]
[53,922,{"$f":"IF(B55=\"\",\"\",(VLOOKUP(B55,'Membership #'!$A$1:$C$1005,2,FALSE)))","v":"Stevi Jardine"},{"$f":"IF(B55=\"\",\"\",(VLOOKUP(B55,'Membership #'!$A$1:$C$1005,3,FALSE)))","v":"Paytons Pretty Cool"},null,null,40,15,40,50,5,40,190,-195,null,null,-5]
[54,928,{"$f":"IF(B56=\"\",\"\",(VLOOKUP(B56,'Membership #'!$A$1:$C$1005,2,FALSE)))","v":"Tessa Dicks"},{"$f":"IF(B56=\"\",\"\",(VLOOKUP(B56,'Membership #'!$A$1:$C$1005,3,FALSE)))","v":"ELM Dash of Crime"},null,null,40,15,40,50,5,null,150,-150,null,null,0]
[55,941,{"$f":"IF(B57=\"\",\"\",(VLOOKUP(B57,'Membership #'!$A$1:$C$1005,2,FALSE)))","v":"Taylor Hurley"},{"$f":"IF(B57=\"\",\"\",(VLOOKUP(B57,'Membership #'!$A$1:$C$1005,3,FALSE)))","v":"Nacho Business"},null,null,10,null,10,50,5,null,75,-75,null,null,0]
[56,954,{"$f":"IF(B58=\"\",\"\",(VLOOKUP(B58,'Membership #'!$A$1:$C$1005,2,FALSE)))","v":"Scotia MacEachern"},{"$f":"IF(B58=\"\",\"\",(VLOOKUP(B58,'Membership #'!$A$1:$C$1005,3,FALSE)))","v":"Hick-a-Licious"},null,null,30,15,30,50,5,null,130,-130,null,null,0]
[57,961,{"$f":"IF(B59=\"\",\"\",(VLOOKUP(B59,'Membership #'!$A$1:$C$1005,2,FALSE)))","v":"Jacie Burke"},{"$f":"IF(B59=\"\",\"\",(VLOOKUP(B59,'Membership #'!$A$1:$C$1005,3,FALSE)))","v":"She's Just That Sassy"},null,null,10,null,10,50,5,null,75,-75,null,null,0]
[58,962,{"$f":"IF(B60=\"\",\"\",(VLOOKUP(B60,'Membership #'!$A$1:$C$1005,2,FALSE)))","v":"Hariin Burke"},{"$f":"IF(B60=\"\",\"\",(VLOOKUP(B60,'Membership #'!$A$1:$C$1005,3,FALSE)))","v":"Olds Bold Impulse"},null,null,null,null,null,50,5,40,95,-95,null,null,0]
[59,963,{"$f":"IF(B61=\"\",\"\",(VLOOKUP(B61,'Membership #'!$A$1:$C$1005,2,FALSE)))","v":"Leighton Burke"},{"$f":"IF(B61=\"\",\"\",(VLOOKUP(B61,'Membership #'!$A$1:$C$1005,3,FALSE)))","v":"Boot Scootin Boogie"},null,null,null,null,null,50,5,null,55,-55,null,null,0]
[60,966,{"$f":"IF(B62=\"\",\"\",(VLOOKUP(B62,'Membership #'!$A$1:$C$1005,2,FALSE)))","v":"Ava Anderson"},{"$f":"IF(B62=\"\",\"\",(VLOOKUP(B62,'Membership #'!$A$1:$C$1005,3,FALSE)))","v":"Black Sass"},null,null,30,15,30,50,5,null,130,-130,null,null,0]
[61,967,{"$f":"IF(B63=\"\",\"\",(VLOOKUP(B63,'Membership #'!$A$1:$C$1005,2,FALSE)))","v":"Marissa Hillier"},{"$f":"IF(B63=\"\",\"\",(VLOOKUP(B63,'Membership #'!$A$1:$C$1005,3,FALSE)))","v":"Notice Betty Boop"},null,null,10,15,10,50,5,null,90,-90,null,null,0]
[62,968,{"$f":"IF(B64=\"\",\"\",(VLOOKUP(B64,'Membership #'!$A$1:$C$1005,2,FALSE)))","v":"Madison Pelly"},{"$f":"IF(B64=\"\",\"\",(VLOOKUP(B64,'Membership #'!$A$1:$C$1005,3,FALSE)))","v":"Westin"},null,null,10,15,10,50,5,40,130,-130,null,null,0]
[63,969,{"$f":"IF(B65=\"\",\"\",(VLOOKUP(B65,'Membership #'!$A$1:$C$1005,2,FALSE)))","v":"Kenzie Cook"},{"$f":"IF(B65=\"\",\"\",(VLOOKUP(B65,'Membership #'!$A$1:$C$1005,3,FALSE)))","v":"Pocos Lady Emeralda"},null,null,10,null,10,50,5,null,75,-95,null,null,-20,"you owe her $20"]
[64,971,{"$f":"IF(B66=\"\",\"\",(VLOOKUP(B66,'Membership #'!$A$1:$C$1005,2,FALSE)))","v":"Arielle Burke"},{"$f":"IF(B66=\"\",\"\",(VLOOKUP(B66,'Membership #'!$A$1:$C$1005,3,FALSE)))","v":"Elm Sally"},null,null,60,15,60,50,5,null,190,-190,null,null,0]
[65,973,{"$f":"IF(B67=\"\",\"\",(VLOOKUP(B67,'Membership #'!$A$1:$C$1005,2,FALSE)))","v":"Sara Ivey"},{"$f":"IF(B67=\"\",\"\",(VLOOKUP(B67,'Membership #'!$A$1:$C$1005,3,FALSE)))","v":"Ms Heavenly Gator"},null,null,50,15,70,50,5,null,{"$f":"SUM(G67:L67)","v":190},-190,null,null,{"$f":"SUM(M67:P67)","v":0}]
[66,974,{"$f":"IF(B68=\"\",\"\",(VLOOKUP(B68,'Membership #'!$A$1:$C$1005,2,FALSE)))","v":"Kerissa Martin"},{"$f":"IF(B68=\"\",\"\",(VLOOKUP(B68,'Membership #'!$A$1:$C$1005,3,FALSE)))","v":"Wild Steppin Phoenix"},null,null,null,null,null,50,5,40,95,-95,null,null,0]
[null,null,{"$f":"IF(B69=\"\",\"\",(VLOOKUP(B69,'Membership #'!$A$1:$C$1005,2,FALSE)))","v":""},{"$f":"IF(B69=\"\",\"\",(VLOOKUP(B69,'Membership #'!$A$1:$C$1005,3,FALSE)))","v":""},null,null,{"$f":"SUM(G3:G68)","v":1575},720,1550,3275,330,680,8130,-7190,0,0,940]
[null,null,{"$f":"IF(B70=\"\",\"\",(VLOOKUP(B70,'Membership #'!$A$1:$C$1005,2,FALSE)))","v":""},{"$f":"IF(B70=\"\",\"\",(VLOOKUP(B70,'Membership #'!$A$1:$C$1005,3,FALSE)))","v":""}]
[null,null,{"$f":"IF(B71=\"\",\"\",(VLOOKUP(B71,'Membership #'!$A$1:$C$1005,2,FALSE)))","v":""},{"$f":"IF(B71=\"\",\"\",(VLOOKUP(B71,'Membership #'!$A$1:$C$1005,3,FALSE)))","v":""}]
[null,null,{"$f":"IF(B72=\"\",\"\",(VLOOKUP(B72,'Membership #'!$A$1:$C$1005,2,FALSE)))","v":""},{"$f":"IF(B72=\"\",\"\",(VLOOKUP(B72,'Membership #'!$A$1:$C$1005,3,FALSE)))","v":""}]
[null,null,{"$f":"IF(B73=\"\",\"\",(VLOOKUP(B73,'Membership #'!$A$1:$C$1005,2,FALSE)))","v":""},{"$f":"IF(B73=\"\",\"\",(VLOOKUP(B73,'Membership #'!$A$1:$C$1005,3,FALSE)))","v":""}]
[null,null,{"$f":"IF(B74=\"\",\"\",(VLOOKUP(B74,'Membership #'!$A$1:$C$1005,2,FALSE)))","v":""},{"$f":"IF(B74=\"\",\"\",(VLOOKUP(B74,'Membership #'!$A$1:$C$1005,3,FALSE)))","v":""}]
[null,null,{"$f":"IF(B75=\"\",\"\",(VLOOKUP(B75,'Membership #'!$A$1:$C$1005,2,FALSE)))","v":""},{"$f":"IF(B75=\"\",\"\",(VLOOKUP(B75,'Membership #'!$A$1:$C$1005,3,FALSE)))","v":""}]
[null,null,{"$f":"IF(B76=\"\",\"\",(VLOOKUP(B76,'Membership #'!$A$1:$C$1005,2,FALSE)))","v":""},{"$f":"IF(B76=\"\",\"\",(VLOOKUP(B76,'Membership #'!$A$1:$C$1005,3,FALSE)))","v":""}]
[null,null,{"$f":"IF(B77=\"\",\"\",(VLOOKUP(B77,'Membership #'!$A$1:$C$1005,2,FALSE)))","v":""},{"$f":"IF(B77=\"\",\"\",(VLOOKUP(B77,'Membership #'!$A$1:$C$1005,3,FALSE)))","v":""}]
[null,null,{"$f":"IF(B78=\"\",\"\",(VLOOKUP(B78,'Membership #'!$A$1:$C$1005,2,FALSE)))","v":""},{"$f":"IF(B78=\"\",\"\",(VLOOKUP(B78,'Membership #'!$A$1:$C$1005,3,FALSE)))","v":""}]
[null,null,{"$f":"IF(B79=\"\",\"\",(VLOOKUP(B79,'Membership #'!$A$1:$C$1005,2,FALSE)))","v":""},{"$f":"IF(B79=\"\",\"\",(VLOOKUP(B79,'Membership #'!$A$1:$C$1005,3,FALSE)))","v":""}]
[null,null,{"$f":"IF(B80=\"\",\"\",(VLOOKUP(B80,'Membership #'!$A$1:$C$1005,2,FALSE)))","v":""},{"$f":"IF(B80=\"\",\"\",(VLOOKUP(B80,'Membership #'!$A$1:$C$1005,3,FALSE)))","v":""}]
[null,null,{"$f":"IF(B81=\"\",\"\",(VLOOKUP(B81,'Membership #'!$A$1:$C$1005,2,FALSE)))","v":""},{"$f":"IF(B81=\"\",\"\",(VLOOKUP(B81,'Membership #'!$A$1:$C$1005,3,FALSE)))","v":""}]
[null,null,{"$f":"IF(B82=\"\",\"\",(VLOOKUP(B82,'Membership #'!$A$1:$C$1005,2,FALSE)))","v":""},{"$f":"IF(B82=\"\",\"\",(VLOOKUP(B82,'Membership #'!$A$1:$C$1005,3,FALSE)))","v":""}]
[null,null,{"$f":"IF(B83=\"\",\"\",(VLOOKUP(B83,'Membership #'!$A$1:$C$1005,2,FALSE)))","v":""},{"$f":"IF(B83=\"\",\"\",(VLOOKUP(B83,'Membership #'!$A$1:$C$1005,3,FALSE)))","v":""}]
[null,null,{"$f":"IF(B84=\"\",\"\",(VLOOKUP(B84,'Membership #'!$A$1:$C$1005,2,FALSE)))","v":""},{"$f":"IF(B84=\"\",\"\",(VLOOKUP(B84,'Membership #'!$A$1:$C$1005,3,FALSE)))","v":""}]
[null,null,{"$f":"IF(B85=\"\",\"\",(VLOOKUP(B85,'Membership #'!$A$1:$C$1005,2,FALSE)))","v":""},{"$f":"IF(B85=\"\",\"\",(VLOOKUP(B85,'Membership #'!$A$1:$C$1005,3,FALSE)))","v":""}]
[null,null,{"$f":"IF(B86=\"\",\"\",(VLOOKUP(B86,'Membership #'!$A$1:$C$1005,2,FALSE)))","v":""},{"$f":"IF(B86=\"\",\"\",(VLOOKUP(B86,'Membership #'!$A$1:$C$1005,3,FALSE)))","v":""}]
[null,null,{"$f":"IF(B87=\"\",\"\",(VLOOKUP(B87,'Membership #'!$A$1:$C$1005,2,FALSE)))","v":""},{"$f":"IF(B87=\"\",\"\",(VLOOKUP(B87,'Membership #'!$A$1:$C$1005,3,FALSE)))","v":""}]
[null,null,{"$f":"IF(B88=\"\",\"\",(VLOOKUP(B88,'Membership #'!$A$1:$C$1005,2,FALSE)))","v":""},{"$f":"IF(B88=\"\",\"\",(VLOOKUP(B88,'Membership #'!$A$1:$C$1005,3,FALSE)))","v":""}]
[null,null,{"$f":"IF(B89=\"\",\"\",(VLOOKUP(B89,'Membership #'!$A$1:$C$1005,2,FALSE)))","v":""},{"$f":"IF(B89=\"\",\"\",(VLOOKUP(B89,'Membership #'!$A$1:$C$1005,3,FALSE)))","v":""}]
[null,null,{"$f":"IF(B90=\"\",\"\",(VLOOKUP(B90,'Membership #'!$A$1:$C$1005,2,FALSE)))","v":""},{"$f":"IF(B90=\"\",\"\",(VLOOKUP(B90,'Membership #'!$A$1:$C$1005,3,FALSE)))","v":""}]
[null,null,{"$f":"IF(B91=\"\",\"\",(VLOOKUP(B91,'Membership #'!$A$1:$C$1005,2,FALSE)))","v":""},{"$f":"IF(B91=\"\",\"\",(VLOOKUP(B91,'Membership #'!$A$1:$C$1005,3,FALSE)))","v":""}]
[null,null,{"$f":"IF(B92=\"\",\"\",(VLOOKUP(B92,'Membership #'!$A$1:$C$1005,2,FALSE)))","v":""},{"$f":"IF(B92=\"\",\"\",(VLOOKUP(B92,'Membership #'!$A$1:$C$1005,3,FALSE)))","v":""}]
[null,null,{"$f":"IF(B93=\"\",\"\",(VLOOKUP(B93,'Membership #'!$A$1:$C$1005,2,FALSE)))","v":""},{"$f":"IF(B93=\"\",\"\",(VLOOKUP(B93,'Membership #'!$A$1:$C$1005,3,FALSE)))","v":""}]
[null,null,{"$f":"IF(B94=\"\",\"\",(VLOOKUP(B94,'Membership #'!$A$1:$C$1005,2,FALSE)))","v":""},{"$f":"IF(B94=\"\",\"\",(VLOOKUP(B94,'Membership #'!$A$1:$C$1005,3,FALSE)))","v":""}]
[null,null,{"$f":"IF(B95=\"\",\"\",(VLOOKUP(B95,'Membership #'!$A$1:$C$1005,2,FALSE)))","v":""},{"$f":"IF(B95=\"\",\"\",(VLOOKUP(B95,'Membership #'!$A$1:$C$1005,3,FALSE)))","v":""}]
[null,null,{"$f":"IF(B96=\"\",\"\",(VLOOKUP(B96,'Membership #'!$A$1:$C$1005,2,FALSE)))","v":""},{"$f":"IF(B96=\"\",\"\",(VLOOKUP(B96,'Membership #'!$A$1:$C$1005,3,FALSE)))","v":""}]
[null,null,{"$f":"IF(B97=\"\",\"\",(VLOOKUP(B97,'Membership #'!$A$1:$C$1005,2,FALSE)))","v":""},{"$f":"IF(B97=\"\",\"\",(VLOOKUP(B97,'Membership #'!$A$1:$C$1005,3,FALSE)))","v":""}]
[null,null,{"$f":"IF(B98=\"\",\"\",(VLOOKUP(B98,'Membership #'!$A$1:$C$1005,2,FALSE)))","v":""},{"$f":"IF(B98=\"\",\"\",(VLOOKUP(B98,'Membership #'!$A$1:$C$1005,3,FALSE)))","v":""}]
[null,null,{"$f":"IF(B99=\"\",\"\",(VLOOKUP(B99,'Membership #'!$A$1:$C$1005,2,FALSE)))","v":""},{"$f":"IF(B99=\"\",\"\",(VLOOKUP(B99,'Membership #'!$A$1:$C$1005,3,FALSE)))","v":""}]
[null,null,{"$f":"IF(B100=\"\",\"\",(VLOOKUP(B100,'Membership #'!$A$1:$C$1005,2,FALSE)))","v":""},{"$f":"IF(B100=\"\",\"\",(VLOOKUP(B100,'Membership #'!$A$1:$C$1005,3,FALSE)))","v":""}]
[null,null,{"$f":"IF(B101=\"\",\"\",(VLOOKUP(B101,'Membership #'!$A$1:$C$1005,2,FALSE)))","v":""},{"$f":"IF(B101=\"\",\"\",(VLOOKUP(B101,'Membership #'!$A$1:$C$1005,3,FALSE)))","v":""}]
[null,null,{"$f":"IF(B102=\"\",\"\",(VLOOKUP(B102,'Membership #'!$A$1:$C$1005,2,FALSE)))","v":""},{"$f":"IF(B102=\"\",\"\",(VLOOKUP(B102,'Membership #'!$A$1:$C$1005,3,FALSE)))","v":""}]
[null,null,{"$f":"IF(B103=\"\",\"\",(VLOOKUP(B103,'Membership #'!$A$1:$C$1005,2,FALSE)))","v":""},{"$f":"IF(B103=\"\",\"\",(VLOOKUP(B103,'Membership #'!$A$1:$C$1005,3,FALSE)))","v":""}]
[null,null,{"$f":"IF(B104=\"\",\"\",(VLOOKUP(B104,'Membership #'!$A$1:$C$1005,2,FALSE)))","v":""},{"$f":"IF(B104=\"\",\"\",(VLOOKUP(B104,'Membership #'!$A$1:$C$1005,3,FALSE)))","v":""}]
[null,null,{"$f":"IF(B105=\"\",\"\",(VLOOKUP(B105,'Membership #'!$A$1:$C$1005,2,FALSE)))","v":""},{"$f":"IF(B105=\"\",\"\",(VLOOKUP(B105,'Membership #'!$A$1:$C$1005,3,FALSE)))","v":""}]
[null,null,{"$f":"IF(B106=\"\",\"\",(VLOOKUP(B106,'Membership #'!$A$1:$C$1005,2,FALSE)))","v":""},{"$f":"IF(B106=\"\",\"\",(VLOOKUP(B106,'Membership #'!$A$1:$C$1005,3,FALSE)))","v":""}]
[null,null,{"$f":"IF(B107=\"\",\"\",(VLOOKUP(B107,'Membership #'!$A$1:$C$1005,2,FALSE)))","v":""},{"$f":"IF(B107=\"\",\"\",(VLOOKUP(B107,'Membership #'!$A$1:$C$1005,3,FALSE)))","v":""}]
[null,null,{"$f":"IF(B108=\"\",\"\",(VLOOKUP(B108,'Membership #'!$A$1:$C$1005,2,FALSE)))","v":""},{"$f":"IF(B108=\"\",\"\",(VLOOKUP(B108,'Membership #'!$A$1:$C$1005,3,FALSE)))","v":""}]

{"sheet":"Sheet1","index":3,"n_rows":0,"n_cols":0,"rows_kept":0,"cut":false,"hidden":false,"merged":[]}

{"sheet":"EXHIBITION Barrels","index":4,"n_rows":73,"n_cols":13,"rows_kept":73,"cut":false,"hidden":false,"merged":[[5,12,5,15],[0,0,0,10],[1,0,1,10],[2,0,2,3],[2,6,2,10],[3,0,6,0],[3,1,6,1],[3,2,6,2],[3,3,6,3],[3,4,6,4],[3,9,6,9],[3,10,6,10],[3,5,6,5],[3,6,6,6],[3,7,6,7],[3,8,6,8]]}
[2021,null,null,null,null,null,null,null,null,null,null,null,"x=Scratch"]
["EXHIBITION BARREL RACE",null,null,null,null,null,null,null,null,null,null,null,"n=No Time"]
["# Entries:",null,null,null,{"$f":"COUNTIF($D$8:$D$72,\">0\")","v":0}]
["Rand Draw","Seed",null,"RING #      ","NAME","HORSE NAME","TIME","PENALTY ","TOTAL","PLACINGS","POINTS"]
[]
[]
[]
[{"$f":"IF(D8<>\"\",RAND(),\"\")","v":""},{"$f":"IF(D8<>\"\",RANK(A8,A$8:A$73),\"\")","v":""},null,null,null,null,null,null,{"$f":"SUM(G8+H8)","v":0}]
["","",null,null,null,null,null,null,0]
["","",null,null,null,null,null,null,0]
["","",null,null,null,null,null,null,0]
["","","",null,{"$f":"IF(D12=\"\",\"\",(VLOOKUP(D12,'Membership #'!$A$1:$C$1005,2,0)))","v":""},{"$f":"IF(D12=\"\",\"\",(VLOOKUP(D12,'Membership #'!$A$1:$C$1005,3,0)))","v":""},null,null,0]
["","","",null,{"$f":"IF(D13=\"\",\"\",(VLOOKUP(D13,'Membership #'!$A$1:$C$1005,2,0)))","v":""},{"$f":"IF(D13=\"\",\"\",(VLOOKUP(D13,'Membership #'!$A$1:$C$1005,3,0)))","v":""},null,null,0]
["","","",null,{"$f":"IF(D14=\"\",\"\",(VLOOKUP(D14,'Membership #'!$A$1:$C$1005,2,0)))","v":""},{"$f":"IF(D14=\"\",\"\",(VLOOKUP(D14,'Membership #'!$A$1:$C$1005,3,0)))","v":""},null,null,0]
["","","",null,{"$f":"IF(D15=\"\",\"\",(VLOOKUP(D15,'Membership #'!$A$1:$C$1005,2,0)))","v":""},{"$f":"IF(D15=\"\",\"\",(VLOOKUP(D15,'Membership #'!$A$1:$C$1005,3,0)))","v":""},null,null,0]
["","","",null,{"$f":"IF(D16=\"\",\"\",(VLOOKUP(D16,'Membership #'!$A$1:$C$1005,2,0)))","v":""},{"$f":"IF(D16=\"\",\"\",(VLOOKUP(D16,'Membership #'!$A$1:$C$1005,3,0)))","v":""},null,null,0]
["","","",null,{"$f":"IF(D17=\"\",\"\",(VLOOKUP(D17,'Membership #'!$A$1:$C$1005,2,0)))","v":""},{"$f":"IF(D17=\"\",\"\",(VLOOKUP(D17,'Membership #'!$A$1:$C$1005,3,0)))","v":""},null,null,0]
["","","",null,{"$f":"IF(D18=\"\",\"\",(VLOOKUP(D18,'Membership #'!$A$1:$C$1005,2,0)))","v":""},{"$f":"IF(D18=\"\",\"\",(VLOOKUP(D18,'Membership #'!$A$1:$C$1005,3,0)))","v":""},null,null,0]
["","","",null,{"$f":"IF(D19=\"\",\"\",(VLOOKUP(D19,'Membership #'!$A$1:$C$1005,2,0)))","v":""},{"$f":"IF(D19=\"\",\"\",(VLOOKUP(D19,'Membership #'!$A$1:$C$1005,3,0)))","v":""},null,null,0]
["","","",null,{"$f":"IF(D20=\"\",\"\",(VLOOKUP(D20,'Membership #'!$A$1:$C$1005,2,0)))","v":""},{"$f":"IF(D20=\"\",\"\",(VLOOKUP(D20,'Membership #'!$A$1:$C$1005,3,0)))","v":""},null,null,0]
["","","",null,{"$f":"IF(D21=\"\",\"\",(VLOOKUP(D21,'Membership #'!$A$1:$C$1005,2,0)))","v":""},{"$f":"IF(D21=\"\",\"\",(VLOOKUP(D21,'Membership #'!$A$1:$C$1005,3,0)))","v":""},null,null,0]
["","","",null,{"$f":"IF(D22=\"\",\"\",(VLOOKUP(D22,'Membership #'!$A$1:$C$1005,2,0)))","v":""},{"$f":"IF(D22=\"\",\"\",(VLOOKUP(D22,'Membership #'!$A$1:$C$1005,3,0)))","v":""},null,null,0]
["","","",null,{"$f":"IF(D23=\"\",\"\",(VLOOKUP(D23,'Membership #'!$A$1:$C$1005,2,0)))","v":""},{"$f":"IF(D23=\"\",\"\",(VLOOKUP(D23,'Membership #'!$A$1:$C$1005,3,0)))","v":""},null,null,0]
["","","",null,{"$f":"IF(D24=\"\",\"\",(VLOOKUP(D24,'Membership #'!$A$1:$C$1005,2,0)))","v":""},{"$f":"IF(D24=\"\",\"\",(VLOOKUP(D24,'Membership #'!$A$1:$C$1005,3,0)))","v":""},null,null,0]
["","","",null,{"$f":"IF(D25=\"\",\"\",(VLOOKUP(D25,'Membership #'!$A$1:$C$1005,2,0)))","v":""},{"$f":"IF(D25=\"\",\"\",(VLOOKUP(D25,'Membership #'!$A$1:$C$1005,3,0)))","v":""},null,null,0]
["","","",null,{"$f":"IF(D26=\"\",\"\",(VLOOKUP(D26,'Membership #'!$A$1:$C$1005,2,0)))","v":""},{"$f":"IF(D26=\"\",\"\",(VLOOKUP(D26,'Membership #'!$A$1:$C$1005,3,0)))","v":""},null,null,0]
["","","",null,{"$f":"IF(D27=\"\",\"\",(VLOOKUP(D27,'Membership #'!$A$1:$C$1005,2,0)))","v":""},{"$f":"IF(D27=\"\",\"\",(VLOOKUP(D27,'Membership #'!$A$1:$C$1005,3,0)))","v":""},null,null,0]
["","","",null,{"$f":"IF(D28=\"\",\"\",(VLOOKUP(D28,'Membership #'!$A$1:$C$1005,2,0)))","v":""},{"$f":"IF(D28=\"\",\"\",(VLOOKUP(D28,'Membership #'!$A$1:$C$1005,3,0)))","v":""},null,null,0]
["","","",null,{"$f":"IF(D29=\"\",\"\",(VLOOKUP(D29,'Membership #'!$A$1:$C$1005,2,0)))","v":""},{"$f":"IF(D29=\"\",\"\",(VLOOKUP(D29,'Membership #'!$A$1:$C$1005,3,0)))","v":""},null,null,0]
["","","",null,{"$f":"IF(D30=\"\",\"\",(VLOOKUP(D30,'Membership #'!$A$1:$C$1005,2,0)))","v":""},{"$f":"IF(D30=\"\",\"\",(VLOOKUP(D30,'Membership #'!$A$1:$C$1005,3,0)))","v":""},null,null,0]
["","","",null,{"$f":"IF(D31=\"\",\"\",(VLOOKUP(D31,'Membership #'!$A$1:$C$1005,2,0)))","v":""},{"$f":"IF(D31=\"\",\"\",(VLOOKUP(D31,'Membership #'!$A$1:$C$1005,3,0)))","v":""},null,null,0]
["","","",null,{"$f":"IF(D32=\"\",\"\",(VLOOKUP(D32,'Membership #'!$A$1:$C$1005,2,0)))","v":""},{"$f":"IF(D32=\"\",\"\",(VLOOKUP(D32,'Membership #'!$A$1:$C$1005,3,0)))","v":""},null,null,0]
["","","",null,{"$f":"IF(D33=\"\",\"\",(VLOOKUP(D33,'Membership #'!$A$1:$C$1005,2,0)))","v":""},{"$f":"IF(D33=\"\",\"\",(VLOOKUP(D33,'Membership #'!$A$1:$C$1005,3,0)))","v":""},null,null,0]
["","","",null,{"$f":"IF(D34=\"\",\"\",(VLOOKUP(D34,'Membership #'!$A$1:$C$1005,2,0)))","v":""},{"$f":"IF(D34=\"\",\"\",(VLOOKUP(D34,'Membership #'!$A$1:$C$1005,3,0)))","v":""},null,null,0]
["","","",null,{"$f":"IF(D35=\"\",\"\",(VLOOKUP(D35,'Membership #'!$A$1:$C$1005,2,0)))","v":""},{"$f":"IF(D35=\"\",\"\",(VLOOKUP(D35,'Membership #'!$A$1:$C$1005,3,0)))","v":""},null,null,{"$f":"IF(G35=\"n\",\"No Time\",IF(G35=\"x\",\"Scratch\",IF(G35<>\"\",SUM(G35+H35),\"\")))","v":""}]
["","","",null,{"$f":"IF(D36=\"\",\"\",(VLOOKUP(D36,'Membership #'!$A$1:$C$1005,2,0)))","v":""},{"$f":"IF(D36=\"\",\"\",(VLOOKUP(D36,'Membership #'!$A$1:$C$1005,3,0)))","v":""},null,null,""]
["","","",null,{"$f":"IF(D37=\"\",\"\",(VLOOKUP(D37,'Membership #'!$A$1:$C$1005,2,0)))","v":""},{"$f":"IF(D37=\"\",\"\",(VLOOKUP(D37,'Membership #'!$A$1:$C$1005,3,0)))","v":""},null,null,""]
["","","",null,{"$f":"IF(D38=\"\",\"\",(VLOOKUP(D38,'Membership #'!$A$1:$C$1005,2,0)))","v":""},{"$f":"IF(D38=\"\",\"\",(VLOOKUP(D38,'Membership #'!$A$1:$C$1005,3,0)))","v":""},null,null,""]
["","","",null,{"$f":"IF(D39=\"\",\"\",(VLOOKUP(D39,'Membership #'!$A$1:$C$1005,2,0)))","v":""},{"$f":"IF(D39=\"\",\"\",(VLOOKUP(D39,'Membership #'!$A$1:$C$1005,3,0)))","v":""},null,null,""]
["",{"$f":"IF(D40<>\"\",RANK(A40,A$8:A$73),\"\")","v":""},"",null,{"$f":"IF(D40=\"\",\"\",(VLOOKUP(D40,'Membership #'!$A$1:$C$1005,2,0)))","v":""},{"$f":"IF(D40=\"\",\"\",(VLOOKUP(D40,'Membership #'!$A$1:$C$1005,3,0)))","v":""},null,null,""]
["","","",null,{"$f":"IF(D41=\"\",\"\",(VLOOKUP(D41,'Membership #'!$A$1:$C$1005,2,0)))","v":""},{"$f":"IF(D41=\"\",\"\",(VLOOKUP(D41,'Membership #'!$A$1:$C$1005,3,0)))","v":""},null,null,""]
["","","",null,{"$f":"IF(D42=\"\",\"\",(VLOOKUP(D42,'Membership #'!$A$1:$C$1005,2,0)))","v":""},{"$f":"IF(D42=\"\",\"\",(VLOOKUP(D42,'Membership #'!$A$1:$C$1005,3,0)))","v":""},null,null,""]
["","","",null,{"$f":"IF(D43=\"\",\"\",(VLOOKUP(D43,'Membership #'!$A$1:$C$1005,2,0)))","v":""},{"$f":"IF(D43=\"\",\"\",(VLOOKUP(D43,'Membership #'!$A$1:$C$1005,3,0)))","v":""},null,null,""]
[{"$f":"IF(D44<>\"\",RAND(),\"\")","v":""},"","",null,{"$f":"IF(D44=\"\",\"\",(VLOOKUP(D44,'Membership #'!$A$1:$C$1005,2,0)))","v":""},{"$f":"IF(D44=\"\",\"\",(VLOOKUP(D44,'Membership #'!$A$1:$C$1005,3,0)))","v":""},null,null,""]
["","","",null,{"$f":"IF(D45=\"\",\"\",(VLOOKUP(D45,'Membership #'!$A$1:$C$1005,2,0)))","v":""},{"$f":"IF(D45=\"\",\"\",(VLOOKUP(D45,'Membership #'!$A$1:$C$1005,3,0)))","v":""},null,null,{"$f":"IF(G45=\"n\",\"No Time\",IF(G45=\"x\",\"Scratch\",IF(G45<>\"\",SUM(G45+H45),\"\")))","v":""}]
["","","",null,{"$f":"IF(D46=\"\",\"\",(VLOOKUP(D46,'Membership #'!$A$1:$C$1005,2,0)))","v":""},{"$f":"IF(D46=\"\",\"\",(VLOOKUP(D46,'Membership #'!$A$1:$C$1005,3,0)))","v":""},null,null,""]
["","","",null,{"$f":"IF(D47=\"\",\"\",(VLOOKUP(D47,'Membership #'!$A$1:$C$1005,2,0)))","v":""},{"$f":"IF(D47=\"\",\"\",(VLOOKUP(D47,'Membership #'!$A$1:$C$1005,3,0)))","v":""},null,null,""]
["","","",null,{"$f":"IF(D48=\"\",\"\",(VLOOKUP(D48,'Membership #'!$A$1:$C$1005,2,0)))","v":""},{"$f":"IF(D48=\"\",\"\",(VLOOKUP(D48,'Membership #'!$A$1:$C$1005,3,0)))","v":""},null,null,""]
["","","",null,{"$f":"IF(D49=\"\",\"\",(VLOOKUP(D49,'Membership #'!$A$1:$C$1005,2,0)))","v":""},{"$f":"IF(D49=\"\",\"\",(VLOOKUP(D49,'Membership #'!$A$1:$C$1005,3,0)))","v":""},null,null,""]
["","","",null,{"$f":"IF(D50=\"\",\"\",(VLOOKUP(D50,'Membership #'!$A$1:$C$1005,2,0)))","v":""},{"$f":"IF(D50=\"\",\"\",(VLOOKUP(D50,'Membership #'!$A$1:$C$1005,3,0)))","v":""},null,null,""]
["","","",null,{"$f":"IF(D51=\"\",\"\",(VLOOKUP(D51,'Membership #'!$A$1:$C$1005,2,0)))","v":""},{"$f":"IF(D51=\"\",\"\",(VLOOKUP(D51,'Membership #'!$A$1:$C$1005,3,0)))","v":""},null,null,""]
["","","",null,{"$f":"IF(D52=\"\",\"\",(VLOOKUP(D52,'Membership #'!$A$1:$C$1005,2,0)))","v":""},{"$f":"IF(D52=\"\",\"\",(VLOOKUP(D52,'Membership #'!$A$1:$C$1005,3,0)))","v":""},null,null,""]
["","","",null,{"$f":"IF(D53=\"\",\"\",(VLOOKUP(D53,'Membership #'!$A$1:$C$1005,2,0)))","v":""},{"$f":"IF(D53=\"\",\"\",(VLOOKUP(D53,'Membership #'!$A$1:$C$1005,3,0)))","v":""},null,null,""]
["","","",null,{"$f":"IF(D54=\"\",\"\",(VLOOKUP(D54,'Membership #'!$A$1:$C$1005,2,0)))","v":""},{"$f":"IF(D54=\"\",\"\",(VLOOKUP(D54,'Membership #'!$A$1:$C$1005,3,0)))","v":""},null,null,""]
["","","",null,{"$f":"IF(D55=\"\",\"\",(VLOOKUP(D55,'Membership #'!$A$1:$C$1005,2,0)))","v":""},{"$f":"IF(D55=\"\",\"\",(VLOOKUP(D55,'Membership #'!$A$1:$C$1005,3,0)))","v":""},null,null,""]
["","","",null,{"$f":"IF(D56=\"\",\"\",(VLOOKUP(D56,'Membership #'!$A$1:$C$1005,2,0)))","v":""},{"$f":"IF(D56=\"\",\"\",(VLOOKUP(D56,'Membership #'!$A$1:$C$1005,3,0)))","v":""},null,null,""]
["","","",null,{"$f":"IF(D57=\"\",\"\",(VLOOKUP(D57,'Membership #'!$A$1:$C$1005,2,0)))","v":""},{"$f":"IF(D57=\"\",\"\",(VLOOKUP(D57,'Membership #'!$A$1:$C$1005,3,0)))","v":""},null,null,""]
["","","",null,{"$f":"IF(D58=\"\",\"\",(VLOOKUP(D58,'Membership #'!$A$1:$C$1005,2,0)))","v":""},{"$f":"IF(D58=\"\",\"\",(VLOOKUP(D58,'Membership #'!$A$1:$C$1005,3,0)))","v":""},null,null,""]
["","","",null,{"$f":"IF(D59=\"\",\"\",(VLOOKUP(D59,'Membership #'!$A$1:$C$1005,2,0)))","v":""},{"$f":"IF(D59=\"\",\"\",(VLOOKUP(D59,'Membership #'!$A$1:$C$1005,3,0)))","v":""},null,null,""]
["","","",null,{"$f":"IF(D60=\"\",\"\",(VLOOKUP(D60,'Membership #'!$A$1:$C$1005,2,0)))","v":""},{"$f":"IF(D60=\"\",\"\",(VLOOKUP(D60,'Membership #'!$A$1:$C$1005,3,0)))","v":""},null,null,""]
["","","",null,{"$f":"IF(D61=\"\",\"\",(VLOOKUP(D61,'Membership #'!$A$1:$C$1005,2,0)))","v":""},{"$f":"IF(D61=\"\",\"\",(VLOOKUP(D61,'Membership #'!$A$1:$C$1005,3,0)))","v":""},null,null,""]
["","","",null,{"$f":"IF(D62=\"\",\"\",(VLOOKUP(D62,'Membership #'!$A$1:$C$1005,2,0)))","v":""},{"$f":"IF(D62=\"\",\"\",(VLOOKUP(D62,'Membership #'!$A$1:$C$1005,3,0)))","v":""},null,null,""]
["","","",null,{"$f":"IF(D63=\"\",\"\",(VLOOKUP(D63,'Membership #'!$A$1:$C$1005,2,0)))","v":""},{"$f":"IF(D63=\"\",\"\",(VLOOKUP(D63,'Membership #'!$A$1:$C$1005,3,0)))","v":""},null,null,""]
["","","",null,{"$f":"IF(D64=\"\",\"\",(VLOOKUP(D64,'Membership #'!$A$1:$C$1005,2,0)))","v":""},{"$f":"IF(D64=\"\",\"\",(VLOOKUP(D64,'Membership #'!$A$1:$C$1005,3,0)))","v":""},null,null,""]
["","","",null,{"$f":"IF(D65=\"\",\"\",(VLOOKUP(D65,'Membership #'!$A$1:$C$1005,2,0)))","v":""},{"$f":"IF(D65=\"\",\"\",(VLOOKUP(D65,'Membership #'!$A$1:$C$1005,3,0)))","v":""},null,null,""]
["","","",null,{"$f":"IF(D66=\"\",\"\",(VLOOKUP(D66,'Membership #'!$A$1:$C$1005,2,0)))","v":""},{"$f":"IF(D66=\"\",\"\",(VLOOKUP(D66,'Membership #'!$A$1:$C$1005,3,0)))","v":""},null,null,""]
["","","",null,{"$f":"IF(D67=\"\",\"\",(VLOOKUP(D67,'Membership #'!$A$1:$C$1005,2,0)))","v":""},{"$f":"IF(D67=\"\",\"\",(VLOOKUP(D67,'Membership #'!$A$1:$C$1005,3,0)))","v":""},null,null,""]
["","","",null,{"$f":"IF(D68=\"\",\"\",(VLOOKUP(D68,'Membership #'!$A$1:$C$1005,2,0)))","v":""},{"$f":"IF(D68=\"\",\"\",(VLOOKUP(D68,'Membership #'!$A$1:$C$1005,3,0)))","v":""},null,null,""]
["","","",null,{"$f":"IF(D69=\"\",\"\",(VLOOKUP(D69,'Membership #'!$A$1:$C$1005,2,0)))","v":""},{"$f":"IF(D69=\"\",\"\",(VLOOKUP(D69,'Membership #'!$A$1:$C$1005,3,0)))","v":""},null,null,""]
["","","",null,{"$f":"IF(D70=\"\",\"\",(VLOOKUP(D70,'Membership #'!$A$1:$C$1005,2,0)))","v":""},{"$f":"IF(D70=\"\",\"\",(VLOOKUP(D70,'Membership #'!$A$1:$C$1005,3,0)))","v":""},null,null,""]
["","","",null,{"$f":"IF(D71=\"\",\"\",(VLOOKUP(D71,'Membership #'!$A$1:$C$1005,2,0)))","v":""},{"$f":"IF(D71=\"\",\"\",(VLOOKUP(D71,'Membership #'!$A$1:$C$1005,3,0)))","v":""},null,null,""]
["",{"$f":"IF(D72<>\"\",RANK(A72,A$8:A$73),\"\")","v":""},"",null,{"$f":"IF(D72=\"\",\"\",(VLOOKUP(D72,'Membership #'!$A$1:$C$1005,2,0)))","v":""},{"$f":"IF(D72=\"\",\"\",(VLOOKUP(D72,'Membership #'!$A$1:$C$1005,3,0)))","v":""},null,null,""]
["",{"$f":"IF(D73<>\"\",RANK(A73,A$8:A$73),\"\")","v":""},"",null,{"$f":"IF(D73=\"\",\"\",(VLOOKUP(D73,'Membership #'!$A$1:$C$1005,2,0)))","v":""},{"$f":"IF(D73=\"\",\"\",(VLOOKUP(D73,'Membership #'!$A$1:$C$1005,3,0)))","v":""},null,null,""]

{"sheet":"SMALLFRY","index":5,"n_rows":51,"n_cols":21,"rows_kept":51,"cut":false,"hidden":false,"merged":[[0,1,0,9],[1,1,1,9],[2,1,5,1],[19,1,19,9],[2,6,5,6],[2,9,5,9],[36,1,36,9],[37,6,40,6],[2,0,5,0],[1,17,4,17],[1,18,4,18],[2,3,5,3],[2,4,5,4],[2,5,5,5],[2,7,5,7],[2,8,5,8],[2,2,5,2],[21,6,24,6],[21,7,24,7],[21,8,24,8],[21,9,24,9],[20,1,20,9],[1,20,4,20],[1,11,4,11],[1,12,4,12],[1,13,4,13],[1,14,4,14],[1,15,4,15],[1,16,4,16],[1,19,4,19],[37,1,40,1],[37,7,40,7],[21,0,24,0],[21,2,24,2],[21,3,24,3],[21,4,24,4],[35,1,35,9],[21,1,24,1],[37,8,40,8],[37,9,40,9],[21,5,24,5],[37,0,40,0],[37,2,40,2],[37,3,40,3],[37,4,40,4],[37,5,40,5]]}
[null,"Tom Burt & Mark McGuire Memorial Jackpot Aug 21, 2021",null,null,null,null,null,null,null,null,null,"High Point Smallfry"]
[null,"SMALLFRY  BARRELS",null,null,null,null,null,null,null,null,null,"RING #      ","NAME","HORSE NAME","Barrels","Poles","Dash","Barrels","Poles","Dash","Total"]
["Rand Draw","Running Order","RING #      ","NAME","HORSE NAME","TIME","PENALTY ","TOTAL","PLACINGS","POINTS"]
[]
[]
[null,null,null,null,null,null,null,null,null,null,null,null,"Joise higgins ","rocket man",10,10,10,null,null,null,{"$f":"SUM(O6:T6)","v":30}]
[{"$f":"RAND()","v":0.56476920738295366},1,908,{"$f":"IF(C7=\"\",0,(VLOOKUP(C7,'Membership #'!$A$1:$C$1005,2,0)))","v":"Josie Higgins"},{"$f":"IF(C7=\"\",0,(VLOOKUP(C7,'Membership #'!$A$1:$C$1005,3,0)))","v":"Rocket Man"},19.448,null,{"$f":"SUM(F7+G7)","v":19.448},10,null,null,null,"Addison peters","Hes a little wonder ",9,1,9,null,null,null,19]
[0.21367525463063575,2,531,{"$f":"IF(C8=\"\",0,(VLOOKUP(C8,'Membership #'!$A$1:$C$1005,2,0)))","v":"Addison Peters"},{"$f":"IF(C8=\"\",0,(VLOOKUP(C8,'Membership #'!$A$1:$C$1005,3,0)))","v":"He's A Little Wonder"},20.800999999999998,null,20.800999999999998,9,null,null,null,"Kerissa Martin","wild stepping phoenix",8,9,8,null,null,null,25]
[0.37406553995455516,3,974,{"$f":"IF(C9=\"\",0,(VLOOKUP(C9,'Membership #'!$A$1:$C$1005,2,0)))","v":"Kerissa Martin"},{"$f":"IF(C9=\"\",0,(VLOOKUP(C9,'Membership #'!$A$1:$C$1005,3,0)))","v":"Wild Steppin Phoenix"},21.289000000000001,null,21.289000000000001,8,null,null,null,"Kaelyn Keddy","sight to ne hold ",7,7,7,null,null,null,21]
[0.22581598311706175,4,627,{"$f":"IF(C10=\"\",0,(VLOOKUP(C10,'Membership #'!$A$1:$C$1005,2,0)))","v":"Kaelyn Keddy"},{"$f":"IF(C10=\"\",0,(VLOOKUP(C10,'Membership #'!$A$1:$C$1005,3,0)))","v":"Sight to Behold"},22.303000000000001,null,22.303000000000001,7,null,null,null,"Leighton Burke","Boot scootin boogie ",6,8,4,null,null,null,18]
[0.49714688677057273,5,963,{"$f":"IF(C11=\"\",0,(VLOOKUP(C11,'Membership #'!$A$1:$C$1005,2,0)))","v":"Leighton Burke"},{"$f":"IF(C11=\"\",0,(VLOOKUP(C11,'Membership #'!$A$1:$C$1005,3,0)))","v":"Boot Scootin Boogie"},24.114000000000001,null,24.114000000000001,6,null,null,null,"Ava Reginato","jacs last flash ",5,6,5,null,null,null,16]
[0.9388879906489368,6,802,{"$f":"IF(C12=\"\",0,(VLOOKUP(C12,'Membership #'!$A$1:$C$1005,2,0)))","v":"Ava Reginato"},{"$f":"IF(C12=\"\",0,(VLOOKUP(C12,'Membership #'!$A$1:$C$1005,3,0)))","v":"Jacs Last Flash"},24.669,null,24.669,5,null,null,null,"Owen Baker","tip it back",4,4,3,null,null,null,11]
[{"$f":"RAND()","v":0.34152841365180875},7,710,{"$f":"IF(C13=\"\",0,(VLOOKUP(C13,'Membership #'!$A$1:$C$1005,2,0)))","v":"Owen Baker"},{"$f":"IF(C13=\"\",0,(VLOOKUP(C13,'Membership #'!$A$1:$C$1005,3,0)))","v":"Tip It Back"},31.349,null,31.349,4,null,null,null,"Nora Lewis ","oreo blizzard",3,3,2,null,null,null,8]
[0.51465137032169661,8,31,"Nora Lewis ","Oreo Blizzard",38.780999999999999,null,38.780999999999999,3,null,null,null,"Isla Baker ","tip it back ",2,2,1,null,null,null,5]
[0.77800977584424347,9,"710b",{"$f":"IF(C15=\"\",0,(VLOOKUP(C15,'Membership #'!$A$1:$C$1005,2,0)))","v":"Isla Baker"},{"$f":"IF(C15=\"\",0,(VLOOKUP(C15,'Membership #'!$A$1:$C$1005,3,0)))","v":"Tip It Back"},42.241999999999997,null,42.241999999999997,2,null,null,null,"Hariin Burke ","old bold impulse",1,5,6,null,null,null,12]
[0.44265621178438597,10,962,{"$f":"IF(C16=\"\",0,(VLOOKUP(C16,'Membership #'!$A$1:$C$1005,2,0)))","v":"Hariin Burke"},{"$f":"IF(C16=\"\",0,(VLOOKUP(C16,'Membership #'!$A$1:$C$1005,3,0)))","v":"Olds Bold Impulse"},"N",null,{"$error":"#VALUE!"},1]
[0.18928445782268744,11,null,{"$f":"IF(C17=\"\",0,(VLOOKUP(C17,'Membership #'!$A$1:$C$1005,2,0)))","v":0},{"$f":"IF(C17=\"\",0,(VLOOKUP(C17,'Membership #'!$A$1:$C$1005,3,0)))","v":0},null,null,{"$f":"SUM(F17+G17)","v":0}]
[0.80204031587553415,12,null,{"$f":"IF(C18=\"\",0,(VLOOKUP(C18,'Membership #'!$A$1:$C$1005,2,0)))","v":0},{"$f":"IF(C18=\"\",0,(VLOOKUP(C18,'Membership #'!$A$1:$C$1005,3,0)))","v":0},null,null,0,null,null,null,null,{"$f":"IF(L18=\"\",0,(VLOOKUP(L18,'Membership #'!$A$1:$C$1005,2,0)))","v":0},{"$f":"IF(L18=\"\",0,(VLOOKUP(L18,'Membership #'!$A$1:$C$1005,3,0)))","v":0},null,null,null,null,null,null,{"$f":"SUM(O18:T18)","v":0}]
[0.63730229250942194,13,null,{"$f":"IF(C19=\"\",0,(VLOOKUP(C19,'Membership #'!$A$1:$C$1005,2,0)))","v":0},{"$f":"IF(C19=\"\",0,(VLOOKUP(C19,'Membership #'!$A$1:$C$1005,3,0)))","v":0},null,null,0,null,null,null,null,null,null,null,null,null,null,null,null,0]
[null,"Tom Burt & Mark McGuire Memorial Jackpot Aug 21, 2021",null,null,null,null,null,null,null,null,null,null,{"$f":"IF(L20=\"\",0,(VLOOKUP(L20,'Membership #'!$A$1:$C$1005,2,0)))","v":0},{"$f":"IF(L20=\"\",0,(VLOOKUP(L20,'Membership #'!$A$1:$C$1005,3,0)))","v":0},null,null,null,null,null,null,0]
[null,"SMALLFRY  POLES",null,null,null,null,null,null,null,null,null,null,null,null,null,null,null,null,null,null,0]
["Rand Draw","Running Order","RING #      ","NAME","HORSE NAME","TIME","PENALTY ","  ","PLACINGS","POINTS",null,null,{"$f":"IF(L22=\"\",0,(VLOOKUP(L22,'Membership #'!$A$1:$C$1005,2,0)))","v":0},{"$f":"IF(L22=\"\",0,(VLOOKUP(L22,'Membership #'!$A$1:$C$1005,3,0)))","v":0},null,null,null,null,null,null,0]
[null,null,null,null,null,null,null,null,null,null,null,null,{"$f":"IF(L23=\"\",0,(VLOOKUP(L23,'Membership #'!$A$1:$C$1005,2,0)))","v":0},{"$f":"IF(L23=\"\",0,(VLOOKUP(L23,'Membership #'!$A$1:$C$1005,3,0)))","v":0},null,null,null,null,null,null,0]
[]
[]
[{"$f":"RAND()","v":9.2172533393554135E-3},1,531,{"$f":"IF(C26=\"\",0,(VLOOKUP(C26,'Membership #'!$A$1:$C$1005,2,0)))","v":"Addison Peters"},{"$f":"IF(C26=\"\",0,(VLOOKUP(C26,'Membership #'!$A$1:$C$1005,3,0)))","v":"He's A Little Wonder"},0,null,0,null,1]
[2.657313769130798E-2,2,908,{"$f":"IF(C27=\"\",0,(VLOOKUP(C27,'Membership #'!$A$1:$C$1005,2,0)))","v":"Josie Higgins"},{"$f":"IF(C27=\"\",0,(VLOOKUP(C27,'Membership #'!$A$1:$C$1005,3,0)))","v":"Rocket Man"},30.405000000000001,null,{"$f":"SUM(F27+G27)","v":30.405000000000001},1,10]
[0.18766123409222901,3,974,{"$f":"IF(C28=\"\",0,(VLOOKUP(C28,'Membership #'!$A$1:$C$1005,2,0)))","v":"Kerissa Martin"},{"$f":"IF(C28=\"\",0,(VLOOKUP(C28,'Membership #'!$A$1:$C$1005,3,0)))","v":"Wild Steppin Phoenix"},32.293999999999997,null,{"$f":"SUM(F28+G28)","v":32.293999999999997},2,9]
[0.26871938412775576,4,963,{"$f":"IF(C29=\"\",0,(VLOOKUP(C29,'Membership #'!$A$1:$C$1005,2,0)))","v":"Leighton Burke"},{"$f":"IF(C29=\"\",0,(VLOOKUP(C29,'Membership #'!$A$1:$C$1005,3,0)))","v":"Boot Scootin Boogie"},37.241999999999997,null,{"$f":"SUM(F29+G29)","v":37.241999999999997},3,8]
[0.83506463218446347,5,627,{"$f":"IF(C30=\"\",0,(VLOOKUP(C30,'Membership #'!$A$1:$C$1005,2,0)))","v":"Kaelyn Keddy"},{"$f":"IF(C30=\"\",0,(VLOOKUP(C30,'Membership #'!$A$1:$C$1005,3,0)))","v":"Sight to Behold"},37.286000000000001,null,{"$f":"SUM(F30+G30)","v":37.286000000000001},4,7]
[0.83065864616580043,6,802,{"$f":"IF(C31=\"\",0,(VLOOKUP(C31,'Membership #'!$A$1:$C$1005,2,0)))","v":"Ava Reginato"},{"$f":"IF(C31=\"\",0,(VLOOKUP(C31,'Membership #'!$A$1:$C$1005,3,0)))","v":"Jacs Last Flash"},41.124000000000002,null,{"$f":"SUM(F31+G31)","v":41.124000000000002},5,6]
[{"$f":"RAND()","v":0.879015848250565},7,962,{"$f":"IF(C32=\"\",0,(VLOOKUP(C32,'Membership #'!$A$1:$C$1005,2,0)))","v":"Hariin Burke"},{"$f":"IF(C32=\"\",0,(VLOOKUP(C32,'Membership #'!$A$1:$C$1005,3,0)))","v":"Olds Bold Impulse"},42.11,null,42.1,6,5]
[0.99578010539936967,8,710,{"$f":"IF(C33=\"\",0,(VLOOKUP(C33,'Membership #'!$A$1:$C$1005,2,0)))","v":"Owen Baker"},{"$f":"IF(C33=\"\",0,(VLOOKUP(C33,'Membership #'!$A$1:$C$1005,3,0)))","v":"Tip It Back"},50.158999999999999,null,{"$f":"SUM(F33+G33)","v":50.158999999999999},null,4]
[0.2,9,962,"Nora Lewis ","Oreo Blizzard",55.29,null,{"$f":"SUM(F34+G34)","v":55.29},null,3]
[0.82314293706745789,10,"710b",{"$f":"IF(C35=\"\",0,(VLOOKUP(C35,'Membership #'!$A$1:$C$1005,2,0)))","v":"Isla Baker"},{"$f":"IF(C35=\"\",0,(VLOOKUP(C35,'Membership #'!$A$1:$C$1005,3,0)))","v":"Tip It Back"},62.31,null,{"$f":"SUM(F35+G35)","v":62.31},null,2]
[null,"Tom Burt & Mark McGuire Memorial Jackpot Aug 21, 2021"]
[null,"SMALLFRY  Dash"]
["Rand Draw","Running Order","RING #      ","NAME","HORSE NAME","TIME","PENALTY ","TOTAL","PLACINGS","POINTS"]
[]
[]
[]
[{"$f":"RAND()","v":0.66561896765452278},1,908,{"$f":"IF(C42=\"\",0,(VLOOKUP(C42,'Membership #'!$A$1:$C$1005,2,0)))","v":"Josie Higgins"},{"$f":"IF(C42=\"\",0,(VLOOKUP(C42,'Membership #'!$A$1:$C$1005,3,0)))","v":"Rocket Man"},9.6980000000000004,null,{"$f":"SUM(F42+G42)","v":9.6980000000000004},1,10]
[{"$f":"RAND()","v":0.76469162677072977},2,531,"Addison Peters","He's A Little Wonder",10.724,null,10.724,2,9]
[0.80053839961464979,3,974,{"$f":"IF(C44=\"\",0,(VLOOKUP(C44,'Membership #'!$A$1:$C$1005,2,0)))","v":"Kerissa Martin"},{"$f":"IF(C44=\"\",0,(VLOOKUP(C44,'Membership #'!$A$1:$C$1005,3,0)))","v":"Wild Steppin Phoenix"},11.129,null,{"$f":"SUM(F44+G44)","v":11.129},3,8]
[0.72010623326937628,4,627,{"$f":"IF(C45=\"\",0,(VLOOKUP(C45,'Membership #'!$A$1:$C$1005,2,0)))","v":"Kaelyn Keddy"},{"$f":"IF(C45=\"\",0,(VLOOKUP(C45,'Membership #'!$A$1:$C$1005,3,0)))","v":"Sight to Behold"},11.24,null,11.24,4,7]
[0.98053721723625886,5,962,{"$f":"IF(C46=\"\",0,(VLOOKUP(C46,'Membership #'!$A$1:$C$1005,2,0)))","v":"Hariin Burke"},{"$f":"IF(C46=\"\",0,(VLOOKUP(C46,'Membership #'!$A$1:$C$1005,3,0)))","v":"Olds Bold Impulse"},13.468999999999999,null,13.468999999999999,5,6]
[8.5406804720609797E-2,6,802,{"$f":"IF(C47=\"\",0,(VLOOKUP(C47,'Membership #'!$A$1:$C$1005,2,0)))","v":"Ava Reginato"},{"$f":"IF(C47=\"\",0,(VLOOKUP(C47,'Membership #'!$A$1:$C$1005,3,0)))","v":"Jacs Last Flash"},15.159000000000001,null,15.159000000000001,6,5]
[0.2272333653804417,7,963,{"$f":"IF(C48=\"\",0,(VLOOKUP(C48,'Membership #'!$A$1:$C$1005,2,0)))","v":"Leighton Burke"},{"$f":"IF(C48=\"\",0,(VLOOKUP(C48,'Membership #'!$A$1:$C$1005,3,0)))","v":"Boot Scootin Boogie"},15.282999999999999,null,15.282999999999999,7,4]
[0.57236336890875872,8,710,{"$f":"IF(C49=\"\",0,(VLOOKUP(C49,'Membership #'!$A$1:$C$1005,2,0)))","v":"Owen Baker"},{"$f":"IF(C49=\"\",0,(VLOOKUP(C49,'Membership #'!$A$1:$C$1005,3,0)))","v":"Tip It Back"},17.657,null,17.657,8,3]
[0.64733989389497848,9,31,"Nora Lewis ","Oreo Blizzard",21.297000000000001,null,21.297000000000001,9,2]
[0.81899330340890863,10,"710b",{"$f":"IF(C51=\"\",0,(VLOOKUP(C51,'Membership #'!$A$1:$C$1005,2,0)))","v":"Isla Baker"},{"$f":"IF(C51=\"\",0,(VLOOKUP(C51,'Membership #'!$A$1:$C$1005,3,0)))","v":"Tip It Back"},23.673999999999999,null,23.673999999999999,10,1]

{"sheet":"PONY","index":6,"n_rows":51,"n_cols":21,"rows_kept":51,"cut":false,"hidden":false,"merged":[[36,6,39,6],[36,7,39,7],[36,8,39,8],[36,1,39,1],[20,7,23,7],[20,8,23,8],[20,6,23,6],[20,5,23,5],[36,5,39,5],[34,1,34,9],[36,9,39,9],[20,9,23,9],[35,1,35,9],[25,12,25,20],[1,17,4,17],[1,18,4,18],[1,19,4,19],[0,1,0,9],[1,1,1,9],[18,1,18,9],[19,1,19,9],[2,9,5,9],[2,5,5,5],[2,7,5,7],[2,8,5,8],[2,6,5,6],[2,2,5,2],[2,0,5,0],[2,3,5,3],[2,4,5,4],[1,20,4,20],[1,11,4,11],[1,12,4,12],[1,13,4,13],[1,14,4,14],[1,15,4,15],[1,16,4,16],[2,1,5,1],[36,0,39,0],[36,2,39,2],[36,3,39,3],[36,4,39,4],[20,0,23,0],[20,2,23,2],[20,3,23,3],[20,4,23,4],[20,1,23,1]]}
[null,"Tom Burt & Mark McGuire Memorial Jackpot Aug 21, 2021",null,null,null,null,null,null,null,null,null,"High Point Pony"]
[null,"PONY  BARRELS",null,null,null,null,null,null,null,null,null,"RING #      ","NAME","HORSE NAME","Barrels","Poles","Dash","Barrels","Poles","Dash","Total"]
["Rand Draw","Running Order","RING #      ","NAME","HORSE NAME","TIME","PENALTY ","TOTAL","PLACINGS","POINTS"]
[]
[]
[null,null,null,null,null,null,null,null,null,null,null,815,{"$f":"IF(L6=\"\",0,(VLOOKUP(L6,'Membership #'!$A$1:$C$1005,2,0)))","v":"Brooke Kennedy"},{"$f":"IF(L6=\"\",0,(VLOOKUP(L6,'Membership #'!$A$1:$C$1005,3,0)))","v":"Tic Toc Teazer"},10,10,8,null,null,null,{"$f":"SUM(O6:T6)","v":28}]
[{"$f":"RAND()","v":0.10608918695149505},1,null,{"$f":"IF(C7=\"\",0,(VLOOKUP(C7,'Membership #'!$A$1:$C$1005,2,0)))","v":0},{"$f":"IF(C7=\"\",0,(VLOOKUP(C7,'Membership #'!$A$1:$C$1005,3,0)))","v":0},null,null,{"$f":"SUM(F7+G7)","v":0},null,null,null,666,{"$f":"IF(L7=\"\",0,(VLOOKUP(L7,'Membership #'!$A$1:$C$1005,2,0)))","v":"Summer Fraser"},{"$f":"IF(L7=\"\",0,(VLOOKUP(L7,'Membership #'!$A$1:$C$1005,3,0)))","v":"Sheza Smokin' Girl"},9,null,9,null,null,null,{"$f":"SUM(O7:T7)","v":18}]
[0.53955942366610976,2,815,{"$f":"IF(C8=\"\",0,(VLOOKUP(C8,'Membership #'!$A$1:$C$1005,2,0)))","v":"Brooke Kennedy"},{"$f":"IF(C8=\"\",0,(VLOOKUP(C8,'Membership #'!$A$1:$C$1005,3,0)))","v":"Tic Toc Teazer"},16.210999999999999,null,16.210999999999999,1,10,null,867,{"$f":"IF(L8=\"\",0,(VLOOKUP(L8,'Membership #'!$A$1:$C$1005,2,0)))","v":"Layla MacEachem"},{"$f":"IF(L8=\"\",0,(VLOOKUP(L8,'Membership #'!$A$1:$C$1005,3,0)))","v":"Shes a gem"},8,9,6,null,null,null,{"$f":"SUM(O8:T8)","v":23}]
[0.33239976666144222,3,666,{"$f":"IF(C9=\"\",0,(VLOOKUP(C9,'Membership #'!$A$1:$C$1005,2,0)))","v":"Summer Fraser"},{"$f":"IF(C9=\"\",0,(VLOOKUP(C9,'Membership #'!$A$1:$C$1005,3,0)))","v":"Sheza Smokin' Girl"},16.888000000000002,null,16.888000000000002,2,9,null,961,{"$f":"IF(L9=\"\",0,(VLOOKUP(L9,'Membership #'!$A$1:$C$1005,2,0)))","v":"Jacie Burke"},{"$f":"IF(L9=\"\",0,(VLOOKUP(L9,'Membership #'!$A$1:$C$1005,3,0)))","v":"She's Just That Sassy"},7,4,null,null,null,null,{"$f":"SUM(O9:T9)","v":11}]
[0.26540383749781837,4,867,{"$f":"IF(C10=\"\",0,(VLOOKUP(C10,'Membership #'!$A$1:$C$1005,2,0)))","v":"Layla MacEachem"},{"$f":"IF(C10=\"\",0,(VLOOKUP(C10,'Membership #'!$A$1:$C$1005,3,0)))","v":"Shes a gem"},17.86,null,17.86,3,8,null,636,{"$f":"IF(L10=\"\",0,(VLOOKUP(L10,'Membership #'!$A$1:$C$1005,2,0)))","v":"Ceilidh Gosse"},{"$f":"IF(L10=\"\",0,(VLOOKUP(L10,'Membership #'!$A$1:$C$1005,3,0)))","v":"ELM Silver Crime"},6,8,null,null,null,null,14]
[0.55555322128745876,5,961,{"$f":"IF(C11=\"\",0,(VLOOKUP(C11,'Membership #'!$A$1:$C$1005,2,0)))","v":"Jacie Burke"},{"$f":"IF(C11=\"\",0,(VLOOKUP(C11,'Membership #'!$A$1:$C$1005,3,0)))","v":"She's Just That Sassy"},18.614999999999998,null,18.614999999999998,4,7,null,967,{"$f":"IF(L11=\"\",0,(VLOOKUP(L11,'Membership #'!$A$1:$C$1005,2,0)))","v":"Marissa Hillier"},{"$f":"IF(L11=\"\",0,(VLOOKUP(L11,'Membership #'!$A$1:$C$1005,3,0)))","v":"Notice Betty Boop"},5,6,4,null,null,null,15]
[0.37047296061930968,6,636,{"$f":"IF(C12=\"\",0,(VLOOKUP(C12,'Membership #'!$A$1:$C$1005,2,0)))","v":"Ceilidh Gosse"},{"$f":"IF(C12=\"\",0,(VLOOKUP(C12,'Membership #'!$A$1:$C$1005,3,0)))","v":"ELM Silver Crime"},18.885999999999999,null,18.885999999999999,5,6,null,702,{"$f":"IF(L12=\"\",0,(VLOOKUP(L12,'Membership #'!$A$1:$C$1005,2,0)))","v":"Jenna Proctor"},{"$f":"IF(L12=\"\",0,(VLOOKUP(L12,'Membership #'!$A$1:$C$1005,3,0)))","v":"Painted to Perfection"},4,5,5,null,null,null,{"$f":"SUM(O12:T12)","v":14}]
[0.9937297313004233,7,967,{"$f":"IF(C13=\"\",0,(VLOOKUP(C13,'Membership #'!$A$1:$C$1005,2,0)))","v":"Marissa Hillier"},{"$f":"IF(C13=\"\",0,(VLOOKUP(C13,'Membership #'!$A$1:$C$1005,3,0)))","v":"Notice Betty Boop"},20.381,null,20.381,6,5,null,941,{"$f":"IF(L13=\"\",0,(VLOOKUP(L13,'Membership #'!$A$1:$C$1005,2,0)))","v":"Taylor Hurley"},{"$f":"IF(L13=\"\",0,(VLOOKUP(L13,'Membership #'!$A$1:$C$1005,3,0)))","v":"Nacho Business"},3,7,7,null,null,null,17]
[{"$f":"RAND()","v":0.91663503457354822},8,702,{"$f":"IF(C14=\"\",0,(VLOOKUP(C14,'Membership #'!$A$1:$C$1005,2,0)))","v":"Jenna Proctor"},{"$f":"IF(C14=\"\",0,(VLOOKUP(C14,'Membership #'!$A$1:$C$1005,3,0)))","v":"Painted to Perfection"},22.108000000000001,null,22.108000000000001,null,null,null,638,"Bella Peter","Super star ",null,null,10]
[{"$f":"RAND()","v":0.287561702767271},9,941,{"$f":"IF(C15=\"\",0,(VLOOKUP(C15,'Membership #'!$A$1:$C$1005,2,0)))","v":"Taylor Hurley"},{"$f":"IF(C15=\"\",0,(VLOOKUP(C15,'Membership #'!$A$1:$C$1005,3,0)))","v":"Nacho Business"},23.879000000000001,null,23.879000000000001]
[0.35009992137437618,10,532,{"$f":"IF(C16=\"\",0,(VLOOKUP(C16,'Membership #'!$A$1:$C$1005,2,0)))","v":"Gracie MacLean"},{"$f":"IF(C16=\"\",0,(VLOOKUP(C16,'Membership #'!$A$1:$C$1005,3,0)))","v":"Secret"},"x",null,{"$error":"#VALUE!"}]
[0.55944015987163509,11,889,{"$f":"IF(C17=\"\",0,(VLOOKUP(C17,'Membership #'!$A$1:$C$1005,2,0)))","v":"Adelaine Cowley"},{"$f":"IF(C17=\"\",0,(VLOOKUP(C17,'Membership #'!$A$1:$C$1005,3,0)))","v":"Frenchman's Promise"},"x",null,{"$error":"#VALUE!"}]
[]
[null,"Tom Burt & Mark McGuire Memorial Jackpot Aug 21, 2021",null,null,null,null,null,null,null,null,null,null,{"$f":"IF(L19=\"\",0,(VLOOKUP(L19,'Membership #'!$A$1:$C$1005,2,0)))","v":0},{"$f":"IF(L19=\"\",0,(VLOOKUP(L19,'Membership #'!$A$1:$C$1005,3,0)))","v":0},null,null,null,null,null,null,{"$f":"SUM(O19:T19)","v":0}]
[null,"PONY  POLES",null,null,null,null,null,null,null,null,null,null,{"$f":"IF(L20=\"\",0,(VLOOKUP(L20,'Membership #'!$A$1:$C$1005,2,0)))","v":0},{"$f":"IF(L20=\"\",0,(VLOOKUP(L20,'Membership #'!$A$1:$C$1005,3,0)))","v":0},null,null,null,null,null,null,{"$f":"SUM(O20:T20)","v":0}]
["Rand Draw","Running Order","RING #      ","NAME","HORSE NAME","TIME","PENALTY ","TOTAL","PLACINGS","POINTS",null,null,{"$f":"IF(L21=\"\",0,(VLOOKUP(L21,'Membership #'!$A$1:$C$1005,2,0)))","v":0},{"$f":"IF(L21=\"\",0,(VLOOKUP(L21,'Membership #'!$A$1:$C$1005,3,0)))","v":0},null,null,null,null,null,null,{"$f":"SUM(O21:T21)","v":0}]
[null,null,null,null,null,null,null,null,null,null,null,null,{"$f":"IF(L22=\"\",0,(VLOOKUP(L22,'Membership #'!$A$1:$C$1005,2,0)))","v":0},{"$f":"IF(L22=\"\",0,(VLOOKUP(L22,'Membership #'!$A$1:$C$1005,3,0)))","v":0},null,null,null,null,null,null,{"$f":"SUM(O22:T22)","v":0}]
[null,null,null,null,null,null,null,null,null,null,null,null,null,null,null,null,null,null,null,null,{"$f":"SUM(O23:T23)","v":0}]
[]
[{"$f":"RAND()","v":0.81079036200822296},1,815,{"$f":"IF(C25=\"\",\"\",(VLOOKUP(C25,'Membership #'!$A$1:$C$1005,2,FALSE)))","v":"Brooke Kennedy"},{"$f":"IF(C25=\"\",\"\",(VLOOKUP(C25,'Membership #'!$A$1:$C$1005,3,FALSE)))","v":"Tic Toc Teazer"},22.545999999999999,null,{"$f":"SUM(F25+G25)","v":22.545999999999999},1]
[0.17547568548599513,2,867,{"$f":"IF(C26=\"\",\"\",(VLOOKUP(C26,'Membership #'!$A$1:$C$1005,2,FALSE)))","v":"Layla MacEachem"},{"$f":"IF(C26=\"\",\"\",(VLOOKUP(C26,'Membership #'!$A$1:$C$1005,3,FALSE)))","v":"Shes a gem"},27.018999999999998,null,27.018999999999998,2]
[0.48807907723967026,3,636,{"$f":"IF(C27=\"\",\"\",(VLOOKUP(C27,'Membership #'!$A$1:$C$1005,2,FALSE)))","v":"Ceilidh Gosse"},{"$f":"IF(C27=\"\",\"\",(VLOOKUP(C27,'Membership #'!$A$1:$C$1005,3,FALSE)))","v":"ELM Silver Crime"},27.169,null,27.169,3]
[0.67093394787414862,4,941,{"$f":"IF(C28=\"\",\"\",(VLOOKUP(C28,'Membership #'!$A$1:$C$1005,2,FALSE)))","v":"Taylor Hurley"},{"$f":"IF(C28=\"\",\"\",(VLOOKUP(C28,'Membership #'!$A$1:$C$1005,3,FALSE)))","v":"Nacho Business"},28.012,null,28.012,4]
[7.9288192228447407E-2,5,967,{"$f":"IF(C29=\"\",\"\",(VLOOKUP(C29,'Membership #'!$A$1:$C$1005,2,FALSE)))","v":"Marissa Hillier"},{"$f":"IF(C29=\"\",\"\",(VLOOKUP(C29,'Membership #'!$A$1:$C$1005,3,FALSE)))","v":"Notice Betty Boop"},30.111000000000001,null,30.111000000000001,5]
[0.78415032863903822,6,702,{"$f":"IF(C30=\"\",\"\",(VLOOKUP(C30,'Membership #'!$A$1:$C$1005,2,FALSE)))","v":"Jenna Proctor"},{"$f":"IF(C30=\"\",\"\",(VLOOKUP(C30,'Membership #'!$A$1:$C$1005,3,FALSE)))","v":"Painted to Perfection"},32.380000000000003,5,37.380000000000003,6]
[0.88282956813637981,7,961,{"$f":"IF(C31=\"\",\"\",(VLOOKUP(C31,'Membership #'!$A$1:$C$1005,2,FALSE)))","v":"Jacie Burke"},{"$f":"IF(C31=\"\",\"\",(VLOOKUP(C31,'Membership #'!$A$1:$C$1005,3,FALSE)))","v":"She's Just That Sassy"},28.263000000000002,10,38.263000000000005,7]
[0.28081146065881657,8,889,{"$f":"IF(C32=\"\",\"\",(VLOOKUP(C32,'Membership #'!$A$1:$C$1005,2,FALSE)))","v":"Adelaine Cowley"},{"$f":"IF(C32=\"\",\"\",(VLOOKUP(C32,'Membership #'!$A$1:$C$1005,3,FALSE)))","v":"Frenchman's Promise"},"x",null,{"$error":"#VALUE!"}]
[0.81848218512060389,9,666,{"$f":"IF(C33=\"\",\"\",(VLOOKUP(C33,'Membership #'!$A$1:$C$1005,2,FALSE)))","v":"Summer Fraser"},{"$f":"IF(C33=\"\",\"\",(VLOOKUP(C33,'Membership #'!$A$1:$C$1005,3,FALSE)))","v":"Sheza Smokin' Girl"},"n",null,{"$error":"#VALUE!"}]
[{"$f":"RAND()","v":0.15110010167945176},10,532,{"$f":"IF(C34=\"\",\"\",(VLOOKUP(C34,'Membership #'!$A$1:$C$1005,2,FALSE)))","v":"Gracie MacLean"},{"$f":"IF(C34=\"\",\"\",(VLOOKUP(C34,'Membership #'!$A$1:$C$1005,3,FALSE)))","v":"Secret"},"x",null,{"$error":"#VALUE!"}]
[null,"Tom Burt & Mark McGuire Memorial Jackpot Aug 21, 2021"]
[null,"PONY DASH"]
["Rand Draw","Running Order","RING #      ","NAME","HORSE NAME","TIME","PENALTY ",null,"PLACINGS","POINTS"]
[]
[]
[]
[{"$f":"RAND()","v":0.10772513591281896},1,638,{"$f":"IF(C41=\"\",0,(VLOOKUP(C41,'Membership #'!$A$1:$C$1005,2,0)))","v":"Bella Peters"},{"$f":"IF(C41=\"\",0,(VLOOKUP(C41,'Membership #'!$A$1:$C$1005,3,0)))","v":"Super Star"},7.9009999999999998,null,{"$f":"SUM(F41+G41)","v":7.9009999999999998},1]
[0.20380094715226005,2,666,{"$f":"IF(C42=\"\",0,(VLOOKUP(C42,'Membership #'!$A$1:$C$1005,2,0)))","v":"Summer Fraser"},{"$f":"IF(C42=\"\",0,(VLOOKUP(C42,'Membership #'!$A$1:$C$1005,3,0)))","v":"Sheza Smokin' Girl"},8.1379999999999999,null,8.1379999999999999,2]
[0.35315242618985132,3,815,{"$f":"IF(C43=\"\",0,(VLOOKUP(C43,'Membership #'!$A$1:$C$1005,2,0)))","v":"Brooke Kennedy"},{"$f":"IF(C43=\"\",0,(VLOOKUP(C43,'Membership #'!$A$1:$C$1005,3,0)))","v":"Tic Toc Teazer"},8.4540000000000006,null,8.4540000000000006,3]
[2.6420147834090857E-3,4,941,{"$f":"IF(C44=\"\",0,(VLOOKUP(C44,'Membership #'!$A$1:$C$1005,2,0)))","v":"Taylor Hurley"},{"$f":"IF(C44=\"\",0,(VLOOKUP(C44,'Membership #'!$A$1:$C$1005,3,0)))","v":"Nacho Business"},8.8859999999999992,null,8.8859999999999992,4]
[0.42176411826793236,5,867,{"$f":"IF(C45=\"\",0,(VLOOKUP(C45,'Membership #'!$A$1:$C$1005,2,0)))","v":"Layla MacEachem"},{"$f":"IF(C45=\"\",0,(VLOOKUP(C45,'Membership #'!$A$1:$C$1005,3,0)))","v":"Shes a gem"},8.9440000000000008,null,8.9440000000000008,5]
[0.13105172181251412,6,702,{"$f":"IF(C46=\"\",0,(VLOOKUP(C46,'Membership #'!$A$1:$C$1005,2,0)))","v":"Jenna Proctor"},{"$f":"IF(C46=\"\",0,(VLOOKUP(C46,'Membership #'!$A$1:$C$1005,3,0)))","v":"Painted to Perfection"},10.351000000000001,null,10.351000000000001,6]
[0.68669804227562525,7,967,{"$f":"IF(C47=\"\",0,(VLOOKUP(C47,'Membership #'!$A$1:$C$1005,2,0)))","v":"Marissa Hillier"},{"$f":"IF(C47=\"\",0,(VLOOKUP(C47,'Membership #'!$A$1:$C$1005,3,0)))","v":"Notice Betty Boop"},10.614000000000001,null,10.614000000000001]
[0.97309927769812565,8,532,{"$f":"IF(C48=\"\",0,(VLOOKUP(C48,'Membership #'!$A$1:$C$1005,2,0)))","v":"Gracie MacLean"},{"$f":"IF(C48=\"\",0,(VLOOKUP(C48,'Membership #'!$A$1:$C$1005,3,0)))","v":"Secret"},"x",null,{"$error":"#VALUE!"}]
[0.94497609371504465,9,889,{"$f":"IF(C49=\"\",0,(VLOOKUP(C49,'Membership #'!$A$1:$C$1005,2,0)))","v":"Adelaine Cowley"},{"$f":"IF(C49=\"\",0,(VLOOKUP(C49,'Membership #'!$A$1:$C$1005,3,0)))","v":"Frenchman's Promise"},"x",null,{"$error":"#VALUE!"}]
[null,10,null,{"$f":"IF(C50=\"\",0,(VLOOKUP(C50,'Membership #'!$A$1:$C$1005,2,0)))","v":0},{"$f":"IF(C50=\"\",0,(VLOOKUP(C50,'Membership #'!$A$1:$C$1005,3,0)))","v":0},null,null,{"$f":"SUM(F50+G50)","v":0}]
[null,11,null,{"$f":"IF(C51=\"\",0,(VLOOKUP(C51,'Membership #'!$A$1:$C$1005,2,0)))","v":0},{"$f":"IF(C51=\"\",0,(VLOOKUP(C51,'Membership #'!$A$1:$C$1005,3,0)))","v":0},null,null,0]

{"sheet":"JUNIOR HORSE BARRELS","index":7,"n_rows":101,"n_cols":26,"rows_kept":101,"cut":false,"hidden":false,"merged":[[5,12,5,15],[0,0,0,10],[1,0,1,10],[2,0,2,3],[2,6,2,10],[3,0,6,0],[3,1,6,1],[3,2,6,2],[3,3,6,3],[3,4,6,4],[3,9,6,9],[3,10,6,10],[3,5,6,5],[3,6,6,6],[3,7,6,7],[3,8,6,8]]}
["Tom Burt & Mark McGuire Memorial Jackpot Aug 21, 2021",null,null,null,null,null,null,null,null,null,null,null,"x=Scratch"]
["JUNIOR HORSE BARRELS",null,null,null,null,null,null,null,null,null,null,null,"n=No Time"]
["# Enteries:",null,null,null,{"$f":"COUNTIF($D$8:$D$100,\">0\")","v":3},null,null,null,null,null,null,null,null,null,null,null,null,"Don't Erase these numbers below!!"]
["Rand Draw","Seed",null,"RING #      ","NAME","HORSE NAME","TIME","PENALTY ","TOTAL","PLACINGS","POINTS",null,null,null,null,null,null,{"$f":"IF(N9=2,7,IF(N9=3,6,IF(N9=4,5,IF(N9=5,4,IF(AND(N9>5,N11>600),3,IF(AND(N9>5,N11<600,N11>299.99),2,IF(AND(N9>5,N11<300),1,8)))))))","v":6},1,2,3,4,5,6,7,8]
[null,null,null,null,null,null,null,null,null,null,null,null,null,null,null,null,null,null,299,"$300-","$600 -"]
[null,null,null,null,null,null,null,null,null,null,null,null,"JUNIOR HORSE BARRELS",null,null,null,null,null,"or less",599,"More","5 Entries","4 Entries","3 Entries","2 Entries"]
[null,null,null,null,null,null,null,null,null,null,null,null,null,null,null,null,null,"1st",0.32,0.27,0.24,0.35,0.4,0.46,0.6]
[{"$f":"IF(D8<>\"\",RAND(),\"\")","v":0.84889366582093095},{"$f":"IF(D8<>\"\",RANK(A8,A$8:A$101),\"\")","v":2},1,786,{"$f":"IF(D8=\"\",\"\",(VLOOKUP(D8,'Membership #'!$A$1:$C$1005,2,0)))","v":"Rileigh Conrod"},{"$f":"IF(D8=\"\",\"\",(VLOOKUP(D8,'Membership #'!$A$1:$C$1005,3,0)))","v":"Scotches Harley"},21.937999999999999,null,{"$f":"IF(G8=\"n\",\"No Time\",IF(G8=\"x\",\"Scratch\",IF(G8<>\"\",SUM(G8+H8),\"\")))","v":21.937999999999999},null,null,null,"Added",50,null,null,null,"2nd",0.23,0.22,0.19,0.25,0.28000000000000003,0.34,0.4]
[0.20955923292501988,3,2,518,{"$f":"IF(D9=\"\",\"\",(VLOOKUP(D9,'Membership #'!$A$1:$C$1005,2,0)))","v":"Sylvester Weatherbie"},{"$f":"IF(D9=\"\",\"\",(VLOOKUP(D9,'Membership #'!$A$1:$C$1005,3,0)))","v":"J.R."},16.908999999999999,null,{"$f":"IF(G9=\"n\",\"No Time\",IF(G9=\"x\",\"Scratch\",IF(G9<>\"\",SUM(G9+H9),\"\")))","v":16.908999999999999},null,null,null,"Entries",3,null,10,"per head","3rd",0.15,0.18,0.16,0.17,0.18,0.2]
[0.97426219170732564,1,3,563,{"$f":"IF(D10=\"\",\"\",(VLOOKUP(D10,'Membership #'!$A$1:$C$1005,2,0)))","v":"Kevin Bateman"},{"$f":"IF(D10=\"\",\"\",(VLOOKUP(D10,'Membership #'!$A$1:$C$1005,3,0)))","v":"Jess Chasin A Hobby"},17.672000000000001,null,{"$f":"IF(G10=\"n\",\"No Time\",IF(G10=\"x\",\"Scratch\",IF(G10<>\"\",SUM(G10+H10),\"\")))","v":17.672000000000001},null,null,null,"Jackpot",{"$f":"P9*N9","v":30},null,0.85,"payback","4th",0.12,0.13,0.13,0.13,0.14000000000000001]
["","",null,null,{"$f":"IF(D11=\"\",\"\",(VLOOKUP(D11,'Membership #'!$A$1:$C$1005,2,0)))","v":""},{"$f":"IF(D11=\"\",\"\",(VLOOKUP(D11,'Membership #'!$A$1:$C$1005,3,0)))","v":""},null,null,{"$f":"IF(G11=\"n\",\"No Time\",IF(G11=\"x\",\"Scratch\",IF(G11<>\"\",SUM(G11+H11),\"\")))","v":""},null,null,null,"Total Money",{"$f":"N8+(N10*P10)","v":75.5},null,{"$f":"N10*P10","v":25.5},"Jackpot","5th",0.1,0.09,0.08,0.1]
["","","",null,{"$f":"IF(D12=\"\",\"\",(VLOOKUP(D12,'Membership #'!$A$1:$C$1005,2,0)))","v":""},{"$f":"IF(D12=\"\",\"\",(VLOOKUP(D12,'Membership #'!$A$1:$C$1005,3,0)))","v":""},null,null,{"$f":"IF(G12=\"n\",\"No Time\",IF(G12=\"x\",\"Scratch\",IF(G12<>\"\",SUM(G12+H12),\"\")))","v":""},null,null,null,null,"Percentage","Money","Ring #",null,"6th",0.08,0.06,0.06]
["","","",null,{"$f":"IF(D13=\"\",\"\",(VLOOKUP(D13,'Membership #'!$A$1:$C$1005,2,0)))","v":""},{"$f":"IF(D13=\"\",\"\",(VLOOKUP(D13,'Membership #'!$A$1:$C$1005,3,0)))","v":""},null,null,{"$f":"IF(G13=\"n\",\"No Time\",IF(G13=\"x\",\"Scratch\",IF(G13<>\"\",SUM(G13+H13),\"\")))","v":""},null,null,null,"1st",0.46,{"$f":"IF(N13<>0,N$11*N13,\"\")","v":34.730000000000004},null,{"$f":"IF(P13=\"\",\"\",(VLOOKUP(P13,'Membership #'!$A$1:$C$1005,2,0)))","v":""},"7th",null,0.03,0.05]
["","","",null,{"$f":"IF(D14=\"\",\"\",(VLOOKUP(D14,'Membership #'!$A$1:$C$1005,2,0)))","v":""},{"$f":"IF(D14=\"\",\"\",(VLOOKUP(D14,'Membership #'!$A$1:$C$1005,3,0)))","v":""},null,null,{"$f":"IF(G14=\"n\",\"No Time\",IF(G14=\"x\",\"Scratch\",IF(G14<>\"\",SUM(G14+H14),\"\")))","v":""},null,null,null,"2nd",0.34,25.67,null,{"$f":"IF(P14=\"\",\"\",(VLOOKUP(P14,'Membership #'!$A$1:$C$1005,2,0)))","v":""},"8th",null,0.02,0.04]
["","","",null,{"$f":"IF(D15=\"\",\"\",(VLOOKUP(D15,'Membership #'!$A$1:$C$1005,2,0)))","v":""},{"$f":"IF(D15=\"\",\"\",(VLOOKUP(D15,'Membership #'!$A$1:$C$1005,3,0)))","v":""},null,null,"",null,null,null,"3rd",0.2,15.100000000000001,null,{"$f":"IF(P15=\"\",\"\",(VLOOKUP(P15,'Membership #'!$A$1:$C$1005,2,0)))","v":""},"9th",null,null,0.03]
["","","",null,{"$f":"IF(D16=\"\",\"\",(VLOOKUP(D16,'Membership #'!$A$1:$C$1005,2,0)))","v":""},{"$f":"IF(D16=\"\",\"\",(VLOOKUP(D16,'Membership #'!$A$1:$C$1005,3,0)))","v":""},null,null,"",null,null,null,"4th",null,"",null,{"$f":"IF(P16=\"\",\"\",(VLOOKUP(P16,'Membership #'!$A$1:$C$1005,2,0)))","v":""},"10th",null,null,0.02]
["","","",null,{"$f":"IF(D17=\"\",\"\",(VLOOKUP(D17,'Membership #'!$A$1:$C$1005,2,0)))","v":""},{"$f":"IF(D17=\"\",\"\",(VLOOKUP(D17,'Membership #'!$A$1:$C$1005,3,0)))","v":""},null,null,"",null,null,null,"5th",null,"",null,{"$f":"IF(P17=\"\",\"\",(VLOOKUP(P17,'Membership #'!$A$1:$C$1005,2,0)))","v":""}]
["","","",null,{"$f":"IF(D18=\"\",\"\",(VLOOKUP(D18,'Membership #'!$A$1:$C$1005,2,0)))","v":""},{"$f":"IF(D18=\"\",\"\",(VLOOKUP(D18,'Membership #'!$A$1:$C$1005,3,0)))","v":""},null,null,"",null,null,null,"6th",null,"",null,{"$f":"IF(P18=\"\",\"\",(VLOOKUP(P18,'Membership #'!$A$1:$C$1005,2,0)))","v":""}]
["","","",null,{"$f":"IF(D19=\"\",\"\",(VLOOKUP(D19,'Membership #'!$A$1:$C$1005,2,0)))","v":""},{"$f":"IF(D19=\"\",\"\",(VLOOKUP(D19,'Membership #'!$A$1:$C$1005,3,0)))","v":""},null,null,"",null,null,null,"7th",null,"",null,{"$f":"IF(P19=\"\",0,(VLOOKUP(P19,'Membership #'!$A$1:$C$1005,2,0)))","v":0}]
["","","",null,{"$f":"IF(D20=\"\",\"\",(VLOOKUP(D20,'Membership #'!$A$1:$C$1005,2,0)))","v":""},{"$f":"IF(D20=\"\",\"\",(VLOOKUP(D20,'Membership #'!$A$1:$C$1005,3,0)))","v":""},null,null,{"$f":"IF(G20=\"n\",\"No Time\",IF(G20=\"x\",\"Scratch\",IF(G20<>\"\",SUM(G20+H20),\"\")))","v":""},null,null,null,"8th",null,"",null,{"$f":"IF(P20=\"\",0,(VLOOKUP(P20,'Membership #'!$A$1:$C$1005,2,0)))","v":0}]
["","","",null,{"$f":"IF(D21=\"\",\"\",(VLOOKUP(D21,'Membership #'!$A$1:$C$1005,2,0)))","v":""},{"$f":"IF(D21=\"\",\"\",(VLOOKUP(D21,'Membership #'!$A$1:$C$1005,3,0)))","v":""},null,null,"",null,null,null,"9th",null,""]
["","","",null,{"$f":"IF(D22=\"\",\"\",(VLOOKUP(D22,'Membership #'!$A$1:$C$1005,2,0)))","v":""},{"$f":"IF(D22=\"\",\"\",(VLOOKUP(D22,'Membership #'!$A$1:$C$1005,3,0)))","v":""},null,null,{"$f":"IF(G22=\"n\",\"No Time\",IF(G22=\"x\",\"Scratch\",IF(G22<>\"\",SUM(G22+H22),\"\")))","v":""},null,null,null,"10th",null,""]
["","","",null,{"$f":"IF(D23=\"\",\"\",(VLOOKUP(D23,'Membership #'!$A$1:$C$1005,2,0)))","v":""},{"$f":"IF(D23=\"\",\"\",(VLOOKUP(D23,'Membership #'!$A$1:$C$1005,3,0)))","v":""},null,null,"",null,null,null,"Total Money",null,{"$f":"SUM(O13:O22)","v":75.5}]
["","","",null,{"$f":"IF(D24=\"\",\"\",(VLOOKUP(D24,'Membership #'!$A$1:$C$1005,2,0)))","v":""},{"$f":"IF(D24=\"\",\"\",(VLOOKUP(D24,'Membership #'!$A$1:$C$1005,3,0)))","v":""},null,null,""]
["","","",null,{"$f":"IF(D25=\"\",\"\",(VLOOKUP(D25,'Membership #'!$A$1:$C$1005,2,0)))","v":""},{"$f":"IF(D25=\"\",\"\",(VLOOKUP(D25,'Membership #'!$A$1:$C$1005,3,0)))","v":""},null,null,""]
["","","",null,{"$f":"IF(D26=\"\",\"\",(VLOOKUP(D26,'Membership #'!$A$1:$C$1005,2,0)))","v":""},{"$f":"IF(D26=\"\",\"\",(VLOOKUP(D26,'Membership #'!$A$1:$C$1005,3,0)))","v":""},null,null,"",null,null,null,{"$f":"IF(L26=\"\",\"\",(VLOOKUP(L26,'Membership #'!$A$1:$C$1005,2,0)))","v":""}]
["","","",null,{"$f":"IF(D27=\"\",\"\",(VLOOKUP(D27,'Membership #'!$A$1:$C$1005,2,0)))","v":""},{"$f":"IF(D27=\"\",\"\",(VLOOKUP(D27,'Membership #'!$A$1:$C$1005,3,0)))","v":""},null,null,""]
["","","",null,{"$f":"IF(D28=\"\",\"\",(VLOOKUP(D28,'Membership #'!$A$1:$C$1005,2,0)))","v":""},{"$f":"IF(D28=\"\",\"\",(VLOOKUP(D28,'Membership #'!$A$1:$C$1005,3,0)))","v":""},null,null,""]
["","","",null,{"$f":"IF(D29=\"\",\"\",(VLOOKUP(D29,'Membership #'!$A$1:$C$1005,2,0)))","v":""},{"$f":"IF(D29=\"\",\"\",(VLOOKUP(D29,'Membership #'!$A$1:$C$1005,3,0)))","v":""},null,null,""]
["","","",null,{"$f":"IF(D30=\"\",\"\",(VLOOKUP(D30,'Membership #'!$A$1:$C$1005,2,0)))","v":""},{"$f":"IF(D30=\"\",\"\",(VLOOKUP(D30,'Membership #'!$A$1:$C$1005,3,0)))","v":""},null,null,""]
["","","",null,{"$f":"IF(D31=\"\",\"\",(VLOOKUP(D31,'Membership #'!$A$1:$C$1005,2,0)))","v":""},{"$f":"IF(D31=\"\",\"\",(VLOOKUP(D31,'Membership #'!$A$1:$C$1005,3,0)))","v":""},null,null,""]
["","","",null,{"$f":"IF(D32=\"\",\"\",(VLOOKUP(D32,'Membership #'!$A$1:$C$1005,2,0)))","v":""},{"$f":"IF(D32=\"\",\"\",(VLOOKUP(D32,'Membership #'!$A$1:$C$1005,3,0)))","v":""},null,null,""]
["","","",null,{"$f":"IF(D33=\"\",\"\",(VLOOKUP(D33,'Membership #'!$A$1:$C$1005,2,0)))","v":""},{"$f":"IF(D33=\"\",\"\",(VLOOKUP(D33,'Membership #'!$A$1:$C$1005,3,0)))","v":""},null,null,""]
["","","",null,{"$f":"IF(D34=\"\",\"\",(VLOOKUP(D34,'Membership #'!$A$1:$C$1005,2,0)))","v":""},{"$f":"IF(D34=\"\",\"\",(VLOOKUP(D34,'Membership #'!$A$1:$C$1005,3,0)))","v":""},null,null,""]
["","","",null,{"$f":"IF(D35=\"\",\"\",(VLOOKUP(D35,'Membership #'!$A$1:$C$1005,2,0)))","v":""},{"$f":"IF(D35=\"\",\"\",(VLOOKUP(D35,'Membership #'!$A$1:$C$1005,3,0)))","v":""},null,null,""]
["","","",null,{"$f":"IF(D36=\"\",\"\",(VLOOKUP(D36,'Membership #'!$A$1:$C$1005,2,0)))","v":""},{"$f":"IF(D36=\"\",\"\",(VLOOKUP(D36,'Membership #'!$A$1:$C$1005,3,0)))","v":""},null,null,""]
["","","",null,{"$f":"IF(D37=\"\",\"\",(VLOOKUP(D37,'Membership #'!$A$1:$C$1005,2,0)))","v":""},{"$f":"IF(D37=\"\",\"\",(VLOOKUP(D37,'Membership #'!$A$1:$C$1005,3,0)))","v":""},null,null,""]
["","","",null,{"$f":"IF(D38=\"\",\"\",(VLOOKUP(D38,'Membership #'!$A$1:$C$1005,2,0)))","v":""},{"$f":"IF(D38=\"\",\"\",(VLOOKUP(D38,'Membership #'!$A$1:$C$1005,3,0)))","v":""},null,null,""]
["","","",null,{"$f":"IF(D39=\"\",\"\",(VLOOKUP(D39,'Membership #'!$A$1:$C$1005,2,0)))","v":""},{"$f":"IF(D39=\"\",\"\",(VLOOKUP(D39,'Membership #'!$A$1:$C$1005,3,0)))","v":""},null,null,""]
[{"$f":"IF(D40<>\"\",RAND(),\"\")","v":""},{"$f":"IF(D40<>\"\",RANK(A40,A$8:A$101),\"\")","v":""},"",null,{"$f":"IF(D40=\"\",\"\",(VLOOKUP(D40,'Membership #'!$A$1:$C$1005,2,0)))","v":""},{"$f":"IF(D40=\"\",\"\",(VLOOKUP(D40,'Membership #'!$A$1:$C$1005,3,0)))","v":""},null,null,""]
["","","",null,{"$f":"IF(D41=\"\",\"\",(VLOOKUP(D41,'Membership #'!$A$1:$C$1005,2,0)))","v":""},{"$f":"IF(D41=\"\",\"\",(VLOOKUP(D41,'Membership #'!$A$1:$C$1005,3,0)))","v":""},null,null,""]
["","","",null,{"$f":"IF(D42=\"\",\"\",(VLOOKUP(D42,'Membership #'!$A$1:$C$1005,2,0)))","v":""},{"$f":"IF(D42=\"\",\"\",(VLOOKUP(D42,'Membership #'!$A$1:$C$1005,3,0)))","v":""},null,null,""]
["","","",null,{"$f":"IF(D43=\"\",\"\",(VLOOKUP(D43,'Membership #'!$A$1:$C$1005,2,0)))","v":""},{"$f":"IF(D43=\"\",\"\",(VLOOKUP(D43,'Membership #'!$A$1:$C$1005,3,0)))","v":""},null,null,""]
["","","",null,{"$f":"IF(D44=\"\",\"\",(VLOOKUP(D44,'Membership #'!$A$1:$C$1005,2,0)))","v":""},{"$f":"IF(D44=\"\",\"\",(VLOOKUP(D44,'Membership #'!$A$1:$C$1005,3,0)))","v":""},null,null,""]
["","","",null,{"$f":"IF(D45=\"\",\"\",(VLOOKUP(D45,'Membership #'!$A$1:$C$1005,2,0)))","v":""},{"$f":"IF(D45=\"\",\"\",(VLOOKUP(D45,'Membership #'!$A$1:$C$1005,3,0)))","v":""},null,null,""]
["","","",null,{"$f":"IF(D46=\"\",\"\",(VLOOKUP(D46,'Membership #'!$A$1:$C$1005,2,0)))","v":""},{"$f":"IF(D46=\"\",\"\",(VLOOKUP(D46,'Membership #'!$A$1:$C$1005,3,0)))","v":""},null,null,""]
["","","",null,{"$f":"IF(D47=\"\",\"\",(VLOOKUP(D47,'Membership #'!$A$1:$C$1005,2,0)))","v":""},{"$f":"IF(D47=\"\",\"\",(VLOOKUP(D47,'Membership #'!$A$1:$C$1005,3,0)))","v":""},null,null,""]
["","","",null,{"$f":"IF(D48=\"\",\"\",(VLOOKUP(D48,'Membership #'!$A$1:$C$1005,2,0)))","v":""},{"$f":"IF(D48=\"\",\"\",(VLOOKUP(D48,'Membership #'!$A$1:$C$1005,3,0)))","v":""},null,null,""]
["","","",null,{"$f":"IF(D49=\"\",\"\",(VLOOKUP(D49,'Membership #'!$A$1:$C$1005,2,0)))","v":""},{"$f":"IF(D49=\"\",\"\",(VLOOKUP(D49,'Membership #'!$A$1:$C$1005,3,0)))","v":""},null,null,""]
["","","",null,{"$f":"IF(D50=\"\",\"\",(VLOOKUP(D50,'Membership #'!$A$1:$C$1005,2,0)))","v":""},{"$f":"IF(D50=\"\",\"\",(VLOOKUP(D50,'Membership #'!$A$1:$C$1005,3,0)))","v":""},null,null,""]
["","","",null,{"$f":"IF(D51=\"\",\"\",(VLOOKUP(D51,'Membership #'!$A$1:$C$1005,2,0)))","v":""},{"$f":"IF(D51=\"\",\"\",(VLOOKUP(D51,'Membership #'!$A$1:$C$1005,3,0)))","v":""},null,null,""]
["","","",null,{"$f":"IF(D52=\"\",\"\",(VLOOKUP(D52,'Membership #'!$A$1:$C$1005,2,0)))","v":""},{"$f":"IF(D52=\"\",\"\",(VLOOKUP(D52,'Membership #'!$A$1:$C$1005,3,0)))","v":""},null,null,""]
["","","",null,{"$f":"IF(D53=\"\",\"\",(VLOOKUP(D53,'Membership #'!$A$1:$C$1005,2,0)))","v":""},{"$f":"IF(D53=\"\",\"\",(VLOOKUP(D53,'Membership #'!$A$1:$C$1005,3,0)))","v":""},null,null,""]
["","","",null,{"$f":"IF(D54=\"\",\"\",(VLOOKUP(D54,'Membership #'!$A$1:$C$1005,2,0)))","v":""},{"$f":"IF(D54=\"\",\"\",(VLOOKUP(D54,'Membership #'!$A$1:$C$1005,3,0)))","v":""},null,null,""]
["","","",null,{"$f":"IF(D55=\"\",\"\",(VLOOKUP(D55,'Membership #'!$A$1:$C$1005,2,0)))","v":""},{"$f":"IF(D55=\"\",\"\",(VLOOKUP(D55,'Membership #'!$A$1:$C$1005,3,0)))","v":""},null,null,""]
["","","",null,{"$f":"IF(D56=\"\",\"\",(VLOOKUP(D56,'Membership #'!$A$1:$C$1005,2,0)))","v":""},{"$f":"IF(D56=\"\",\"\",(VLOOKUP(D56,'Membership #'!$A$1:$C$1005,3,0)))","v":""},null,null,""]
["","","",null,{"$f":"IF(D57=\"\",\"\",(VLOOKUP(D57,'Membership #'!$A$1:$C$1005,2,0)))","v":""},{"$f":"IF(D57=\"\",\"\",(VLOOKUP(D57,'Membership #'!$A$1:$C$1005,3,0)))","v":""},null,null,""]
["","","",null,{"$f":"IF(D58=\"\",\"\",(VLOOKUP(D58,'Membership #'!$A$1:$C$1005,2,0)))","v":""},{"$f":"IF(D58=\"\",\"\",(VLOOKUP(D58,'Membership #'!$A$1:$C$1005,3,0)))","v":""},null,null,""]
["","","",null,{"$f":"IF(D59=\"\",\"\",(VLOOKUP(D59,'Membership #'!$A$1:$C$1005,2,0)))","v":""},{"$f":"IF(D59=\"\",\"\",(VLOOKUP(D59,'Membership #'!$A$1:$C$1005,3,0)))","v":""},null,null,""]
["","","",null,{"$f":"IF(D60=\"\",\"\",(VLOOKUP(D60,'Membership #'!$A$1:$C$1005,2,0)))","v":""},{"$f":"IF(D60=\"\",\"\",(VLOOKUP(D60,'Membership #'!$A$1:$C$1005,3,0)))","v":""},null,null,""]
["","","",null,{"$f":"IF(D61=\"\",\"\",(VLOOKUP(D61,'Membership #'!$A$1:$C$1005,2,0)))","v":""},{"$f":"IF(D61=\"\",\"\",(VLOOKUP(D61,'Membership #'!$A$1:$C$1005,3,0)))","v":""},null,null,""]
["","","",null,{"$f":"IF(D62=\"\",\"\",(VLOOKUP(D62,'Membership #'!$A$1:$C$1005,2,0)))","v":""},{"$f":"IF(D62=\"\",\"\",(VLOOKUP(D62,'Membership #'!$A$1:$C$1005,3,0)))","v":""},null,null,""]
["","","",null,{"$f":"IF(D63=\"\",\"\",(VLOOKUP(D63,'Membership #'!$A$1:$C$1005,2,0)))","v":""},{"$f":"IF(D63=\"\",\"\",(VLOOKUP(D63,'Membership #'!$A$1:$C$1005,3,0)))","v":""},null,null,""]
["","","",null,{"$f":"IF(D64=\"\",\"\",(VLOOKUP(D64,'Membership #'!$A$1:$C$1005,2,0)))","v":""},{"$f":"IF(D64=\"\",\"\",(VLOOKUP(D64,'Membership #'!$A$1:$C$1005,3,0)))","v":""},null,null,""]
["","","",null,{"$f":"IF(D65=\"\",\"\",(VLOOKUP(D65,'Membership #'!$A$1:$C$1005,2,0)))","v":""},{"$f":"IF(D65=\"\",\"\",(VLOOKUP(D65,'Membership #'!$A$1:$C$1005,3,0)))","v":""},null,null,""]
["","","",null,{"$f":"IF(D66=\"\",\"\",(VLOOKUP(D66,'Membership #'!$A$1:$C$1005,2,0)))","v":""},{"$f":"IF(D66=\"\",\"\",(VLOOKUP(D66,'Membership #'!$A$1:$C$1005,3,0)))","v":""},null,null,""]
["","","",null,{"$f":"IF(D67=\"\",\"\",(VLOOKUP(D67,'Membership #'!$A$1:$C$1005,2,0)))","v":""},{"$f":"IF(D67=\"\",\"\",(VLOOKUP(D67,'Membership #'!$A$1:$C$1005,3,0)))","v":""},null,null,""]
["","","",null,{"$f":"IF(D68=\"\",\"\",(VLOOKUP(D68,'Membership #'!$A$1:$C$1005,2,0)))","v":""},{"$f":"IF(D68=\"\",\"\",(VLOOKUP(D68,'Membership #'!$A$1:$C$1005,3,0)))","v":""},null,null,""]
["","","",null,{"$f":"IF(D69=\"\",\"\",(VLOOKUP(D69,'Membership #'!$A$1:$C$1005,2,0)))","v":""},{"$f":"IF(D69=\"\",\"\",(VLOOKUP(D69,'Membership #'!$A$1:$C$1005,3,0)))","v":""},null,null,""]
["","","",null,{"$f":"IF(D70=\"\",\"\",(VLOOKUP(D70,'Membership #'!$A$1:$C$1005,2,0)))","v":""},{"$f":"IF(D70=\"\",\"\",(VLOOKUP(D70,'Membership #'!$A$1:$C$1005,3,0)))","v":""},null,null,""]
["","","",null,{"$f":"IF(D71=\"\",\"\",(VLOOKUP(D71,'Membership #'!$A$1:$C$1005,2,0)))","v":""},{"$f":"IF(D71=\"\",\"\",(VLOOKUP(D71,'Membership #'!$A$1:$C$1005,3,0)))","v":""},null,null,""]
[{"$f":"IF(D72<>\"\",RAND(),\"\")","v":""},{"$f":"IF(D72<>\"\",RANK(A72,A$8:A$101),\"\")","v":""},"",null,{"$f":"IF(D72=\"\",\"\",(VLOOKUP(D72,'Membership #'!$A$1:$C$1005,2,0)))","v":""},{"$f":"IF(D72=\"\",\"\",(VLOOKUP(D72,'Membership #'!$A$1:$C$1005,3,0)))","v":""},null,null,""]
["","","",null,{"$f":"IF(D73=\"\",\"\",(VLOOKUP(D73,'Membership #'!$A$1:$C$1005,2,0)))","v":""},{"$f":"IF(D73=\"\",\"\",(VLOOKUP(D73,'Membership #'!$A$1:$C$1005,3,0)))","v":""},null,null,{"$f":"IF(G73=\"n\",\"No Time\",IF(G73=\"x\",\"Scratch\",IF(G73<>\"\",SUM(G73+H73),\"\")))","v":""}]
["","","",null,{"$f":"IF(D74=\"\",\"\",(VLOOKUP(D74,'Membership #'!$A$1:$C$1005,2,0)))","v":""},{"$f":"IF(D74=\"\",\"\",(VLOOKUP(D74,'Membership #'!$A$1:$C$1005,3,0)))","v":""},null,null,""]
["","","",null,{"$f":"IF(D75=\"\",\"\",(VLOOKUP(D75,'Membership #'!$A$1:$C$1005,2,0)))","v":""},{"$f":"IF(D75=\"\",\"\",(VLOOKUP(D75,'Membership #'!$A$1:$C$1005,3,0)))","v":""},null,null,""]
["","","",null,{"$f":"IF(D76=\"\",\"\",(VLOOKUP(D76,'Membership #'!$A$1:$C$1005,2,0)))","v":""},{"$f":"IF(D76=\"\",\"\",(VLOOKUP(D76,'Membership #'!$A$1:$C$1005,3,0)))","v":""},null,null,""]
["","","",null,{"$f":"IF(D77=\"\",\"\",(VLOOKUP(D77,'Membership #'!$A$1:$C$1005,2,0)))","v":""},{"$f":"IF(D77=\"\",\"\",(VLOOKUP(D77,'Membership #'!$A$1:$C$1005,3,0)))","v":""},null,null,""]
["","","",null,{"$f":"IF(D78=\"\",\"\",(VLOOKUP(D78,'Membership #'!$A$1:$C$1005,2,0)))","v":""},{"$f":"IF(D78=\"\",\"\",(VLOOKUP(D78,'Membership #'!$A$1:$C$1005,3,0)))","v":""},null,null,""]
["","","",null,{"$f":"IF(D79=\"\",\"\",(VLOOKUP(D79,'Membership #'!$A$1:$C$1005,2,0)))","v":""},{"$f":"IF(D79=\"\",\"\",(VLOOKUP(D79,'Membership #'!$A$1:$C$1005,3,0)))","v":""},null,null,""]
["","","",null,{"$f":"IF(D80=\"\",\"\",(VLOOKUP(D80,'Membership #'!$A$1:$C$1005,2,0)))","v":""},{"$f":"IF(D80=\"\",\"\",(VLOOKUP(D80,'Membership #'!$A$1:$C$1005,3,0)))","v":""},null,null,""]
["","","",null,{"$f":"IF(D81=\"\",\"\",(VLOOKUP(D81,'Membership #'!$A$1:$C$1005,2,0)))","v":""},{"$f":"IF(D81=\"\",\"\",(VLOOKUP(D81,'Membership #'!$A$1:$C$1005,3,0)))","v":""},null,null,""]
["","","",null,{"$f":"IF(D82=\"\",\"\",(VLOOKUP(D82,'Membership #'!$A$1:$C$1005,2,0)))","v":""},{"$f":"IF(D82=\"\",\"\",(VLOOKUP(D82,'Membership #'!$A$1:$C$1005,3,0)))","v":""},null,null,""]
["","","",null,{"$f":"IF(D83=\"\",\"\",(VLOOKUP(D83,'Membership #'!$A$1:$C$1005,2,0)))","v":""},{"$f":"IF(D83=\"\",\"\",(VLOOKUP(D83,'Membership #'!$A$1:$C$1005,3,0)))","v":""},null,null,""]
["","","",null,{"$f":"IF(D84=\"\",\"\",(VLOOKUP(D84,'Membership #'!$A$1:$C$1005,2,0)))","v":""},{"$f":"IF(D84=\"\",\"\",(VLOOKUP(D84,'Membership #'!$A$1:$C$1005,3,0)))","v":""},null,null,""]
["","","",null,{"$f":"IF(D85=\"\",\"\",(VLOOKUP(D85,'Membership #'!$A$1:$C$1005,2,0)))","v":""},{"$f":"IF(D85=\"\",\"\",(VLOOKUP(D85,'Membership #'!$A$1:$C$1005,3,0)))","v":""},null,null,""]
["","","",null,{"$f":"IF(D86=\"\",\"\",(VLOOKUP(D86,'Membership #'!$A$1:$C$1005,2,0)))","v":""},{"$f":"IF(D86=\"\",\"\",(VLOOKUP(D86,'Membership #'!$A$1:$C$1005,3,0)))","v":""},null,null,""]
["","","",null,{"$f":"IF(D87=\"\",\"\",(VLOOKUP(D87,'Membership #'!$A$1:$C$1005,2,0)))","v":""},{"$f":"IF(D87=\"\",\"\",(VLOOKUP(D87,'Membership #'!$A$1:$C$1005,3,0)))","v":""},null,null,""]
["","","",null,{"$f":"IF(D88=\"\",\"\",(VLOOKUP(D88,'Membership #'!$A$1:$C$1005,2,0)))","v":""},{"$f":"IF(D88=\"\",\"\",(VLOOKUP(D88,'Membership #'!$A$1:$C$1005,3,0)))","v":""},null,null,""]
["","","",null,{"$f":"IF(D89=\"\",\"\",(VLOOKUP(D89,'Membership #'!$A$1:$C$1005,2,0)))","v":""},{"$f":"IF(D89=\"\",\"\",(VLOOKUP(D89,'Membership #'!$A$1:$C$1005,3,0)))","v":""},null,null,""]
["","","",null,{"$f":"IF(D90=\"\",\"\",(VLOOKUP(D90,'Membership #'!$A$1:$C$1005,2,0)))","v":""},{"$f":"IF(D90=\"\",\"\",(VLOOKUP(D90,'Membership #'!$A$1:$C$1005,3,0)))","v":""},null,null,""]
["","","",null,{"$f":"IF(D91=\"\",\"\",(VLOOKUP(D91,'Membership #'!$A$1:$C$1005,2,0)))","v":""},{"$f":"IF(D91=\"\",\"\",(VLOOKUP(D91,'Membership #'!$A$1:$C$1005,3,0)))","v":""},null,null,""]
["","","",null,{"$f":"IF(D92=\"\",\"\",(VLOOKUP(D92,'Membership #'!$A$1:$C$1005,2,0)))","v":""},{"$f":"IF(D92=\"\",\"\",(VLOOKUP(D92,'Membership #'!$A$1:$C$1005,3,0)))","v":""},null,null,""]
["","","",null,{"$f":"IF(D93=\"\",\"\",(VLOOKUP(D93,'Membership #'!$A$1:$C$1005,2,0)))","v":""},{"$f":"IF(D93=\"\",\"\",(VLOOKUP(D93,'Membership #'!$A$1:$C$1005,3,0)))","v":""},null,null,""]
["","","",null,{"$f":"IF(D94=\"\",\"\",(VLOOKUP(D94,'Membership #'!$A$1:$C$1005,2,0)))","v":""},{"$f":"IF(D94=\"\",\"\",(VLOOKUP(D94,'Membership #'!$A$1:$C$1005,3,0)))","v":""},null,null,""]
["","","",null,{"$f":"IF(D95=\"\",\"\",(VLOOKUP(D95,'Membership #'!$A$1:$C$1005,2,0)))","v":""},{"$f":"IF(D95=\"\",\"\",(VLOOKUP(D95,'Membership #'!$A$1:$C$1005,3,0)))","v":""},null,null,""]
["","","",null,{"$f":"IF(D96=\"\",\"\",(VLOOKUP(D96,'Membership #'!$A$1:$C$1005,2,0)))","v":""},{"$f":"IF(D96=\"\",\"\",(VLOOKUP(D96,'Membership #'!$A$1:$C$1005,3,0)))","v":""},null,null,""]
["","","",null,{"$f":"IF(D97=\"\",\"\",(VLOOKUP(D97,'Membership #'!$A$1:$C$1005,2,0)))","v":""},{"$f":"IF(D97=\"\",\"\",(VLOOKUP(D97,'Membership #'!$A$1:$C$1005,3,0)))","v":""},null,null,""]
["","","",null,{"$f":"IF(D98=\"\",\"\",(VLOOKUP(D98,'Membership #'!$A$1:$C$1005,2,0)))","v":""},{"$f":"IF(D98=\"\",\"\",(VLOOKUP(D98,'Membership #'!$A$1:$C$1005,3,0)))","v":""},null,null,""]
["","","",null,{"$f":"IF(D99=\"\",\"\",(VLOOKUP(D99,'Membership #'!$A$1:$C$1005,2,0)))","v":""},{"$f":"IF(D99=\"\",\"\",(VLOOKUP(D99,'Membership #'!$A$1:$C$1005,3,0)))","v":""},null,null,""]
["","","",null,{"$f":"IF(D100=\"\",\"\",(VLOOKUP(D100,'Membership #'!$A$1:$C$1005,2,0)))","v":""},{"$f":"IF(D100=\"\",\"\",(VLOOKUP(D100,'Membership #'!$A$1:$C$1005,3,0)))","v":""},null,null,""]
["","","",null,{"$f":"IF(D101=\"\",\"\",(VLOOKUP(D101,'Membership #'!$A$1:$C$1005,2,0)))","v":""},{"$f":"IF(D101=\"\",\"\",(VLOOKUP(D101,'Membership #'!$A$1:$C$1005,3,0)))","v":""},null,null,""]

{"sheet":"Adult Green Barrels","index":8,"n_rows":101,"n_cols":26,"rows_kept":101,"cut":false,"hidden":false,"merged":[[5,12,5,15],[0,0,0,10],[1,0,1,10],[2,0,2,3],[2,6,2,10],[3,0,6,0],[3,1,6,1],[3,2,6,2],[3,3,6,3],[3,4,6,4],[3,9,6,9],[3,10,6,10],[3,5,6,5],[3,6,6,6],[3,7,6,7],[3,8,6,8]]}
["Tom Burt & Mark McGuire Memorial Jackpot Aug 21, 2021",null,null,null,null,null,null,null,null,null,null,null,"x=Scratch"]
["Adult Green Barrels ",null,null,null,null,null,null,null,null,null,null,null,"n=No Time"]
["# Enteries:",null,null,null,{"$f":"COUNTIF($D$8:$D$100,\">0\")","v":1},null,null,null,null,null,null,null,null,null,null,null,null,"Don't Erase these numbers below!!"]
["Rand Draw","Seed",null,"RING #      ","NAME","HORSE NAME","TIME","PENALTY ","TOTAL","PLACINGS","POINTS",null,null,null,null,null,null,{"$f":"IF(N9=2,7,IF(N9=3,6,IF(N9=4,5,IF(N9=5,4,IF(AND(N9>5,N11>600),3,IF(AND(N9>5,N11<600,N11>299.99),2,IF(AND(N9>5,N11<300),1,8)))))))","v":7},1,2,3,4,5,6,7,8]
[null,null,null,null,null,null,null,null,null,null,null,null,null,null,null,null,null,null,299,"$300-","$600 -"]
[null,null,null,null,null,null,null,null,null,null,null,null,"Adult Green Barrels ",null,null,null,null,null,"or less",599,"More","5 Entries","4 Entries","3 Entries","2 Entries"]
[null,null,null,null,null,null,null,null,null,null,null,null,null,null,null,null,null,"1st",0.32,0.27,0.24,0.35,0.4,0.46,0.6]
[{"$f":"IF(D8<>\"\",RAND(),\"\")","v":0.50374246154618885},{"$f":"IF(D8<>\"\",RANK(A8,A$8:A$101),\"\")","v":1},1,"909b",{"$f":"IF(D8=\"\",\"\",(VLOOKUP(D8,'Membership #'!$A$1:$C$1005,2,0)))","v":"Bryden MacNeil"},{"$f":"IF(D8=\"\",\"\",(VLOOKUP(D8,'Membership #'!$A$1:$C$1005,3,0)))","v":"Martha's Tivio Moon"},19.414000000000001,null,{"$f":"IF(G8=\"n\",\"No Time\",IF(G8=\"x\",\"Scratch\",IF(G8<>\"\",SUM(G8+H8),\"\")))","v":19.414000000000001},1,null,null,"Added",25,null,null,null,"2nd",0.23,0.22,0.19,0.25,0.28000000000000003,0.34,0.4]
[{"$f":"IF(M26<>\"\",RAND(),\"\")","v":""},{"$f":"IF(M26<>\"\",RANK(A9,A$8:A$101),\"\")","v":""},2,969,{"$f":"IF(D9=\"\",\"\",(VLOOKUP(D9,'Membership #'!$A$1:$C$1005,2,0)))","v":"Kenzie Cook"},{"$f":"IF(D9=\"\",\"\",(VLOOKUP(D9,'Membership #'!$A$1:$C$1005,3,0)))","v":"Pocos Lady Emeralda"},27.582000000000001,null,{"$f":"IF(G9=\"n\",\"No Time\",IF(G9=\"x\",\"Scratch\",IF(G9<>\"\",SUM(G9+H9),\"\")))","v":27.582000000000001},2,null,null,"Entries",2,null,10,"per head","3rd",0.15,0.18,0.16,0.17,0.18,0.2]
[{"$f":"IF(M27<>\"\",RAND(),\"\")","v":""},{"$f":"IF(M27<>\"\",RANK(A10,A$8:A$101),\"\")","v":""},3,null,{"$f":"IF(D10=\"\",\"\",(VLOOKUP(D10,'Membership #'!$A$1:$C$1005,2,0)))","v":""},{"$f":"IF(D10=\"\",\"\",(VLOOKUP(D10,'Membership #'!$A$1:$C$1005,3,0)))","v":""},null,null,{"$f":"IF(G10=\"n\",\"No Time\",IF(G10=\"x\",\"Scratch\",IF(G10<>\"\",SUM(G10+H10),\"\")))","v":""},null,null,null,"Jackpot",{"$f":"P9*N9","v":20},null,0.85,"payback","4th",0.12,0.13,0.13,0.13,0.14000000000000001]
["","",null,null,{"$f":"IF(D11=\"\",\"\",(VLOOKUP(D11,'Membership #'!$A$1:$C$1005,2,0)))","v":""},{"$f":"IF(D11=\"\",\"\",(VLOOKUP(D11,'Membership #'!$A$1:$C$1005,3,0)))","v":""},null,null,{"$f":"IF(G11=\"n\",\"No Time\",IF(G11=\"x\",\"Scratch\",IF(G11<>\"\",SUM(G11+H11),\"\")))","v":""},null,null,null,"Total Money",{"$f":"N8+(N10*P10)","v":42},null,{"$f":"N10*P10","v":17},"Jackpot","5th",0.1,0.09,0.08,0.1]
["","","",null,{"$f":"IF(D12=\"\",\"\",(VLOOKUP(D12,'Membership #'!$A$1:$C$1005,2,0)))","v":""},{"$f":"IF(D12=\"\",\"\",(VLOOKUP(D12,'Membership #'!$A$1:$C$1005,3,0)))","v":""},null,null,{"$f":"IF(G12=\"n\",\"No Time\",IF(G12=\"x\",\"Scratch\",IF(G12<>\"\",SUM(G12+H12),\"\")))","v":""},null,null,null,null,"Percentage","Money","Ring #",null,"6th",0.08,0.06,0.06]
["","","",null,{"$f":"IF(D13=\"\",\"\",(VLOOKUP(D13,'Membership #'!$A$1:$C$1005,2,0)))","v":""},{"$f":"IF(D13=\"\",\"\",(VLOOKUP(D13,'Membership #'!$A$1:$C$1005,3,0)))","v":""},null,null,{"$f":"IF(G13=\"n\",\"No Time\",IF(G13=\"x\",\"Scratch\",IF(G13<>\"\",SUM(G13+H13),\"\")))","v":""},null,null,null,"1st",1,{"$f":"IF(N13<>0,N$11*N13,\"\")","v":42},null,{"$f":"IF(P13=\"\",\"\",(VLOOKUP(P13,'Membership #'!$A$1:$C$1005,2,0)))","v":""},"7th",null,0.03,0.05]
["","","",null,{"$f":"IF(D14=\"\",\"\",(VLOOKUP(D14,'Membership #'!$A$1:$C$1005,2,0)))","v":""},{"$f":"IF(D14=\"\",\"\",(VLOOKUP(D14,'Membership #'!$A$1:$C$1005,3,0)))","v":""},null,null,"",null,null,null,"2nd",null,"",null,{"$f":"IF(P14=\"\",\"\",(VLOOKUP(P14,'Membership #'!$A$1:$C$1005,2,0)))","v":""},"8th",null,0.02,0.04]
["","","",null,{"$f":"IF(D15=\"\",\"\",(VLOOKUP(D15,'Membership #'!$A$1:$C$1005,2,0)))","v":""},{"$f":"IF(D15=\"\",\"\",(VLOOKUP(D15,'Membership #'!$A$1:$C$1005,3,0)))","v":""},null,null,{"$f":"IF(G15=\"n\",\"No Time\",IF(G15=\"x\",\"Scratch\",IF(G15<>\"\",SUM(G15+H15),\"\")))","v":""},null,null,null,"3rd",null,"",null,{"$f":"IF(P15=\"\",\"\",(VLOOKUP(P15,'Membership #'!$A$1:$C$1005,2,0)))","v":""},"9th",null,null,0.03]
["","","",null,{"$f":"IF(D16=\"\",\"\",(VLOOKUP(D16,'Membership #'!$A$1:$C$1005,2,0)))","v":""},{"$f":"IF(D16=\"\",\"\",(VLOOKUP(D16,'Membership #'!$A$1:$C$1005,3,0)))","v":""},null,null,{"$f":"IF(G16=\"n\",\"No Time\",IF(G16=\"x\",\"Scratch\",IF(G16<>\"\",SUM(G16+H16),\"\")))","v":""},null,null,null,"4th",null,"",null,{"$f":"IF(P16=\"\",\"\",(VLOOKUP(P16,'Membership #'!$A$1:$C$1005,2,0)))","v":""},"10th",null,null,0.02]
["","","",null,{"$f":"IF(D17=\"\",\"\",(VLOOKUP(D17,'Membership #'!$A$1:$C$1005,2,0)))","v":""},{"$f":"IF(D17=\"\",\"\",(VLOOKUP(D17,'Membership #'!$A$1:$C$1005,3,0)))","v":""},null,null,{"$f":"IF(G17=\"n\",\"No Time\",IF(G17=\"x\",\"Scratch\",IF(G17<>\"\",SUM(G17+H17),\"\")))","v":""},null,null,null,"5th",null,"",null,{"$f":"IF(P17=\"\",\"\",(VLOOKUP(P17,'Membership #'!$A$1:$C$1005,2,0)))","v":""}]
["","","",null,{"$f":"IF(D18=\"\",\"\",(VLOOKUP(D18,'Membership #'!$A$1:$C$1005,2,0)))","v":""},{"$f":"IF(D18=\"\",\"\",(VLOOKUP(D18,'Membership #'!$A$1:$C$1005,3,0)))","v":""},null,null,{"$f":"IF(G18=\"n\",\"No Time\",IF(G18=\"x\",\"Scratch\",IF(G18<>\"\",SUM(G18+H18),\"\")))","v":""},null,null,null,"6th",null,"",null,{"$f":"IF(P18=\"\",\"\",(VLOOKUP(P18,'Membership #'!$A$1:$C$1005,2,0)))","v":""}]
["","","",null,{"$f":"IF(D19=\"\",\"\",(VLOOKUP(D19,'Membership #'!$A$1:$C$1005,2,0)))","v":""},{"$f":"IF(D19=\"\",\"\",(VLOOKUP(D19,'Membership #'!$A$1:$C$1005,3,0)))","v":""},null,null,"",null,null,null,"7th",null,"",null,{"$f":"IF(P19=\"\",0,(VLOOKUP(P19,'Membership #'!$A$1:$C$1005,2,0)))","v":0}]
["","","",null,{"$f":"IF(D20=\"\",\"\",(VLOOKUP(D20,'Membership #'!$A$1:$C$1005,2,0)))","v":""},{"$f":"IF(D20=\"\",\"\",(VLOOKUP(D20,'Membership #'!$A$1:$C$1005,3,0)))","v":""},null,null,"",null,null,null,"8th",null,"",null,{"$f":"IF(P20=\"\",0,(VLOOKUP(P20,'Membership #'!$A$1:$C$1005,2,0)))","v":0}]
["","","",null,{"$f":"IF(D21=\"\",\"\",(VLOOKUP(D21,'Membership #'!$A$1:$C$1005,2,0)))","v":""},{"$f":"IF(D21=\"\",\"\",(VLOOKUP(D21,'Membership #'!$A$1:$C$1005,3,0)))","v":""},null,null,"",null,null,null,"9th",null,""]
["","","",null,{"$f":"IF(D22=\"\",\"\",(VLOOKUP(D22,'Membership #'!$A$1:$C$1005,2,0)))","v":""},{"$f":"IF(D22=\"\",\"\",(VLOOKUP(D22,'Membership #'!$A$1:$C$1005,3,0)))","v":""},null,null,"",null,null,null,"10th",{"$f":"HLOOKUP($R$4,$S$4:$Z$17,13,0)","v":0},""]
["","","",null,{"$f":"IF(D23=\"\",\"\",(VLOOKUP(D23,'Membership #'!$A$1:$C$1005,2,0)))","v":""},{"$f":"IF(D23=\"\",\"\",(VLOOKUP(D23,'Membership #'!$A$1:$C$1005,3,0)))","v":""},null,null,"",null,null,null,"Total Money",null,{"$f":"SUM(O13:O22)","v":42}]
["","","",null,{"$f":"IF(D24=\"\",\"\",(VLOOKUP(D24,'Membership #'!$A$1:$C$1005,2,0)))","v":""},{"$f":"IF(D24=\"\",\"\",(VLOOKUP(D24,'Membership #'!$A$1:$C$1005,3,0)))","v":""},null,null,""]
["","","",null,{"$f":"IF(D25=\"\",\"\",(VLOOKUP(D25,'Membership #'!$A$1:$C$1005,2,0)))","v":""},{"$f":"IF(D25=\"\",\"\",(VLOOKUP(D25,'Membership #'!$A$1:$C$1005,3,0)))","v":""},null,null,""]
["","","",null,{"$f":"IF(D26=\"\",\"\",(VLOOKUP(D26,'Membership #'!$A$1:$C$1005,2,0)))","v":""},{"$f":"IF(D26=\"\",\"\",(VLOOKUP(D26,'Membership #'!$A$1:$C$1005,3,0)))","v":""},null,null,"",null,null,null,null,"Terry Cole"]
["","","",null,{"$f":"IF(D27=\"\",\"\",(VLOOKUP(D27,'Membership #'!$A$1:$C$1005,2,0)))","v":""},{"$f":"IF(D27=\"\",\"\",(VLOOKUP(D27,'Membership #'!$A$1:$C$1005,3,0)))","v":""},null,null,""]
["","","",null,{"$f":"IF(D28=\"\",\"\",(VLOOKUP(D28,'Membership #'!$A$1:$C$1005,2,0)))","v":""},{"$f":"IF(D28=\"\",\"\",(VLOOKUP(D28,'Membership #'!$A$1:$C$1005,3,0)))","v":""},null,null,""]
["","","",null,{"$f":"IF(D29=\"\",\"\",(VLOOKUP(D29,'Membership #'!$A$1:$C$1005,2,0)))","v":""},{"$f":"IF(D29=\"\",\"\",(VLOOKUP(D29,'Membership #'!$A$1:$C$1005,3,0)))","v":""},null,null,""]
["","","",null,{"$f":"IF(D30=\"\",\"\",(VLOOKUP(D30,'Membership #'!$A$1:$C$1005,2,0)))","v":""},{"$f":"IF(D30=\"\",\"\",(VLOOKUP(D30,'Membership #'!$A$1:$C$1005,3,0)))","v":""},null,null,""]
["","","",null,{"$f":"IF(D31=\"\",\"\",(VLOOKUP(D31,'Membership #'!$A$1:$C$1005,2,0)))","v":""},{"$f":"IF(D31=\"\",\"\",(VLOOKUP(D31,'Membership #'!$A$1:$C$1005,3,0)))","v":""},null,null,""]
["","","",null,{"$f":"IF(D32=\"\",\"\",(VLOOKUP(D32,'Membership #'!$A$1:$C$1005,2,0)))","v":""},{"$f":"IF(D32=\"\",\"\",(VLOOKUP(D32,'Membership #'!$A$1:$C$1005,3,0)))","v":""},null,null,""]
["","","",null,{"$f":"IF(D33=\"\",\"\",(VLOOKUP(D33,'Membership #'!$A$1:$C$1005,2,0)))","v":""},{"$f":"IF(D33=\"\",\"\",(VLOOKUP(D33,'Membership #'!$A$1:$C$1005,3,0)))","v":""},null,null,""]
["","","",null,{"$f":"IF(D34=\"\",\"\",(VLOOKUP(D34,'Membership #'!$A$1:$C$1005,2,0)))","v":""},{"$f":"IF(D34=\"\",\"\",(VLOOKUP(D34,'Membership #'!$A$1:$C$1005,3,0)))","v":""},null,null,""]
["","","",null,{"$f":"IF(D35=\"\",\"\",(VLOOKUP(D35,'Membership #'!$A$1:$C$1005,2,0)))","v":""},{"$f":"IF(D35=\"\",\"\",(VLOOKUP(D35,'Membership #'!$A$1:$C$1005,3,0)))","v":""},null,null,""]
["","","",null,{"$f":"IF(D36=\"\",\"\",(VLOOKUP(D36,'Membership #'!$A$1:$C$1005,2,0)))","v":""},{"$f":"IF(D36=\"\",\"\",(VLOOKUP(D36,'Membership #'!$A$1:$C$1005,3,0)))","v":""},null,null,""]
["","","",null,{"$f":"IF(D37=\"\",\"\",(VLOOKUP(D37,'Membership #'!$A$1:$C$1005,2,0)))","v":""},{"$f":"IF(D37=\"\",\"\",(VLOOKUP(D37,'Membership #'!$A$1:$C$1005,3,0)))","v":""},null,null,""]
["","","",null,{"$f":"IF(D38=\"\",\"\",(VLOOKUP(D38,'Membership #'!$A$1:$C$1005,2,0)))","v":""},{"$f":"IF(D38=\"\",\"\",(VLOOKUP(D38,'Membership #'!$A$1:$C$1005,3,0)))","v":""},null,null,""]
["","","",null,{"$f":"IF(D39=\"\",\"\",(VLOOKUP(D39,'Membership #'!$A$1:$C$1005,2,0)))","v":""},{"$f":"IF(D39=\"\",\"\",(VLOOKUP(D39,'Membership #'!$A$1:$C$1005,3,0)))","v":""},null,null,""]
["","","",null,{"$f":"IF(D40=\"\",\"\",(VLOOKUP(D40,'Membership #'!$A$1:$C$1005,2,0)))","v":""},{"$f":"IF(D40=\"\",\"\",(VLOOKUP(D40,'Membership #'!$A$1:$C$1005,3,0)))","v":""},null,null,""]
["","","",null,{"$f":"IF(D41=\"\",\"\",(VLOOKUP(D41,'Membership #'!$A$1:$C$1005,2,0)))","v":""},{"$f":"IF(D41=\"\",\"\",(VLOOKUP(D41,'Membership #'!$A$1:$C$1005,3,0)))","v":""},null,null,""]
["","","",null,{"$f":"IF(D42=\"\",\"\",(VLOOKUP(D42,'Membership #'!$A$1:$C$1005,2,0)))","v":""},{"$f":"IF(D42=\"\",\"\",(VLOOKUP(D42,'Membership #'!$A$1:$C$1005,3,0)))","v":""},null,null,""]
["","","",null,{"$f":"IF(D43=\"\",\"\",(VLOOKUP(D43,'Membership #'!$A$1:$C$1005,2,0)))","v":""},{"$f":"IF(D43=\"\",\"\",(VLOOKUP(D43,'Membership #'!$A$1:$C$1005,3,0)))","v":""},null,null,""]
["","","",null,{"$f":"IF(D44=\"\",\"\",(VLOOKUP(D44,'Membership #'!$A$1:$C$1005,2,0)))","v":""},{"$f":"IF(D44=\"\",\"\",(VLOOKUP(D44,'Membership #'!$A$1:$C$1005,3,0)))","v":""},null,null,""]
["","","",null,{"$f":"IF(D45=\"\",\"\",(VLOOKUP(D45,'Membership #'!$A$1:$C$1005,2,0)))","v":""},{"$f":"IF(D45=\"\",\"\",(VLOOKUP(D45,'Membership #'!$A$1:$C$1005,3,0)))","v":""},null,null,""]
["","","",null,{"$f":"IF(D46=\"\",\"\",(VLOOKUP(D46,'Membership #'!$A$1:$C$1005,2,0)))","v":""},{"$f":"IF(D46=\"\",\"\",(VLOOKUP(D46,'Membership #'!$A$1:$C$1005,3,0)))","v":""},null,null,""]
["","","",null,{"$f":"IF(D47=\"\",\"\",(VLOOKUP(D47,'Membership #'!$A$1:$C$1005,2,0)))","v":""},{"$f":"IF(D47=\"\",\"\",(VLOOKUP(D47,'Membership #'!$A$1:$C$1005,3,0)))","v":""},null,null,""]
["","","",null,{"$f":"IF(D48=\"\",\"\",(VLOOKUP(D48,'Membership #'!$A$1:$C$1005,2,0)))","v":""},{"$f":"IF(D48=\"\",\"\",(VLOOKUP(D48,'Membership #'!$A$1:$C$1005,3,0)))","v":""},null,null,""]
["","","",null,{"$f":"IF(D49=\"\",\"\",(VLOOKUP(D49,'Membership #'!$A$1:$C$1005,2,0)))","v":""},{"$f":"IF(D49=\"\",\"\",(VLOOKUP(D49,'Membership #'!$A$1:$C$1005,3,0)))","v":""},null,null,""]
["","","",null,{"$f":"IF(D50=\"\",\"\",(VLOOKUP(D50,'Membership #'!$A$1:$C$1005,2,0)))","v":""},{"$f":"IF(D50=\"\",\"\",(VLOOKUP(D50,'Membership #'!$A$1:$C$1005,3,0)))","v":""},null,null,""]
["","","",null,{"$f":"IF(D51=\"\",\"\",(VLOOKUP(D51,'Membership #'!$A$1:$C$1005,2,0)))","v":""},{"$f":"IF(D51=\"\",\"\",(VLOOKUP(D51,'Membership #'!$A$1:$C$1005,3,0)))","v":""},null,null,""]
["","","",null,{"$f":"IF(D52=\"\",\"\",(VLOOKUP(D52,'Membership #'!$A$1:$C$1005,2,0)))","v":""},{"$f":"IF(D52=\"\",\"\",(VLOOKUP(D52,'Membership #'!$A$1:$C$1005,3,0)))","v":""},null,null,""]
["","","",null,{"$f":"IF(D53=\"\",\"\",(VLOOKUP(D53,'Membership #'!$A$1:$C$1005,2,0)))","v":""},{"$f":"IF(D53=\"\",\"\",(VLOOKUP(D53,'Membership #'!$A$1:$C$1005,3,0)))","v":""},null,null,""]
["","","",null,{"$f":"IF(D54=\"\",\"\",(VLOOKUP(D54,'Membership #'!$A$1:$C$1005,2,0)))","v":""},{"$f":"IF(D54=\"\",\"\",(VLOOKUP(D54,'Membership #'!$A$1:$C$1005,3,0)))","v":""},null,null,""]
["","","",null,{"$f":"IF(D55=\"\",\"\",(VLOOKUP(D55,'Membership #'!$A$1:$C$1005,2,0)))","v":""},{"$f":"IF(D55=\"\",\"\",(VLOOKUP(D55,'Membership #'!$A$1:$C$1005,3,0)))","v":""},null,null,""]
["","","",null,{"$f":"IF(D56=\"\",\"\",(VLOOKUP(D56,'Membership #'!$A$1:$C$1005,2,0)))","v":""},{"$f":"IF(D56=\"\",\"\",(VLOOKUP(D56,'Membership #'!$A$1:$C$1005,3,0)))","v":""},null,null,""]
["","","",null,{"$f":"IF(D57=\"\",\"\",(VLOOKUP(D57,'Membership #'!$A$1:$C$1005,2,0)))","v":""},{"$f":"IF(D57=\"\",\"\",(VLOOKUP(D57,'Membership #'!$A$1:$C$1005,3,0)))","v":""},null,null,""]
["","","",null,{"$f":"IF(D58=\"\",\"\",(VLOOKUP(D58,'Membership #'!$A$1:$C$1005,2,0)))","v":""},{"$f":"IF(D58=\"\",\"\",(VLOOKUP(D58,'Membership #'!$A$1:$C$1005,3,0)))","v":""},null,null,""]
["","","",null,{"$f":"IF(D59=\"\",\"\",(VLOOKUP(D59,'Membership #'!$A$1:$C$1005,2,0)))","v":""},{"$f":"IF(D59=\"\",\"\",(VLOOKUP(D59,'Membership #'!$A$1:$C$1005,3,0)))","v":""},null,null,""]
["","","",null,{"$f":"IF(D60=\"\",\"\",(VLOOKUP(D60,'Membership #'!$A$1:$C$1005,2,0)))","v":""},{"$f":"IF(D60=\"\",\"\",(VLOOKUP(D60,'Membership #'!$A$1:$C$1005,3,0)))","v":""},null,null,""]
["","","",null,{"$f":"IF(D61=\"\",\"\",(VLOOKUP(D61,'Membership #'!$A$1:$C$1005,2,0)))","v":""},{"$f":"IF(D61=\"\",\"\",(VLOOKUP(D61,'Membership #'!$A$1:$C$1005,3,0)))","v":""},null,null,""]
["","","",null,{"$f":"IF(D62=\"\",\"\",(VLOOKUP(D62,'Membership #'!$A$1:$C$1005,2,0)))","v":""},{"$f":"IF(D62=\"\",\"\",(VLOOKUP(D62,'Membership #'!$A$1:$C$1005,3,0)))","v":""},null,null,""]
["","","",null,{"$f":"IF(D63=\"\",\"\",(VLOOKUP(D63,'Membership #'!$A$1:$C$1005,2,0)))","v":""},{"$f":"IF(D63=\"\",\"\",(VLOOKUP(D63,'Membership #'!$A$1:$C$1005,3,0)))","v":""},null,null,""]
["","","",null,{"$f":"IF(D64=\"\",\"\",(VLOOKUP(D64,'Membership #'!$A$1:$C$1005,2,0)))","v":""},{"$f":"IF(D64=\"\",\"\",(VLOOKUP(D64,'Membership #'!$A$1:$C$1005,3,0)))","v":""},null,null,""]
["","","",null,{"$f":"IF(D65=\"\",\"\",(VLOOKUP(D65,'Membership #'!$A$1:$C$1005,2,0)))","v":""},{"$f":"IF(D65=\"\",\"\",(VLOOKUP(D65,'Membership #'!$A$1:$C$1005,3,0)))","v":""},null,null,""]
["","","",null,{"$f":"IF(D66=\"\",\"\",(VLOOKUP(D66,'Membership #'!$A$1:$C$1005,2,0)))","v":""},{"$f":"IF(D66=\"\",\"\",(VLOOKUP(D66,'Membership #'!$A$1:$C$1005,3,0)))","v":""},null,null,""]
["","","",null,{"$f":"IF(D67=\"\",\"\",(VLOOKUP(D67,'Membership #'!$A$1:$C$1005,2,0)))","v":""},{"$f":"IF(D67=\"\",\"\",(VLOOKUP(D67,'Membership #'!$A$1:$C$1005,3,0)))","v":""},null,null,""]
["","","",null,{"$f":"IF(D68=\"\",\"\",(VLOOKUP(D68,'Membership #'!$A$1:$C$1005,2,0)))","v":""},{"$f":"IF(D68=\"\",\"\",(VLOOKUP(D68,'Membership #'!$A$1:$C$1005,3,0)))","v":""},null,null,""]
["","","",null,{"$f":"IF(D69=\"\",\"\",(VLOOKUP(D69,'Membership #'!$A$1:$C$1005,2,0)))","v":""},{"$f":"IF(D69=\"\",\"\",(VLOOKUP(D69,'Membership #'!$A$1:$C$1005,3,0)))","v":""},null,null,""]
["","","",null,{"$f":"IF(D70=\"\",\"\",(VLOOKUP(D70,'Membership #'!$A$1:$C$1005,2,0)))","v":""},{"$f":"IF(D70=\"\",\"\",(VLOOKUP(D70,'Membership #'!$A$1:$C$1005,3,0)))","v":""},null,null,""]
["","","",null,{"$f":"IF(D71=\"\",\"\",(VLOOKUP(D71,'Membership #'!$A$1:$C$1005,2,0)))","v":""},{"$f":"IF(D71=\"\",\"\",(VLOOKUP(D71,'Membership #'!$A$1:$C$1005,3,0)))","v":""},null,null,""]
[{"$f":"IF(D72<>\"\",RAND(),\"\")","v":""},{"$f":"IF(D72<>\"\",RANK(A72,A$8:A$101),\"\")","v":""},"",null,{"$f":"IF(D72=\"\",\"\",(VLOOKUP(D72,'Membership #'!$A$1:$C$1005,2,0)))","v":""},{"$f":"IF(D72=\"\",\"\",(VLOOKUP(D72,'Membership #'!$A$1:$C$1005,3,0)))","v":""},null,null,""]
["","","",null,{"$f":"IF(D73=\"\",\"\",(VLOOKUP(D73,'Membership #'!$A$1:$C$1005,2,0)))","v":""},{"$f":"IF(D73=\"\",\"\",(VLOOKUP(D73,'Membership #'!$A$1:$C$1005,3,0)))","v":""},null,null,{"$f":"IF(G73=\"n\",\"No Time\",IF(G73=\"x\",\"Scratch\",IF(G73<>\"\",SUM(G73+H73),\"\")))","v":""}]
["","","",null,{"$f":"IF(D74=\"\",\"\",(VLOOKUP(D74,'Membership #'!$A$1:$C$1005,2,0)))","v":""},{"$f":"IF(D74=\"\",\"\",(VLOOKUP(D74,'Membership #'!$A$1:$C$1005,3,0)))","v":""},null,null,""]
["","","",null,{"$f":"IF(D75=\"\",\"\",(VLOOKUP(D75,'Membership #'!$A$1:$C$1005,2,0)))","v":""},{"$f":"IF(D75=\"\",\"\",(VLOOKUP(D75,'Membership #'!$A$1:$C$1005,3,0)))","v":""},null,null,""]
["","","",null,{"$f":"IF(D76=\"\",\"\",(VLOOKUP(D76,'Membership #'!$A$1:$C$1005,2,0)))","v":""},{"$f":"IF(D76=\"\",\"\",(VLOOKUP(D76,'Membership #'!$A$1:$C$1005,3,0)))","v":""},null,null,""]
["","","",null,{"$f":"IF(D77=\"\",\"\",(VLOOKUP(D77,'Membership #'!$A$1:$C$1005,2,0)))","v":""},{"$f":"IF(D77=\"\",\"\",(VLOOKUP(D77,'Membership #'!$A$1:$C$1005,3,0)))","v":""},null,null,""]
["","","",null,{"$f":"IF(D78=\"\",\"\",(VLOOKUP(D78,'Membership #'!$A$1:$C$1005,2,0)))","v":""},{"$f":"IF(D78=\"\",\"\",(VLOOKUP(D78,'Membership #'!$A$1:$C$1005,3,0)))","v":""},null,null,""]
["","","",null,{"$f":"IF(D79=\"\",\"\",(VLOOKUP(D79,'Membership #'!$A$1:$C$1005,2,0)))","v":""},{"$f":"IF(D79=\"\",\"\",(VLOOKUP(D79,'Membership #'!$A$1:$C$1005,3,0)))","v":""},null,null,""]
["","","",null,{"$f":"IF(D80=\"\",\"\",(VLOOKUP(D80,'Membership #'!$A$1:$C$1005,2,0)))","v":""},{"$f":"IF(D80=\"\",\"\",(VLOOKUP(D80,'Membership #'!$A$1:$C$1005,3,0)))","v":""},null,null,""]
["","","",null,{"$f":"IF(D81=\"\",\"\",(VLOOKUP(D81,'Membership #'!$A$1:$C$1005,2,0)))","v":""},{"$f":"IF(D81=\"\",\"\",(VLOOKUP(D81,'Membership #'!$A$1:$C$1005,3,0)))","v":""},null,null,""]
["","","",null,{"$f":"IF(D82=\"\",\"\",(VLOOKUP(D82,'Membership #'!$A$1:$C$1005,2,0)))","v":""},{"$f":"IF(D82=\"\",\"\",(VLOOKUP(D82,'Membership #'!$A$1:$C$1005,3,0)))","v":""},null,null,""]
["","","",null,{"$f":"IF(D83=\"\",\"\",(VLOOKUP(D83,'Membership #'!$A$1:$C$1005,2,0)))","v":""},{"$f":"IF(D83=\"\",\"\",(VLOOKUP(D83,'Membership #'!$A$1:$C$1005,3,0)))","v":""},null,null,""]
["","","",null,{"$f":"IF(D84=\"\",\"\",(VLOOKUP(D84,'Membership #'!$A$1:$C$1005,2,0)))","v":""},{"$f":"IF(D84=\"\",\"\",(VLOOKUP(D84,'Membership #'!$A$1:$C$1005,3,0)))","v":""},null,null,""]
["","","",null,{"$f":"IF(D85=\"\",\"\",(VLOOKUP(D85,'Membership #'!$A$1:$C$1005,2,0)))","v":""},{"$f":"IF(D85=\"\",\"\",(VLOOKUP(D85,'Membership #'!$A$1:$C$1005,3,0)))","v":""},null,null,""]
["","","",null,{"$f":"IF(D86=\"\",\"\",(VLOOKUP(D86,'Membership #'!$A$1:$C$1005,2,0)))","v":""},{"$f":"IF(D86=\"\",\"\",(VLOOKUP(D86,'Membership #'!$A$1:$C$1005,3,0)))","v":""},null,null,""]
["","","",null,{"$f":"IF(D87=\"\",\"\",(VLOOKUP(D87,'Membership #'!$A$1:$C$1005,2,0)))","v":""},{"$f":"IF(D87=\"\",\"\",(VLOOKUP(D87,'Membership #'!$A$1:$C$1005,3,0)))","v":""},null,null,""]
["","","",null,{"$f":"IF(D88=\"\",\"\",(VLOOKUP(D88,'Membership #'!$A$1:$C$1005,2,0)))","v":""},{"$f":"IF(D88=\"\",\"\",(VLOOKUP(D88,'Membership #'!$A$1:$C$1005,3,0)))","v":""},null,null,""]
["","","",null,{"$f":"IF(D89=\"\",\"\",(VLOOKUP(D89,'Membership #'!$A$1:$C$1005,2,0)))","v":""},{"$f":"IF(D89=\"\",\"\",(VLOOKUP(D89,'Membership #'!$A$1:$C$1005,3,0)))","v":""},null,null,""]
["","","",null,{"$f":"IF(D90=\"\",\"\",(VLOOKUP(D90,'Membership #'!$A$1:$C$1005,2,0)))","v":""},{"$f":"IF(D90=\"\",\"\",(VLOOKUP(D90,'Membership #'!$A$1:$C$1005,3,0)))","v":""},null,null,""]
["","","",null,{"$f":"IF(D91=\"\",\"\",(VLOOKUP(D91,'Membership #'!$A$1:$C$1005,2,0)))","v":""},{"$f":"IF(D91=\"\",\"\",(VLOOKUP(D91,'Membership #'!$A$1:$C$1005,3,0)))","v":""},null,null,""]
["","","",null,{"$f":"IF(D92=\"\",\"\",(VLOOKUP(D92,'Membership #'!$A$1:$C$1005,2,0)))","v":""},{"$f":"IF(D92=\"\",\"\",(VLOOKUP(D92,'Membership #'!$A$1:$C$1005,3,0)))","v":""},null,null,""]
["","","",null,{"$f":"IF(D93=\"\",\"\",(VLOOKUP(D93,'Membership #'!$A$1:$C$1005,2,0)))","v":""},{"$f":"IF(D93=\"\",\"\",(VLOOKUP(D93,'Membership #'!$A$1:$C$1005,3,0)))","v":""},null,null,""]
["","","",null,{"$f":"IF(D94=\"\",\"\",(VLOOKUP(D94,'Membership #'!$A$1:$C$1005,2,0)))","v":""},{"$f":"IF(D94=\"\",\"\",(VLOOKUP(D94,'Membership #'!$A$1:$C$1005,3,0)))","v":""},null,null,""]
["","","",null,{"$f":"IF(D95=\"\",\"\",(VLOOKUP(D95,'Membership #'!$A$1:$C$1005,2,0)))","v":""},{"$f":"IF(D95=\"\",\"\",(VLOOKUP(D95,'Membership #'!$A$1:$C$1005,3,0)))","v":""},null,null,""]
["","","",null,{"$f":"IF(D96=\"\",\"\",(VLOOKUP(D96,'Membership #'!$A$1:$C$1005,2,0)))","v":""},{"$f":"IF(D96=\"\",\"\",(VLOOKUP(D96,'Membership #'!$A$1:$C$1005,3,0)))","v":""},null,null,""]
["","","",null,{"$f":"IF(D97=\"\",\"\",(VLOOKUP(D97,'Membership #'!$A$1:$C$1005,2,0)))","v":""},{"$f":"IF(D97=\"\",\"\",(VLOOKUP(D97,'Membership #'!$A$1:$C$1005,3,0)))","v":""},null,null,""]
["","","",null,{"$f":"IF(D98=\"\",\"\",(VLOOKUP(D98,'Membership #'!$A$1:$C$1005,2,0)))","v":""},{"$f":"IF(D98=\"\",\"\",(VLOOKUP(D98,'Membership #'!$A$1:$C$1005,3,0)))","v":""},null,null,""]
["","","",null,{"$f":"IF(D99=\"\",\"\",(VLOOKUP(D99,'Membership #'!$A$1:$C$1005,2,0)))","v":""},{"$f":"IF(D99=\"\",\"\",(VLOOKUP(D99,'Membership #'!$A$1:$C$1005,3,0)))","v":""},null,null,""]
["","","",null,{"$f":"IF(D100=\"\",\"\",(VLOOKUP(D100,'Membership #'!$A$1:$C$1005,2,0)))","v":""},{"$f":"IF(D100=\"\",\"\",(VLOOKUP(D100,'Membership #'!$A$1:$C$1005,3,0)))","v":""},null,null,""]
["","","",null,{"$f":"IF(D101=\"\",\"\",(VLOOKUP(D101,'Membership #'!$A$1:$C$1005,2,0)))","v":""},{"$f":"IF(D101=\"\",\"\",(VLOOKUP(D101,'Membership #'!$A$1:$C$1005,3,0)))","v":""},null,null,""]

{"sheet":"YOUTH BARRELS","index":9,"n_rows":42,"n_cols":26,"rows_kept":42,"cut":false,"hidden":false,"merged":[[3,6,6,6],[3,7,6,7],[3,8,6,8],[5,12,5,15],[0,0,0,10],[1,0,1,10],[2,0,2,3],[2,6,2,10],[3,0,6,0],[3,1,6,1],[3,2,6,2],[3,3,6,3],[3,4,6,4],[3,9,6,9],[3,10,6,10],[3,5,6,5]]}
["Tom Burt & Mark McGuire Memorial Jackpot Aug 21, 2021",null,null,null,null,null,null,null,null,null,null,null,"x=Scratch"]
["YOUTH BARRELS",null,null,null,null,null,null,null,null,null,null,null,"n=No Time"]
["# Enteries:",null,null,null,{"$f":"COUNTIF($D$8:$D$41,\">0\")","v":15},null,null,null,null,null,null,null,null,null,null,null,null,"Don't Erase these numbers below!!"]
["Rand Draw","Seed","Running Order","RING #      ","NAME","HORSE NAME","TIME","PENALTY ","TOTAL","PLACINGS","POINTS",null,null,null,null,null,null,{"$f":"IF(N9=2,7,IF(N9=3,6,IF(N9=4,5,IF(N9=5,4,IF(AND(N9>5,N11>600),3,IF(AND(N9>5,N11<600,N11>299.99),2,IF(AND(N9>5,N11<300),1,8)))))))","v":1},1,2,3,4,5,6,7,8]
[null,null,null,null,null,null,null,null,null,null,null,null,null,null,null,null,null,null,299,"$300-","$600 -"]
[null,null,null,null,null,null,null,null,null,null,null,null,"YOUTH BARRELS",null,null,null,null,null,"or less",599,"More","5 Entries","4 Entries","3 Entries","2 Entries"]
[null,null,null,null,null,null,null,null,null,null,null,null,null,null,null,null,null,"1st",0.32,0.27,0.24,0.35,0.4,0.46,0.6]
[{"$f":"IF(D8<>\"\",RAND(),\"\")","v":0.40873880850639499},{"$f":"IF(D8<>\"\",RANK(A8,A$8:A$100),\"\")","v":14},1,918,{"$f":"IF(D8=\"\",\"\",(VLOOKUP(D8,'Membership #'!$A$1:$C$1005,2,0)))","v":"Keira Rose"},{"$f":"IF(D8=\"\",\"\",(VLOOKUP(D8,'Membership #'!$A$1:$C$1005,3,0)))","v":"LL Its All About Red"},15.564,null,{"$f":"IF(G8=\"n\",\"No Time\",IF(G8=\"x\",\"Scratch\",IF(G8<>\"\",SUM(G8+H8),\"\")))","v":15.564},null,null,null,"Added",25,null,null,null,"2nd",0.23,0.22,0.19,0.25,0.28000000000000003,0.34,0.4]
[0.74266018449294524,2,2,638,{"$f":"IF(D9=\"\",\"\",(VLOOKUP(D9,'Membership #'!$A$1:$C$1005,2,0)))","v":"Bella Peters"},{"$f":"IF(D9=\"\",\"\",(VLOOKUP(D9,'Membership #'!$A$1:$C$1005,3,0)))","v":"Super Star"},15.744999999999999,null,15.744999999999999,null,null,null,"Entries",15,null,5,"per head","3rd",0.15,0.18,0.16,0.17,0.18,0.2]
[0.68068494330507101,4,3,815,{"$f":"IF(D10=\"\",\"\",(VLOOKUP(D10,'Membership #'!$A$1:$C$1005,2,0)))","v":"Brooke Kennedy"},{"$f":"IF(D10=\"\",\"\",(VLOOKUP(D10,'Membership #'!$A$1:$C$1005,3,0)))","v":"Tic Toc Teazer"},15.946,null,15.946,null,null,null,"Jackpot",{"$f":"P9*N9","v":75},null,0.85,"payback","4th",0.12,0.13,0.13,0.13,0.14000000000000001]
[0.41000578939093457,13,4,961,{"$f":"IF(D11=\"\",\"\",(VLOOKUP(D11,'Membership #'!$A$1:$C$1005,2,0)))","v":"Jacie Burke"},{"$f":"IF(D11=\"\",\"\",(VLOOKUP(D11,'Membership #'!$A$1:$C$1005,3,0)))","v":"She's Just That Sassy"},16.353000000000002,null,16.353000000000002,null,null,null,"Total Money",{"$f":"N8+(N10*P10)","v":88.75},null,{"$f":"N10*P10","v":63.75},"Jackpot","5th",0.1,0.09,0.08,0.1]
[0.79833985325511048,1,5,954,{"$f":"IF(D12=\"\",\"\",(VLOOKUP(D12,'Membership #'!$A$1:$C$1005,2,0)))","v":"Scotia MacEachern"},{"$f":"IF(D12=\"\",\"\",(VLOOKUP(D12,'Membership #'!$A$1:$C$1005,3,0)))","v":"Hick-a-Licious"},17.456,null,17.456,null,null,null,null,"Percentage","Money","Ring #",null,"6th",0.08,0.06,0.06]
[0.67311342494734216,5,6,966,{"$f":"IF(D13=\"\",\"\",(VLOOKUP(D13,'Membership #'!$A$1:$C$1005,2,0)))","v":"Ava Anderson"},{"$f":"IF(D13=\"\",\"\",(VLOOKUP(D13,'Membership #'!$A$1:$C$1005,3,0)))","v":"Black Sass"},17.472000000000001,null,17.472000000000001,null,null,null,"1st",0.32,{"$f":"IF(N13<>0,N$11*N13,\"\")","v":28.400000000000002},null,{"$f":"IF(P13=\"\",\"\",(VLOOKUP(P13,'Membership #'!$A$1:$C$1005,2,0)))","v":""},"7th",null,0.03,0.05]
[0.34510533578580027,15,7,941,{"$f":"IF(D14=\"\",\"\",(VLOOKUP(D14,'Membership #'!$A$1:$C$1005,2,0)))","v":"Taylor Hurley"},{"$f":"IF(D14=\"\",\"\",(VLOOKUP(D14,'Membership #'!$A$1:$C$1005,3,0)))","v":"Nacho Business"},18.45,null,18.45,null,null,null,"2nd",0.23,20.412500000000001,null,{"$f":"IF(P14=\"\",\"\",(VLOOKUP(P14,'Membership #'!$A$1:$C$1005,2,0)))","v":""},"8th",null,0.02,0.04]
[0.41215731431015279,11,8,636,{"$f":"IF(D15=\"\",\"\",(VLOOKUP(D15,'Membership #'!$A$1:$C$1005,2,0)))","v":"Ceilidh Gosse"},{"$f":"IF(D15=\"\",\"\",(VLOOKUP(D15,'Membership #'!$A$1:$C$1005,3,0)))","v":"ELM Silver Crime"},19.02,null,19.02,null,null,null,"3rd",0.15,13.3125,null,{"$f":"IF(P15=\"\",\"\",(VLOOKUP(P15,'Membership #'!$A$1:$C$1005,2,0)))","v":""},"9th",null,null,0.03]
[0.46396532966104398,8,9,688,{"$f":"IF(D16=\"\",\"\",(VLOOKUP(D16,'Membership #'!$A$1:$C$1005,2,0)))","v":"Lenee Sampson"},{"$f":"IF(D16=\"\",\"\",(VLOOKUP(D16,'Membership #'!$A$1:$C$1005,3,0)))","v":"Six Dash Run"},15.738,5,20.738,null,null,null,"4th",0.12,10.65,null,{"$f":"IF(P16=\"\",\"\",(VLOOKUP(P16,'Membership #'!$A$1:$C$1005,2,0)))","v":""},"10th",null,null,0.02]
[0.67143292856017545,6,10,652,{"$f":"IF(D17=\"\",\"\",(VLOOKUP(D17,'Membership #'!$A$1:$C$1005,2,0)))","v":"Molly O'Grady"},{"$f":"IF(D17=\"\",\"\",(VLOOKUP(D17,'Membership #'!$A$1:$C$1005,3,0)))","v":"Teelano's Twister"},16.829000000000001,5,21.829000000000001,null,null,null,"5th",0.1,8.875,null,{"$f":"IF(P17=\"\",\"\",(VLOOKUP(P17,'Membership #'!$A$1:$C$1005,2,0)))","v":""}]
[0.41175700795762005,12,11,666,{"$f":"IF(D18=\"\",\"\",(VLOOKUP(D18,'Membership #'!$A$1:$C$1005,2,0)))","v":"Summer Fraser"},{"$f":"IF(D18=\"\",\"\",(VLOOKUP(D18,'Membership #'!$A$1:$C$1005,3,0)))","v":"Sheza Smokin' Girl"},20.367000000000001,5,25.367000000000001,null,null,null,"6th",0.08,7.1000000000000005,null,{"$f":"IF(P18=\"\",\"\",(VLOOKUP(P18,'Membership #'!$A$1:$C$1005,2,0)))","v":""}]
[0.43172878388087144,9,12,967,{"$f":"IF(D19=\"\",\"\",(VLOOKUP(D19,'Membership #'!$A$1:$C$1005,2,0)))","v":"Marissa Hillier"},{"$f":"IF(D19=\"\",\"\",(VLOOKUP(D19,'Membership #'!$A$1:$C$1005,3,0)))","v":"Notice Betty Boop"},20.591000000000001,5,25.591000000000001,null,null,null,"7th",null,""]
[0.48758001481123792,7,13,904,{"$f":"IF(D20=\"\",\"\",(VLOOKUP(D20,'Membership #'!$A$1:$C$1005,2,0)))","v":"Ella Cowley"},{"$f":"IF(D20=\"\",\"\",(VLOOKUP(D20,'Membership #'!$A$1:$C$1005,3,0)))","v":"Blazin Boots"},"n",null,"No Time",null,null,null,"8th",null,""]
[0.41987615949292845,10,14,867,{"$f":"IF(D21=\"\",\"\",(VLOOKUP(D21,'Membership #'!$A$1:$C$1005,2,0)))","v":"Layla MacEachem"},{"$f":"IF(D21=\"\",\"\",(VLOOKUP(D21,'Membership #'!$A$1:$C$1005,3,0)))","v":"Shes a gem"},"n",null,"No Time",null,null,null,"9th",null,""]
[0.68442360603173646,3,15,973,{"$f":"IF(D22=\"\",\"\",(VLOOKUP(D22,'Membership #'!$A$1:$C$1005,2,0)))","v":"Sara Ivey"},{"$f":"IF(D22=\"\",\"\",(VLOOKUP(D22,'Membership #'!$A$1:$C$1005,3,0)))","v":"Ms Heavenly Gator"},20.152000000000001,null,null,null,null,null,"10th",null,""]
["","","",null,{"$f":"IF(D23=\"\",\"\",(VLOOKUP(D23,'Membership #'!$A$1:$C$1005,2,0)))","v":""},{"$f":"IF(D23=\"\",\"\",(VLOOKUP(D23,'Membership #'!$A$1:$C$1005,3,0)))","v":""},null,null,{"$f":"IF(G23=\"n\",\"No Time\",IF(G23=\"x\",\"Scratch\",IF(G23<>\"\",SUM(G23+H23),\"\")))","v":""},null,null,null,"Total Money",null,{"$f":"SUM(O13:O22)","v":88.75}]
["","","",null,{"$f":"IF(D24=\"\",\"\",(VLOOKUP(D24,'Membership #'!$A$1:$C$1005,2,0)))","v":""},{"$f":"IF(D24=\"\",\"\",(VLOOKUP(D24,'Membership #'!$A$1:$C$1005,3,0)))","v":""},null,null,""]
["","","",null,{"$f":"IF(D25=\"\",\"\",(VLOOKUP(D25,'Membership #'!$A$1:$C$1005,2,0)))","v":""},{"$f":"IF(D25=\"\",\"\",(VLOOKUP(D25,'Membership #'!$A$1:$C$1005,3,0)))","v":""},null,null,""]
["","","",null,{"$f":"IF(D26=\"\",\"\",(VLOOKUP(D26,'Membership #'!$A$1:$C$1005,2,0)))","v":""},{"$f":"IF(D26=\"\",\"\",(VLOOKUP(D26,'Membership #'!$A$1:$C$1005,3,0)))","v":""},null,null,""]
["","","",null,{"$f":"IF(D27=\"\",\"\",(VLOOKUP(D27,'Membership #'!$A$1:$C$1005,2,0)))","v":""},{"$f":"IF(D27=\"\",\"\",(VLOOKUP(D27,'Membership #'!$A$1:$C$1005,3,0)))","v":""},null,null,{"$f":"IF(G27=\"n\",\"No Time\",IF(G27=\"x\",\"Scratch\",IF(G27<>\"\",SUM(G27+H27),\"\")))","v":""}]
["","","",null,{"$f":"IF(D28=\"\",\"\",(VLOOKUP(D28,'Membership #'!$A$1:$C$1005,2,0)))","v":""},{"$f":"IF(D28=\"\",\"\",(VLOOKUP(D28,'Membership #'!$A$1:$C$1005,3,0)))","v":""},null,null,""]
["","","",null,{"$f":"IF(D29=\"\",\"\",(VLOOKUP(D29,'Membership #'!$A$1:$C$1005,2,0)))","v":""},{"$f":"IF(D29=\"\",\"\",(VLOOKUP(D29,'Membership #'!$A$1:$C$1005,3,0)))","v":""},null,null,{"$f":"IF(G29=\"n\",\"No Time\",IF(G29=\"x\",\"Scratch\",IF(G29<>\"\",SUM(G29+H29),\"\")))","v":""}]
["","","",null,{"$f":"IF(D30=\"\",\"\",(VLOOKUP(D30,'Membership #'!$A$1:$C$1005,2,0)))","v":""},{"$f":"IF(D30=\"\",\"\",(VLOOKUP(D30,'Membership #'!$A$1:$C$1005,3,0)))","v":""},null,null,""]
["","","",null,{"$f":"IF(D31=\"\",\"\",(VLOOKUP(D31,'Membership #'!$A$1:$C$1005,2,0)))","v":""},{"$f":"IF(D31=\"\",\"\",(VLOOKUP(D31,'Membership #'!$A$1:$C$1005,3,0)))","v":""},null,null,""]
["","","",null,{"$f":"IF(D32=\"\",\"\",(VLOOKUP(D32,'Membership #'!$A$1:$C$1005,2,0)))","v":""},{"$f":"IF(D32=\"\",\"\",(VLOOKUP(D32,'Membership #'!$A$1:$C$1005,3,0)))","v":""},null,null,""]
["","","",null,{"$f":"IF(D33=\"\",\"\",(VLOOKUP(D33,'Membership #'!$A$1:$C$1005,2,0)))","v":""},{"$f":"IF(D33=\"\",\"\",(VLOOKUP(D33,'Membership #'!$A$1:$C$1005,3,0)))","v":""},null,null,""]
[{"$f":"IF(D34<>\"\",RAND(),\"\")","v":""},"","",null,{"$f":"IF(D34=\"\",\"\",(VLOOKUP(D34,'Membership #'!$A$1:$C$1005,2,0)))","v":""},{"$f":"IF(D34=\"\",\"\",(VLOOKUP(D34,'Membership #'!$A$1:$C$1005,3,0)))","v":""},null,null,{"$f":"IF(G34=\"n\",\"No Time\",IF(G34=\"x\",\"Scratch\",IF(G34<>\"\",SUM(G34+H34),\"\")))","v":""}]
["","","",null,{"$f":"IF(D35=\"\",\"\",(VLOOKUP(D35,'Membership #'!$A$1:$C$1005,2,0)))","v":""},{"$f":"IF(D35=\"\",\"\",(VLOOKUP(D35,'Membership #'!$A$1:$C$1005,3,0)))","v":""},null,null,""]
["","","",null,{"$f":"IF(D36=\"\",\"\",(VLOOKUP(D36,'Membership #'!$A$1:$C$1005,2,0)))","v":""},{"$f":"IF(D36=\"\",\"\",(VLOOKUP(D36,'Membership #'!$A$1:$C$1005,3,0)))","v":""},null,null,""]
["","","",null,{"$f":"IF(D37=\"\",\"\",(VLOOKUP(D37,'Membership #'!$A$1:$C$1005,2,0)))","v":""},{"$f":"IF(D37=\"\",\"\",(VLOOKUP(D37,'Membership #'!$A$1:$C$1005,3,0)))","v":""},null,null,""]
["","","",null,{"$f":"IF(D38=\"\",\"\",(VLOOKUP(D38,'Membership #'!$A$1:$C$1005,2,0)))","v":""},{"$f":"IF(D38=\"\",\"\",(VLOOKUP(D38,'Membership #'!$A$1:$C$1005,3,0)))","v":""},null,null,""]
["","","",null,{"$f":"IF(D39=\"\",\"\",(VLOOKUP(D39,'Membership #'!$A$1:$C$1005,2,0)))","v":""},{"$f":"IF(D39=\"\",\"\",(VLOOKUP(D39,'Membership #'!$A$1:$C$1005,3,0)))","v":""},null,null,""]
["","","",null,{"$f":"IF(D40=\"\",\"\",(VLOOKUP(D40,'Membership #'!$A$1:$C$1005,2,0)))","v":""},{"$f":"IF(D40=\"\",\"\",(VLOOKUP(D40,'Membership #'!$A$1:$C$1005,3,0)))","v":""}]
["","","",null,{"$f":"IF(D41=\"\",\"\",(VLOOKUP(D41,'Membership #'!$A$1:$C$1005,2,0)))","v":""},{"$f":"IF(D41=\"\",\"\",(VLOOKUP(D41,'Membership #'!$A$1:$C$1005,3,0)))","v":""}]
[null,null,null,null,{"$f":"IF(D42=\"\",\"\",(VLOOKUP(D42,'Membership #'!$A$1:$C$1005,2,0)))","v":""},{"$f":"IF(D42=\"\",\"\",(VLOOKUP(D42,'Membership #'!$A$1:$C$1005,3,0)))","v":""}]

{"sheet":"NOVICE BARRELS","index":10,"n_rows":99,"n_cols":26,"rows_kept":99,"cut":false,"hidden":false,"merged":[[5,12,5,15],[0,0,0,10],[1,0,1,10],[2,0,2,3],[2,6,2,10],[3,0,6,0],[3,1,6,1],[3,2,6,2],[3,3,6,3],[3,4,6,4],[3,9,6,9],[3,10,6,10],[3,5,6,5],[3,6,6,6],[3,7,6,7],[3,8,6,8]]}
["Tom Burt & Mark McGuire Memorial Jackpot Aug 21, 2021",null,null,null,null,null,null,null,null,null,null,null,"x=Scratch"]
["NOVICE BARRELS",null,null,null,null,null,null,null,null,null,null,null,"n=No Time"]
["# Enteries:",null,null,null,{"$f":"COUNTIF($D$8:$D$98,\">0\")","v":25},null,null,null,null,null,null,null,null,null,null,null,null,"Don't Erase these numbers below!!"]
["Rand Draw","Seed","Running Order","RING #      ","NAME","HORSE NAME","TIME","PENALTY ","TOTAL","PLACINGS","POINTS",null,null,null,null,null,null,{"$f":"IF(N9=2,7,IF(N9=3,6,IF(N9=4,5,IF(N9=5,4,IF(AND(N9>5,N11>600),3,IF(AND(N9>5,N11<600,N11>299.99),2,IF(AND(N9>5,N11<300),1,8)))))))","v":1},1,2,3,4,5,6,7,8]
[null,null,null,null,null,null,null,null,null,null,null,null,null,null,null,null,null,null,299,"$300-","$600 -"]
[null,null,null,null,null,null,null,null,null,null,null,null,"NOVICE BARRELS",null,null,null,null,null,"or less",599,"More","5 Entries","4 Entries","3 Entries","2 Entries"]
[null,null,null,null,null,null,null,null,null,null,null,null,null,null,null,null,null,"1st",0.32,0.27,0.24,0.35,0.4,0.46,0.6]
[{"$f":"IF(D8<>\"\",RAND(),\"\")","v":0.41556659868187851},{"$f":"IF(D8<>\"\",RANK(A8,A$8:A$99),\"\")","v":12},1,928,{"$f":"IF(D8=\"\",\"\",(VLOOKUP(D8,'Membership #'!$A$1:$C$1005,2,0)))","v":"Tessa Dicks"},{"$f":"IF(D8=\"\",\"\",(VLOOKUP(D8,'Membership #'!$A$1:$C$1005,3,0)))","v":"ELM Dash of Crime"},15.586,null,{"$f":"IF(G8=\"n\",\"No Time\",IF(G8=\"x\",\"Scratch\",IF(G8<>\"\",SUM(G8+H8),\"\")))","v":15.586},null,null,null,"Added",75,null,null,null,"2nd",0.23,0.22,0.19,0.25,0.28000000000000003,0.34,0.4]
[{"$f":"IF(D9<>\"\",RAND(),\"\")","v":0.65090669022558711},4,2,966,{"$f":"IF(D9=\"\",\"\",(VLOOKUP(D9,'Membership #'!$A$1:$C$1005,2,0)))","v":"Ava Anderson"},{"$f":"IF(D9=\"\",\"\",(VLOOKUP(D9,'Membership #'!$A$1:$C$1005,3,0)))","v":"Black Sass"},16.074000000000002,null,16.074000000000002,null,null,null,"Entries",25,null,10,"per head","3rd",0.15,0.18,0.16,0.17,0.18,0.2]
[0.42137438369263569,11,3,914,{"$f":"IF(D10=\"\",\"\",(VLOOKUP(D10,'Membership #'!$A$1:$C$1005,2,0)))","v":"Shelby MacPherson"},{"$f":"IF(D10=\"\",\"\",(VLOOKUP(D10,'Membership #'!$A$1:$C$1005,3,0)))","v":"Shelbys Badger Bar"},16.253,null,16.253,null,null,null,"Jackpot",{"$f":"P9*N9","v":250},null,0.85,"payback","4th",0.12,0.13,0.13,0.13,0.14000000000000001]
[0.45714246687616988,9,4,699,{"$f":"IF(D11=\"\",\"\",(VLOOKUP(D11,'Membership #'!$A$1:$C$1005,2,0)))","v":"Laura Morrison"},{"$f":"IF(D11=\"\",\"\",(VLOOKUP(D11,'Membership #'!$A$1:$C$1005,3,0)))","v":"MDC Dark Revelation"},16.279,null,16.279,null,null,null,"Total Money",{"$f":"N8+(N10*P10)","v":287.5},null,{"$f":"N10*P10","v":212.5},"Jackpot","5th",0.1,0.09,0.08,0.1]
[0.2505539371565394,18,5,909,{"$f":"IF(D12=\"\",\"\",(VLOOKUP(D12,'Membership #'!$A$1:$C$1005,2,0)))","v":"Rebecca Gillis"},{"$f":"IF(D12=\"\",\"\",(VLOOKUP(D12,'Membership #'!$A$1:$C$1005,3,0)))","v":"Martha's Tivio Moon"},16.309000000000001,null,16.309000000000001,null,null,null,null,"Percentage","Money","Ring #",null,"6th",0.08,0.06,0.06]
[0.50545454505646914,8,6,652,{"$f":"IF(D13=\"\",\"\",(VLOOKUP(D13,'Membership #'!$A$1:$C$1005,2,0)))","v":"Molly O'Grady"},{"$f":"IF(D13=\"\",\"\",(VLOOKUP(D13,'Membership #'!$A$1:$C$1005,3,0)))","v":"Teelano's Twister"},16.353999999999999,null,16.353999999999999,null,null,null,"1st",{"$f":"HLOOKUP($R$4,$S$4:$Z$17,4,0)","v":0.32},{"$f":"IF(N13<>0,N$11*N13,\"\")","v":92},null,{"$f":"IF(P13=\"\",\"\",(VLOOKUP(P13,'Membership #'!$A$1:$C$1005,2,0)))","v":""},"7th",null,0.03,0.05]
[3.9425721638226996E-2,24,7,518,{"$f":"IF(D14=\"\",\"\",(VLOOKUP(D14,'Membership #'!$A$1:$C$1005,2,0)))","v":"Sylvester Weatherbie"},{"$f":"IF(D14=\"\",\"\",(VLOOKUP(D14,'Membership #'!$A$1:$C$1005,3,0)))","v":"J.R."},16.449000000000002,null,16.449000000000002,null,null,null,"2nd",{"$f":"HLOOKUP($R$4,$S$4:$Z$17,5,0)","v":0.23},66.125,null,{"$f":"IF(P14=\"\",\"\",(VLOOKUP(P14,'Membership #'!$A$1:$C$1005,2,0)))","v":""},"8th",null,0.02,0.04]
[0.16842434594030664,21,8,954,{"$f":"IF(D15=\"\",\"\",(VLOOKUP(D15,'Membership #'!$A$1:$C$1005,2,0)))","v":"Scotia MacEachern"},{"$f":"IF(D15=\"\",\"\",(VLOOKUP(D15,'Membership #'!$A$1:$C$1005,3,0)))","v":"Hick-a-Licious"},16.843,null,16.843,null,null,null,"3rd",{"$f":"HLOOKUP($R$4,$S$4:$Z$17,6,0)","v":0.15},43.125,null,{"$f":"IF(P15=\"\",\"\",(VLOOKUP(P15,'Membership #'!$A$1:$C$1005,2,0)))","v":""},"9th",null,null,0.03]
[0.31183309990392061,16,9,600,{"$f":"IF(D16=\"\",\"\",(VLOOKUP(D16,'Membership #'!$A$1:$C$1005,2,0)))","v":"Stan Brown"},{"$f":"IF(D16=\"\",\"\",(VLOOKUP(D16,'Membership #'!$A$1:$C$1005,3,0)))","v":"A Perty Sure Thing"},17.073,null,17.073,null,null,null,"4th",{"$f":"HLOOKUP($R$4,$S$4:$Z$17,7,0)","v":0.12},34.5,null,{"$f":"IF(P16=\"\",\"\",(VLOOKUP(P16,'Membership #'!$A$1:$C$1005,2,0)))","v":""},"10th",null,null,0.02]
[0.59388762813468088,5,10,514,{"$f":"IF(D17=\"\",\"\",(VLOOKUP(D17,'Membership #'!$A$1:$C$1005,2,0)))","v":"Heather Morrison"},{"$f":"IF(D17=\"\",\"\",(VLOOKUP(D17,'Membership #'!$A$1:$C$1005,3,0)))","v":"Black Fire Dash"},17.254999999999999,null,17.254999999999999,null,null,null,"5th",{"$f":"HLOOKUP($R$4,$S$4:$Z$17,8,0)","v":0.1},28.75,null,{"$f":"IF(P17=\"\",\"\",(VLOOKUP(P17,'Membership #'!$A$1:$C$1005,2,0)))","v":""}]
[0.92012627583132345,1,11,732,{"$f":"IF(D18=\"\",\"\",(VLOOKUP(D18,'Membership #'!$A$1:$C$1005,2,0)))","v":"Brenna Carrigan"},{"$f":"IF(D18=\"\",\"\",(VLOOKUP(D18,'Membership #'!$A$1:$C$1005,3,0)))","v":"Carlos"},17.417999999999999,null,17.417999999999999,null,null,null,"6th",{"$f":"HLOOKUP($R$4,$S$4:$Z$17,9,0)","v":0.08},23,null,{"$f":"IF(P18=\"\",\"\",(VLOOKUP(P18,'Membership #'!$A$1:$C$1005,2,0)))","v":""}]
[2.7134745596933851E-2,25,12,591,{"$f":"IF(D19=\"\",\"\",(VLOOKUP(D19,'Membership #'!$A$1:$C$1005,2,0)))","v":"Wendy MacLean"},{"$f":"IF(D19=\"\",\"\",(VLOOKUP(D19,'Membership #'!$A$1:$C$1005,3,0)))","v":"White Sox N Flyin"},18.091000000000001,null,18.091000000000001,null,null,null,"7th",{"$f":"HLOOKUP($R$4,$S$4:$Z$17,10,0)","v":0},"",null,{"$f":"IF(P19=\"\",\"\",(VLOOKUP(P19,'Membership #'!$A$1:$C$1005,2,0)))","v":""}]
[0.41224655675851674,13,13,753,{"$f":"IF(D20=\"\",\"\",(VLOOKUP(D20,'Membership #'!$A$1:$C$1005,2,0)))","v":"Kayla Boudreau"},{"$f":"IF(D20=\"\",\"\",(VLOOKUP(D20,'Membership #'!$A$1:$C$1005,3,0)))","v":"Lady Jane"},18.3,null,18.3,null,null,null,"8th",{"$f":"HLOOKUP($R$4,$S$4:$Z$17,11,0)","v":0},"",null,{"$f":"IF(P20=\"\",\"\",(VLOOKUP(P20,'Membership #'!$A$1:$C$1005,2,0)))","v":""}]
[0.26523093453221847,17,14,973,{"$f":"IF(D21=\"\",\"\",(VLOOKUP(D21,'Membership #'!$A$1:$C$1005,2,0)))","v":"Sara Ivey"},{"$f":"IF(D21=\"\",\"\",(VLOOKUP(D21,'Membership #'!$A$1:$C$1005,3,0)))","v":"Ms Heavenly Gator"},18.568999999999999,null,18.568999999999999,null,null,null,"9th",{"$f":"HLOOKUP($R$4,$S$4:$Z$17,12,0)","v":0},"",null,{"$f":"IF(P21=\"\",\"\",(VLOOKUP(P21,'Membership #'!$A$1:$C$1005,2,0)))","v":""}]
[0.31243909988464325,15,15,655,{"$f":"IF(D22=\"\",\"\",(VLOOKUP(D22,'Membership #'!$A$1:$C$1005,2,0)))","v":"Julia Parker"},{"$f":"IF(D22=\"\",\"\",(VLOOKUP(D22,'Membership #'!$A$1:$C$1005,3,0)))","v":"Boons Feature Star"},18.617000000000001,null,18.617000000000001,null,null,null,"10th",{"$f":"HLOOKUP($R$4,$S$4:$Z$17,13,0)","v":0},"",null,{"$f":"IF(P22=\"\",\"\",(VLOOKUP(P22,'Membership #'!$A$1:$C$1005,2,0)))","v":""}]
[0.38752809477636374,14,16,537,{"$f":"IF(D23=\"\",\"\",(VLOOKUP(D23,'Membership #'!$A$1:$C$1005,2,0)))","v":"Alka Virick"},{"$f":"IF(D23=\"\",\"\",(VLOOKUP(D23,'Membership #'!$A$1:$C$1005,3,0)))","v":"Corona Identity"},20.195,null,20.195,null,null,null,"Total Money",null,{"$f":"SUM(O13:O22)","v":287.5}]
[0.57342362894136634,7,17,971,{"$f":"IF(D24=\"\",\"\",(VLOOKUP(D24,'Membership #'!$A$1:$C$1005,2,0)))","v":"Arielle Burke"},{"$f":"IF(D24=\"\",\"\",(VLOOKUP(D24,'Membership #'!$A$1:$C$1005,3,0)))","v":"Elm Sally"},22.99,null,22.99]
[0.12568881134735255,23,18,746,{"$f":"IF(D25=\"\",\"\",(VLOOKUP(D25,'Membership #'!$A$1:$C$1005,2,0)))","v":"Cassie MacDonald"},{"$f":"IF(D25=\"\",\"\",(VLOOKUP(D25,'Membership #'!$A$1:$C$1005,3,0)))","v":"Sandy Dew"},25.25,null,25.25]
[0.43925242547161436,10,19,768,{"$f":"IF(D26=\"\",\"\",(VLOOKUP(D26,'Membership #'!$A$1:$C$1005,2,0)))","v":"Tracey Higgins"},{"$f":"IF(D26=\"\",\"\",(VLOOKUP(D26,'Membership #'!$A$1:$C$1005,3,0)))","v":"Iza Wicked Wind"},16.469000000000001,10,26.469000000000001]
[0.21083472046606888,19,20,855,{"$f":"IF(D27=\"\",\"\",(VLOOKUP(D27,'Membership #'!$A$1:$C$1005,2,0)))","v":"Jenelle Collier"},{"$f":"IF(D27=\"\",\"\",(VLOOKUP(D27,'Membership #'!$A$1:$C$1005,3,0)))","v":"Peppy Sans Surprise"},"n",null,"No Time"]
[0.59101371383327284,6,21,904,{"$f":"IF(D28=\"\",\"\",(VLOOKUP(D28,'Membership #'!$A$1:$C$1005,2,0)))","v":"Ella Cowley"},{"$f":"IF(D28=\"\",\"\",(VLOOKUP(D28,'Membership #'!$A$1:$C$1005,3,0)))","v":"Blazin Boots"},"n",null,"No Time"]
[0.17952127506213023,20,22,716,{"$f":"IF(D29=\"\",\"\",(VLOOKUP(D29,'Membership #'!$A$1:$C$1005,2,0)))","v":"Kayla Martin"},{"$f":"IF(D29=\"\",\"\",(VLOOKUP(D29,'Membership #'!$A$1:$C$1005,3,0)))","v":"Dash Ta Home"},"n",null,"No Time"]
[0.90170138021253232,2,23,889,{"$f":"IF(D30=\"\",\"\",(VLOOKUP(D30,'Membership #'!$A$1:$C$1005,2,0)))","v":"Adelaine Cowley"},{"$f":"IF(D30=\"\",\"\",(VLOOKUP(D30,'Membership #'!$A$1:$C$1005,3,0)))","v":"Frenchman's Promise"},"x",null,"Scratch"]
[0.12854089628998222,22,24,968,{"$f":"IF(D31=\"\",\"\",(VLOOKUP(D31,'Membership #'!$A$1:$C$1005,2,0)))","v":"Madison Pelly"},{"$f":"IF(D31=\"\",\"\",(VLOOKUP(D31,'Membership #'!$A$1:$C$1005,3,0)))","v":"Westin"},"x",null,"Scratch"]
[0.67954864410679838,3,25,78,{"$f":"IF(D32=\"\",\"\",(VLOOKUP(D32,'Membership #'!$A$1:$C$1005,2,0)))","v":"Stephanie Rich"},{"$f":"IF(D32=\"\",\"\",(VLOOKUP(D32,'Membership #'!$A$1:$C$1005,3,0)))","v":"Texas Mickey"},"x",null,"Scratch"]
["","","",null,{"$f":"IF(D33=\"\",\"\",(VLOOKUP(D33,'Membership #'!$A$1:$C$1005,2,0)))","v":""},{"$f":"IF(D33=\"\",\"\",(VLOOKUP(D33,'Membership #'!$A$1:$C$1005,3,0)))","v":""},null,null,{"$f":"IF(G33=\"n\",\"No Time\",IF(G33=\"x\",\"Scratch\",IF(G33<>\"\",SUM(G33+H33),\"\")))","v":""}]
["","","",null,{"$f":"IF(D34=\"\",\"\",(VLOOKUP(D34,'Membership #'!$A$1:$C$1005,2,0)))","v":""},{"$f":"IF(D34=\"\",\"\",(VLOOKUP(D34,'Membership #'!$A$1:$C$1005,3,0)))","v":""},null,null,""]
["","","",null,{"$f":"IF(D35=\"\",\"\",(VLOOKUP(D35,'Membership #'!$A$1:$C$1005,2,0)))","v":""},{"$f":"IF(D35=\"\",\"\",(VLOOKUP(D35,'Membership #'!$A$1:$C$1005,3,0)))","v":""},null,null,""]
["","","",null,{"$f":"IF(D36=\"\",\"\",(VLOOKUP(D36,'Membership #'!$A$1:$C$1005,2,0)))","v":""},{"$f":"IF(D36=\"\",\"\",(VLOOKUP(D36,'Membership #'!$A$1:$C$1005,3,0)))","v":""},null,null,""]
["","","",null,{"$f":"IF(D37=\"\",\"\",(VLOOKUP(D37,'Membership #'!$A$1:$C$1005,2,0)))","v":""},{"$f":"IF(D37=\"\",\"\",(VLOOKUP(D37,'Membership #'!$A$1:$C$1005,3,0)))","v":""},null,null,""]
["","","",null,{"$f":"IF(D38=\"\",\"\",(VLOOKUP(D38,'Membership #'!$A$1:$C$1005,2,0)))","v":""},{"$f":"IF(D38=\"\",\"\",(VLOOKUP(D38,'Membership #'!$A$1:$C$1005,3,0)))","v":""},null,null,""]
["","","",null,{"$f":"IF(D39=\"\",\"\",(VLOOKUP(D39,'Membership #'!$A$1:$C$1005,2,0)))","v":""},{"$f":"IF(D39=\"\",\"\",(VLOOKUP(D39,'Membership #'!$A$1:$C$1005,3,0)))","v":""},null,null,""]
["",{"$f":"IF(D40<>\"\",RANK(A40,A$8:A$99),\"\")","v":""},"",null,{"$f":"IF(D40=\"\",\"\",(VLOOKUP(D40,'Membership #'!$A$1:$C$1005,2,0)))","v":""},{"$f":"IF(D40=\"\",\"\",(VLOOKUP(D40,'Membership #'!$A$1:$C$1005,3,0)))","v":""},null,null,""]
["","","",null,{"$f":"IF(D41=\"\",\"\",(VLOOKUP(D41,'Membership #'!$A$1:$C$1005,2,0)))","v":""},{"$f":"IF(D41=\"\",\"\",(VLOOKUP(D41,'Membership #'!$A$1:$C$1005,3,0)))","v":""},null,null,""]
["","","",null,{"$f":"IF(D42=\"\",\"\",(VLOOKUP(D42,'Membership #'!$A$1:$C$1005,2,0)))","v":""},{"$f":"IF(D42=\"\",\"\",(VLOOKUP(D42,'Membership #'!$A$1:$C$1005,3,0)))","v":""},null,null,""]
["","","",null,{"$f":"IF(D43=\"\",\"\",(VLOOKUP(D43,'Membership #'!$A$1:$C$1005,2,0)))","v":""},{"$f":"IF(D43=\"\",\"\",(VLOOKUP(D43,'Membership #'!$A$1:$C$1005,3,0)))","v":""},null,null,""]
["","","",null,{"$f":"IF(D44=\"\",\"\",(VLOOKUP(D44,'Membership #'!$A$1:$C$1005,2,0)))","v":""},{"$f":"IF(D44=\"\",\"\",(VLOOKUP(D44,'Membership #'!$A$1:$C$1005,3,0)))","v":""},null,null,""]
["","","",null,{"$f":"IF(D45=\"\",\"\",(VLOOKUP(D45,'Membership #'!$A$1:$C$1005,2,0)))","v":""},{"$f":"IF(D45=\"\",\"\",(VLOOKUP(D45,'Membership #'!$A$1:$C$1005,3,0)))","v":""},null,null,""]
["","","",null,{"$f":"IF(D46=\"\",\"\",(VLOOKUP(D46,'Membership #'!$A$1:$C$1005,2,0)))","v":""},{"$f":"IF(D46=\"\",\"\",(VLOOKUP(D46,'Membership #'!$A$1:$C$1005,3,0)))","v":""},null,null,{"$f":"IF(G46=\"n\",\"No Time\",IF(G46=\"x\",\"Scratch\",IF(G46<>\"\",SUM(G46+H46),\"\")))","v":""}]
["","","",null,{"$f":"IF(D47=\"\",\"\",(VLOOKUP(D47,'Membership #'!$A$1:$C$1005,2,0)))","v":""},{"$f":"IF(D47=\"\",\"\",(VLOOKUP(D47,'Membership #'!$A$1:$C$1005,3,0)))","v":""},null,null,""]
["","","",null,{"$f":"IF(D48=\"\",\"\",(VLOOKUP(D48,'Membership #'!$A$1:$C$1005,2,0)))","v":""},{"$f":"IF(D48=\"\",\"\",(VLOOKUP(D48,'Membership #'!$A$1:$C$1005,3,0)))","v":""},null,null,""]
["","","",null,{"$f":"IF(D49=\"\",\"\",(VLOOKUP(D49,'Membership #'!$A$1:$C$1005,2,0)))","v":""},{"$f":"IF(D49=\"\",\"\",(VLOOKUP(D49,'Membership #'!$A$1:$C$1005,3,0)))","v":""},null,null,""]
["","","",null,{"$f":"IF(D50=\"\",\"\",(VLOOKUP(D50,'Membership #'!$A$1:$C$1005,2,0)))","v":""},{"$f":"IF(D50=\"\",\"\",(VLOOKUP(D50,'Membership #'!$A$1:$C$1005,3,0)))","v":""},null,null,{"$f":"IF(G50=\"n\",\"No Time\",IF(G50=\"x\",\"Scratch\",IF(G50<>\"\",SUM(G50+H50),\"\")))","v":""}]
["","","",null,{"$f":"IF(D51=\"\",\"\",(VLOOKUP(D51,'Membership #'!$A$1:$C$1005,2,0)))","v":""},{"$f":"IF(D51=\"\",\"\",(VLOOKUP(D51,'Membership #'!$A$1:$C$1005,3,0)))","v":""},null,null,""]
["","","",null,{"$f":"IF(D52=\"\",\"\",(VLOOKUP(D52,'Membership #'!$A$1:$C$1005,2,0)))","v":""},{"$f":"IF(D52=\"\",\"\",(VLOOKUP(D52,'Membership #'!$A$1:$C$1005,3,0)))","v":""}]
["","","",null,{"$f":"IF(D53=\"\",\"\",(VLOOKUP(D53,'Membership #'!$A$1:$C$1005,2,0)))","v":""},{"$f":"IF(D53=\"\",\"\",(VLOOKUP(D53,'Membership #'!$A$1:$C$1005,3,0)))","v":""}]
["","","",null,{"$f":"IF(D54=\"\",\"\",(VLOOKUP(D54,'Membership #'!$A$1:$C$1005,2,0)))","v":""},{"$f":"IF(D54=\"\",\"\",(VLOOKUP(D54,'Membership #'!$A$1:$C$1005,3,0)))","v":""},null,null,{"$f":"IF(G54=\"n\",\"No Time\",IF(G54=\"x\",\"Scratch\",IF(G54<>\"\",SUM(G54+H54),\"\")))","v":""}]
["","","",null,{"$f":"IF(D55=\"\",\"\",(VLOOKUP(D55,'Membership #'!$A$1:$C$1005,2,0)))","v":""},{"$f":"IF(D55=\"\",\"\",(VLOOKUP(D55,'Membership #'!$A$1:$C$1005,3,0)))","v":""},null,null,""]
["","","",null,{"$f":"IF(D56=\"\",\"\",(VLOOKUP(D56,'Membership #'!$A$1:$C$1005,2,0)))","v":""},{"$f":"IF(D56=\"\",\"\",(VLOOKUP(D56,'Membership #'!$A$1:$C$1005,3,0)))","v":""},null,null,""]
["","","",null,{"$f":"IF(D57=\"\",\"\",(VLOOKUP(D57,'Membership #'!$A$1:$C$1005,2,0)))","v":""},{"$f":"IF(D57=\"\",\"\",(VLOOKUP(D57,'Membership #'!$A$1:$C$1005,3,0)))","v":""},null,null,""]
["","","",null,{"$f":"IF(D58=\"\",\"\",(VLOOKUP(D58,'Membership #'!$A$1:$C$1005,2,0)))","v":""},{"$f":"IF(D58=\"\",\"\",(VLOOKUP(D58,'Membership #'!$A$1:$C$1005,3,0)))","v":""},null,null,""]
["","","",null,{"$f":"IF(D59=\"\",\"\",(VLOOKUP(D59,'Membership #'!$A$1:$C$1005,2,0)))","v":""},{"$f":"IF(D59=\"\",\"\",(VLOOKUP(D59,'Membership #'!$A$1:$C$1005,3,0)))","v":""},null,null,""]
["","","",null,{"$f":"IF(D60=\"\",\"\",(VLOOKUP(D60,'Membership #'!$A$1:$C$1005,2,0)))","v":""},{"$f":"IF(D60=\"\",\"\",(VLOOKUP(D60,'Membership #'!$A$1:$C$1005,3,0)))","v":""},null,null,""]
["","","",null,{"$f":"IF(D61=\"\",\"\",(VLOOKUP(D61,'Membership #'!$A$1:$C$1005,2,0)))","v":""},{"$f":"IF(D61=\"\",\"\",(VLOOKUP(D61,'Membership #'!$A$1:$C$1005,3,0)))","v":""},null,null,""]
["","","",null,{"$f":"IF(D62=\"\",\"\",(VLOOKUP(D62,'Membership #'!$A$1:$C$1005,2,0)))","v":""},{"$f":"IF(D62=\"\",\"\",(VLOOKUP(D62,'Membership #'!$A$1:$C$1005,3,0)))","v":""},null,null,""]
["","","",null,{"$f":"IF(D63=\"\",\"\",(VLOOKUP(D63,'Membership #'!$A$1:$C$1005,2,0)))","v":""},{"$f":"IF(D63=\"\",\"\",(VLOOKUP(D63,'Membership #'!$A$1:$C$1005,3,0)))","v":""},null,null,""]
["","","",null,{"$f":"IF(D64=\"\",\"\",(VLOOKUP(D64,'Membership #'!$A$1:$C$1005,2,0)))","v":""},{"$f":"IF(D64=\"\",\"\",(VLOOKUP(D64,'Membership #'!$A$1:$C$1005,3,0)))","v":""},null,null,""]
["","","",null,{"$f":"IF(D65=\"\",\"\",(VLOOKUP(D65,'Membership #'!$A$1:$C$1005,2,0)))","v":""},{"$f":"IF(D65=\"\",\"\",(VLOOKUP(D65,'Membership #'!$A$1:$C$1005,3,0)))","v":""},null,null,""]
["","","",null,{"$f":"IF(D66=\"\",\"\",(VLOOKUP(D66,'Membership #'!$A$1:$C$1005,2,0)))","v":""},{"$f":"IF(D66=\"\",\"\",(VLOOKUP(D66,'Membership #'!$A$1:$C$1005,3,0)))","v":""},null,null,""]
["","","",null,{"$f":"IF(D67=\"\",\"\",(VLOOKUP(D67,'Membership #'!$A$1:$C$1005,2,0)))","v":""},{"$f":"IF(D67=\"\",\"\",(VLOOKUP(D67,'Membership #'!$A$1:$C$1005,3,0)))","v":""},null,null,""]
["","","",null,{"$f":"IF(D68=\"\",\"\",(VLOOKUP(D68,'Membership #'!$A$1:$C$1005,2,0)))","v":""},{"$f":"IF(D68=\"\",\"\",(VLOOKUP(D68,'Membership #'!$A$1:$C$1005,3,0)))","v":""},null,null,""]
["","","",null,{"$f":"IF(D69=\"\",\"\",(VLOOKUP(D69,'Membership #'!$A$1:$C$1005,2,0)))","v":""},{"$f":"IF(D69=\"\",\"\",(VLOOKUP(D69,'Membership #'!$A$1:$C$1005,3,0)))","v":""},null,null,""]
["","","",null,{"$f":"IF(D70=\"\",\"\",(VLOOKUP(D70,'Membership #'!$A$1:$C$1005,2,0)))","v":""},{"$f":"IF(D70=\"\",\"\",(VLOOKUP(D70,'Membership #'!$A$1:$C$1005,3,0)))","v":""},null,null,""]
["","","",null,{"$f":"IF(D71=\"\",\"\",(VLOOKUP(D71,'Membership #'!$A$1:$C$1005,2,0)))","v":""},{"$f":"IF(D71=\"\",\"\",(VLOOKUP(D71,'Membership #'!$A$1:$C$1005,3,0)))","v":""},null,null,{"$f":"IF(G71=\"n\",\"No Time\",IF(G71=\"x\",\"Scratch\",IF(G71<>\"\",SUM(G71+H71),\"\")))","v":""}]
[{"$f":"IF(D72<>\"\",RAND(),\"\")","v":""},{"$f":"IF(D72<>\"\",RANK(A72,A$8:A$99),\"\")","v":""},"",null,{"$f":"IF(D72=\"\",\"\",(VLOOKUP(D72,'Membership #'!$A$1:$C$1005,2,0)))","v":""},{"$f":"IF(D72=\"\",\"\",(VLOOKUP(D72,'Membership #'!$A$1:$C$1005,3,0)))","v":""},null,null,""]
["","","",null,{"$f":"IF(D73=\"\",\"\",(VLOOKUP(D73,'Membership #'!$A$1:$C$1005,2,0)))","v":""},{"$f":"IF(D73=\"\",\"\",(VLOOKUP(D73,'Membership #'!$A$1:$C$1005,3,0)))","v":""},null,null,""]
["","","",null,{"$f":"IF(D74=\"\",\"\",(VLOOKUP(D74,'Membership #'!$A$1:$C$1005,2,0)))","v":""},{"$f":"IF(D74=\"\",\"\",(VLOOKUP(D74,'Membership #'!$A$1:$C$1005,3,0)))","v":""},null,null,""]
["","","",null,{"$f":"IF(D75=\"\",\"\",(VLOOKUP(D75,'Membership #'!$A$1:$C$1005,2,0)))","v":""},{"$f":"IF(D75=\"\",\"\",(VLOOKUP(D75,'Membership #'!$A$1:$C$1005,3,0)))","v":""},null,null,""]
["","","",null,{"$f":"IF(D76=\"\",\"\",(VLOOKUP(D76,'Membership #'!$A$1:$C$1005,2,0)))","v":""},{"$f":"IF(D76=\"\",\"\",(VLOOKUP(D76,'Membership #'!$A$1:$C$1005,3,0)))","v":""},null,null,""]
["","","",null,{"$f":"IF(D77=\"\",\"\",(VLOOKUP(D77,'Membership #'!$A$1:$C$1005,2,0)))","v":""},{"$f":"IF(D77=\"\",\"\",(VLOOKUP(D77,'Membership #'!$A$1:$C$1005,3,0)))","v":""},null,null,""]
["","","",null,{"$f":"IF(D78=\"\",\"\",(VLOOKUP(D78,'Membership #'!$A$1:$C$1005,2,0)))","v":""},{"$f":"IF(D78=\"\",\"\",(VLOOKUP(D78,'Membership #'!$A$1:$C$1005,3,0)))","v":""},null,null,""]
["","","",null,{"$f":"IF(D79=\"\",\"\",(VLOOKUP(D79,'Membership #'!$A$1:$C$1005,2,0)))","v":""},{"$f":"IF(D79=\"\",\"\",(VLOOKUP(D79,'Membership #'!$A$1:$C$1005,3,0)))","v":""},null,null,""]
["","","",null,{"$f":"IF(D80=\"\",\"\",(VLOOKUP(D80,'Membership #'!$A$1:$C$1005,2,0)))","v":""},{"$f":"IF(D80=\"\",\"\",(VLOOKUP(D80,'Membership #'!$A$1:$C$1005,3,0)))","v":""},null,null,""]
["","","",null,{"$f":"IF(D81=\"\",\"\",(VLOOKUP(D81,'Membership #'!$A$1:$C$1005,2,0)))","v":""},{"$f":"IF(D81=\"\",\"\",(VLOOKUP(D81,'Membership #'!$A$1:$C$1005,3,0)))","v":""},null,null,""]
["","","",null,{"$f":"IF(D82=\"\",\"\",(VLOOKUP(D82,'Membership #'!$A$1:$C$1005,2,0)))","v":""},{"$f":"IF(D82=\"\",\"\",(VLOOKUP(D82,'Membership #'!$A$1:$C$1005,3,0)))","v":""},null,null,""]
["","","",null,{"$f":"IF(D83=\"\",\"\",(VLOOKUP(D83,'Membership #'!$A$1:$C$1005,2,0)))","v":""},{"$f":"IF(D83=\"\",\"\",(VLOOKUP(D83,'Membership #'!$A$1:$C$1005,3,0)))","v":""},null,null,""]
["","","",null,{"$f":"IF(D84=\"\",\"\",(VLOOKUP(D84,'Membership #'!$A$1:$C$1005,2,0)))","v":""},{"$f":"IF(D84=\"\",\"\",(VLOOKUP(D84,'Membership #'!$A$1:$C$1005,3,0)))","v":""},null,null,""]
["","","",null,{"$f":"IF(D85=\"\",\"\",(VLOOKUP(D85,'Membership #'!$A$1:$C$1005,2,0)))","v":""},{"$f":"IF(D85=\"\",\"\",(VLOOKUP(D85,'Membership #'!$A$1:$C$1005,3,0)))","v":""},null,null,""]
["","","",null,{"$f":"IF(D86=\"\",\"\",(VLOOKUP(D86,'Membership #'!$A$1:$C$1005,2,0)))","v":""},{"$f":"IF(D86=\"\",\"\",(VLOOKUP(D86,'Membership #'!$A$1:$C$1005,3,0)))","v":""},null,null,""]
["","","",null,{"$f":"IF(D87=\"\",\"\",(VLOOKUP(D87,'Membership #'!$A$1:$C$1005,2,0)))","v":""},{"$f":"IF(D87=\"\",\"\",(VLOOKUP(D87,'Membership #'!$A$1:$C$1005,3,0)))","v":""},null,null,""]
["","","",null,{"$f":"IF(D88=\"\",\"\",(VLOOKUP(D88,'Membership #'!$A$1:$C$1005,2,0)))","v":""},{"$f":"IF(D88=\"\",\"\",(VLOOKUP(D88,'Membership #'!$A$1:$C$1005,3,0)))","v":""},null,null,""]
["","","",null,{"$f":"IF(D89=\"\",\"\",(VLOOKUP(D89,'Membership #'!$A$1:$C$1005,2,0)))","v":""},{"$f":"IF(D89=\"\",\"\",(VLOOKUP(D89,'Membership #'!$A$1:$C$1005,3,0)))","v":""},null,null,""]
["","","",null,{"$f":"IF(D90=\"\",\"\",(VLOOKUP(D90,'Membership #'!$A$1:$C$1005,2,0)))","v":""},{"$f":"IF(D90=\"\",\"\",(VLOOKUP(D90,'Membership #'!$A$1:$C$1005,3,0)))","v":""},null,null,""]
["","","",null,{"$f":"IF(D91=\"\",\"\",(VLOOKUP(D91,'Membership #'!$A$1:$C$1005,2,0)))","v":""},{"$f":"IF(D91=\"\",\"\",(VLOOKUP(D91,'Membership #'!$A$1:$C$1005,3,0)))","v":""},null,null,""]
["","","",null,{"$f":"IF(D92=\"\",\"\",(VLOOKUP(D92,'Membership #'!$A$1:$C$1005,2,0)))","v":""},{"$f":"IF(D92=\"\",\"\",(VLOOKUP(D92,'Membership #'!$A$1:$C$1005,3,0)))","v":""},null,null,""]
["","","",null,{"$f":"IF(D93=\"\",\"\",(VLOOKUP(D93,'Membership #'!$A$1:$C$1005,2,0)))","v":""},{"$f":"IF(D93=\"\",\"\",(VLOOKUP(D93,'Membership #'!$A$1:$C$1005,3,0)))","v":""},null,null,""]
["","","",null,{"$f":"IF(D94=\"\",\"\",(VLOOKUP(D94,'Membership #'!$A$1:$C$1005,2,0)))","v":""},{"$f":"IF(D94=\"\",\"\",(VLOOKUP(D94,'Membership #'!$A$1:$C$1005,3,0)))","v":""},null,null,""]
["","","",null,{"$f":"IF(D95=\"\",\"\",(VLOOKUP(D95,'Membership #'!$A$1:$C$1005,2,0)))","v":""},{"$f":"IF(D95=\"\",\"\",(VLOOKUP(D95,'Membership #'!$A$1:$C$1005,3,0)))","v":""},null,null,""]
["","","",null,{"$f":"IF(D96=\"\",\"\",(VLOOKUP(D96,'Membership #'!$A$1:$C$1005,2,0)))","v":""},{"$f":"IF(D96=\"\",\"\",(VLOOKUP(D96,'Membership #'!$A$1:$C$1005,3,0)))","v":""},null,null,""]
["","","",null,{"$f":"IF(D97=\"\",\"\",(VLOOKUP(D97,'Membership #'!$A$1:$C$1005,2,0)))","v":""},{"$f":"IF(D97=\"\",\"\",(VLOOKUP(D97,'Membership #'!$A$1:$C$1005,3,0)))","v":""},null,null,""]
["","","",null,{"$f":"IF(D98=\"\",\"\",(VLOOKUP(D98,'Membership #'!$A$1:$C$1005,2,0)))","v":""},{"$f":"IF(D98=\"\",\"\",(VLOOKUP(D98,'Membership #'!$A$1:$C$1005,3,0)))","v":""},null,null,""]
["","","",null,{"$f":"IF(D99=\"\",\"\",(VLOOKUP(D99,'Membership #'!$A$1:$C$1005,2,0)))","v":""},{"$f":"IF(D99=\"\",\"\",(VLOOKUP(D99,'Membership #'!$A$1:$C$1005,3,0)))","v":""},null,null,""]

{"sheet":"OPEN BARRELS","index":11,"n_rows":99,"n_cols":26,"rows_kept":99,"cut":false,"hidden":false,"merged":[[5,12,5,15],[0,0,0,10],[1,0,1,10],[2,0,2,3],[2,6,2,10],[3,0,6,0],[3,1,6,1],[3,2,6,2],[3,3,6,3],[3,4,6,4],[3,9,6,9],[3,10,6,10],[3,5,6,5],[3,6,6,6],[3,7,6,7],[3,8,6,8]]}
["Tom Burt & Mark McGuire Memorial Jackpot Aug 21, 2021",null,null,null,null,null,null,null,null,null,null,null,"x=Scratch"]
["OPEN BARRELS",null,null,null,null,null,null,null,null,null,null,null,"n=No Time"]
["# Enteries:",null,null,null,{"$f":"COUNTIF($D$8:$D$98,\">0\")","v":27},null,null,null,null,null,null,null,"Sponsored by Clarence Farm Services",null,null,null,null,"Don't Erase these numbers below!!"]
["Rand Draw","Seed",null,"RING #      ","NAME","HORSE NAME","TIME","PENALTY ","TOTAL","PLACINGS","POINTS",null,null,null,null,null,null,{"$f":"IF(N9=2,7,IF(N9=3,6,IF(N9=4,5,IF(N9=5,4,IF(AND(N9>5,N11>600),3,IF(AND(N9>5,N11<600,N11>299.99),2,IF(AND(N9>5,N11<300),1,8)))))))","v":2},1,2,3,4,5,6,7,8]
[null,null,null,null,null,null,null,null,null,null,null,null,null,null,null,null,null,null,299,"$300-","$600 -"]
[null,null,null,null,null,null,null,null,null,null,null,null,"OPEN BARRELS",null,null,null,null,null,"or less",599,"More","5 Entries","4 Entries","3 Entries","2 Entries"]
[null,null,null,null,null,null,null,null,null,null,null,null,null,null,null,null,null,"1st",0.32,0.27,0.24,0.35,0.4,0.46,0.6]
[{"$f":"IF(D8<>\"\",RAND(),\"\")","v":0.37626185082096553},{"$f":"IF(D8<>\"\",RANK(A8,A$8:A$99),\"\")","v":18},1,928,{"$f":"IF(D8=\"\",\"\",(VLOOKUP(D8,'Membership #'!$A$1:$C$1005,2,0)))","v":"Tessa Dicks"},{"$f":"IF(D8=\"\",\"\",(VLOOKUP(D8,'Membership #'!$A$1:$C$1005,3,0)))","v":"ELM Dash of Crime"},15.138,null,{"$f":"IF(G8=\"n\",\"No Time\",IF(G8=\"x\",\"Scratch\",IF(G8<>\"\",SUM(G8+H8),\"\")))","v":15.138},null,null,null,"Added",150,null,null,null,"2nd",0.23,0.22,0.19,0.25,0.28000000000000003,0.34,0.4]
[0.4555207764836855,14,2,703,{"$f":"IF(D9=\"\",\"\",(VLOOKUP(D9,'Membership #'!$A$1:$C$1005,2,0)))","v":"Chris Baker"},{"$f":"IF(D9=\"\",\"\",(VLOOKUP(D9,'Membership #'!$A$1:$C$1005,3,0)))","v":"Jamer All Fired Up"},15.157999999999999,null,15.157999999999999,null,null,null,"Entries",26,null,20,"per head","3rd",0.15,0.18,0.16,0.17,0.18,0.2]
[0.16531410313321659,24,3,688,{"$f":"IF(D10=\"\",\"\",(VLOOKUP(D10,'Membership #'!$A$1:$C$1005,2,0)))","v":"Lenee Sampson"},{"$f":"IF(D10=\"\",\"\",(VLOOKUP(D10,'Membership #'!$A$1:$C$1005,3,0)))","v":"Six Dash Run"},15.196999999999999,null,15.196999999999999,null,null,null,"Jackpot",{"$f":"P9*N9","v":520},null,0.85,"payback","4th",0.12,0.13,0.13,0.13,0.14000000000000001]
[0.92644769625798074,1,4,657,{"$f":"IF(D11=\"\",\"\",(VLOOKUP(D11,'Membership #'!$A$1:$C$1005,2,0)))","v":"Laura Morrison"},{"$f":"IF(D11=\"\",\"\",(VLOOKUP(D11,'Membership #'!$A$1:$C$1005,3,0)))","v":"Steal Ta Fame"},15.253,null,15.253,null,null,null,"Total Money",{"$f":"N8+(N10*P10)","v":592},null,{"$f":"N10*P10","v":442},"Jackpot","5th",0.1,0.09,0.08,0.1]
[0.40132701316412167,16,5,538,{"$f":"IF(D12=\"\",\"\",(VLOOKUP(D12,'Membership #'!$A$1:$C$1005,2,0)))","v":"Jean DuGas"},{"$f":"IF(D12=\"\",\"\",(VLOOKUP(D12,'Membership #'!$A$1:$C$1005,3,0)))","v":"Pal's Lilguy"},15.287000000000001,null,15.287000000000001,null,null,null,null,"Percentage","Money","Ring #",null,"6th",0.08,0.06,0.06]
[0.53257353134444019,11,6,922,{"$f":"IF(D13=\"\",\"\",(VLOOKUP(D13,'Membership #'!$A$1:$C$1005,2,0)))","v":"Stevi Jardine"},{"$f":"IF(D13=\"\",\"\",(VLOOKUP(D13,'Membership #'!$A$1:$C$1005,3,0)))","v":"Paytons Pretty Cool"},15.337999999999999,null,15.337999999999999,null,null,null,"1st",0.24,{"$f":"IF(N13<>0,N$11*N13,\"\")","v":142.07999999999998},null,{"$f":"IF(P13=\"\",\"\",(VLOOKUP(P13,'Membership #'!$A$1:$C$1005,2,0)))","v":""},"7th",null,0.03,0.05]
[0.45775659720424278,13,7,534,{"$f":"IF(D14=\"\",\"\",(VLOOKUP(D14,'Membership #'!$A$1:$C$1005,2,0)))","v":"Mary Lou Rankin Dentin"},{"$f":"IF(D14=\"\",\"\",(VLOOKUP(D14,'Membership #'!$A$1:$C$1005,3,0)))","v":"Brandy's Chocolena"},15.39,null,15.39,null,null,null,"2nd",0.19,112.48,null,{"$f":"IF(P14=\"\",\"\",(VLOOKUP(P14,'Membership #'!$A$1:$C$1005,2,0)))","v":""},"8th",null,0.02,0.04]
[0.21683650050898873,23,8,700,{"$f":"IF(D15=\"\",\"\",(VLOOKUP(D15,'Membership #'!$A$1:$C$1005,2,0)))","v":"Lindsay Baker"},{"$f":"IF(D15=\"\",\"\",(VLOOKUP(D15,'Membership #'!$A$1:$C$1005,3,0)))","v":"Boons Laughing Boy"},15.513,null,15.513,null,null,null,"3rd",0.16,94.72,null,{"$f":"IF(P15=\"\",\"\",(VLOOKUP(P15,'Membership #'!$A$1:$C$1005,2,0)))","v":""},"9th",null,null,0.03]
[0.29031887458607508,20,9,516,{"$f":"IF(D16=\"\",\"\",(VLOOKUP(D16,'Membership #'!$A$1:$C$1005,2,0)))","v":"Laurie Don Reginato"},{"$f":"IF(D16=\"\",\"\",(VLOOKUP(D16,'Membership #'!$A$1:$C$1005,3,0)))","v":"TCR Gold Runny"},15.734,null,15.734,null,null,null,"4th",0.13,76.960000000000008,null,{"$f":"IF(P16=\"\",\"\",(VLOOKUP(P16,'Membership #'!$A$1:$C$1005,2,0)))","v":""},"10th",null,null,0.02]
[0.25472996060644126,21,10,698,{"$f":"IF(D17=\"\",\"\",(VLOOKUP(D17,'Membership #'!$A$1:$C$1005,2,0)))","v":"Kaleigh Denton"},{"$f":"IF(D17=\"\",\"\",(VLOOKUP(D17,'Membership #'!$A$1:$C$1005,3,0)))","v":"Coleasaki"},15.747999999999999,null,15.747999999999999,null,null,null,"5th",0.08,47.36,null,{"$f":"IF(P17=\"\",\"\",(VLOOKUP(P17,'Membership #'!$A$1:$C$1005,2,0)))","v":""}]
[2.6838991001446932E-2,26,11,647,{"$f":"IF(D18=\"\",\"\",(VLOOKUP(D18,'Membership #'!$A$1:$C$1005,2,0)))","v":"Courtney Parker"},{"$f":"IF(D18=\"\",\"\",(VLOOKUP(D18,'Membership #'!$A$1:$C$1005,3,0)))","v":"BW Rare Kinda Love"},15.831,null,15.831,null,null,null,"6th",0.06,35.519999999999996,null,{"$f":"IF(P18=\"\",\"\",(VLOOKUP(P18,'Membership #'!$A$1:$C$1005,2,0)))","v":""}]
[0.39924918086064076,17,12,684,{"$f":"IF(D19=\"\",\"\",(VLOOKUP(D19,'Membership #'!$A$1:$C$1005,2,0)))","v":"Shann Cox"},{"$f":"IF(D19=\"\",\"\",(VLOOKUP(D19,'Membership #'!$A$1:$C$1005,3,0)))","v":"Jags Cash Flow"},15.855,null,15.855,null,null,null,"7th",0.05,29.6,null,{"$f":"IF(P19=\"\",\"\",(VLOOKUP(P19,'Membership #'!$A$1:$C$1005,2,0)))","v":""}]
[0.75924448639804865,5,13,556,{"$f":"IF(D20=\"\",\"\",(VLOOKUP(D20,'Membership #'!$A$1:$C$1005,2,0)))","v":"Stephaine Clark"},{"$f":"IF(D20=\"\",\"\",(VLOOKUP(D20,'Membership #'!$A$1:$C$1005,3,0)))","v":"Perks A Flyin"},15.944000000000001,null,15.944000000000001,null,null,null,"8th",0.04,23.68,null,{"$f":"IF(P20=\"\",\"\",(VLOOKUP(P20,'Membership #'!$A$1:$C$1005,2,0)))","v":""}]
[0.29472592888331439,19,14,750,{"$f":"IF(D21=\"\",\"\",(VLOOKUP(D21,'Membership #'!$A$1:$C$1005,2,0)))","v":"Tanya Kennedy"},{"$f":"IF(D21=\"\",\"\",(VLOOKUP(D21,'Membership #'!$A$1:$C$1005,3,0)))","v":"Old Stations Pride"},15.949,null,15.949,null,null,null,"9th",0.03,17.759999999999998,null,{"$f":"IF(P21=\"\",\"\",(VLOOKUP(P21,'Membership #'!$A$1:$C$1005,2,0)))","v":""}]
[0.61732958617495426,9,15,655,{"$f":"IF(D22=\"\",\"\",(VLOOKUP(D22,'Membership #'!$A$1:$C$1005,2,0)))","v":"Julia Parker"},{"$f":"IF(D22=\"\",\"\",(VLOOKUP(D22,'Membership #'!$A$1:$C$1005,3,0)))","v":"Boons Feature Star"},16.085000000000001,null,16.085000000000001,null,null,null,"10th",0.02,11.84,null,{"$f":"IF(P22=\"\",\"\",(VLOOKUP(P22,'Membership #'!$A$1:$C$1005,2,0)))","v":""}]
[0.56407331808973515,10,16,616,{"$f":"IF(D23=\"\",\"\",(VLOOKUP(D23,'Membership #'!$A$1:$C$1005,2,0)))","v":"Judy Bateman"},{"$f":"IF(D23=\"\",\"\",(VLOOKUP(D23,'Membership #'!$A$1:$C$1005,3,0)))","v":"HM HollywoodRockstar"},16.34,null,16.34,null,null,null,"Total Money",null,{"$f":"SUM(O13:O22)","v":592}]
[0.50194651882949703,12,17,904,{"$f":"IF(D24=\"\",\"\",(VLOOKUP(D24,'Membership #'!$A$1:$C$1005,2,0)))","v":"Ella Cowley"},{"$f":"IF(D24=\"\",\"\",(VLOOKUP(D24,'Membership #'!$A$1:$C$1005,3,0)))","v":"Blazin Boots"},16.95,null,16.95]
[0.42761262052057702,15,18,732,{"$f":"IF(D25=\"\",\"\",(VLOOKUP(D25,'Membership #'!$A$1:$C$1005,2,0)))","v":"Brenna Carrigan"},{"$f":"IF(D25=\"\",\"\",(VLOOKUP(D25,'Membership #'!$A$1:$C$1005,3,0)))","v":"Carlos"},17.068000000000001,null,17.068000000000001,null,null,null,null,{"$f":"IF(M25=\"\",\"\",(VLOOKUP(M25,'Membership #'!$A$1:$C$1005,2,0)))","v":""},{"$f":"IF(M25=\"\",\"\",(VLOOKUP(M25,'Membership #'!$A$1:$C$1005,3,0)))","v":""}]
[2.0048288944579995E-2,27,19,914,{"$f":"IF(D26=\"\",\"\",(VLOOKUP(D26,'Membership #'!$A$1:$C$1005,2,0)))","v":"Shelby MacPherson"},{"$f":"IF(D26=\"\",\"\",(VLOOKUP(D26,'Membership #'!$A$1:$C$1005,3,0)))","v":"Shelbys Badger Bar"},15.673999999999999,5,20.673999999999999,null,null,null,null,{"$f":"IF(M26=\"\",\"\",(VLOOKUP(M26,'Membership #'!$A$1:$C$1005,2,0)))","v":""},{"$f":"IF(M26=\"\",\"\",(VLOOKUP(M26,'Membership #'!$A$1:$C$1005,3,0)))","v":""}]
[0.83341410840555674,4,20,777,{"$f":"IF(D27=\"\",\"\",(VLOOKUP(D27,'Membership #'!$A$1:$C$1005,2,0)))","v":"Julia Parker"},{"$f":"IF(D27=\"\",\"\",(VLOOKUP(D27,'Membership #'!$A$1:$C$1005,3,0)))","v":"Doc's Spirit Prairie"},16.128,5,21.128,null,null,null,null,{"$f":"IF(M27=\"\",\"\",(VLOOKUP(M27,'Membership #'!$A$1:$C$1005,2,0)))","v":""},{"$f":"IF(M27=\"\",\"\",(VLOOKUP(M27,'Membership #'!$A$1:$C$1005,3,0)))","v":""}]
[0.13894316964310449,25,21,971,{"$f":"IF(D28=\"\",\"\",(VLOOKUP(D28,'Membership #'!$A$1:$C$1005,2,0)))","v":"Arielle Burke"},{"$f":"IF(D28=\"\",\"\",(VLOOKUP(D28,'Membership #'!$A$1:$C$1005,3,0)))","v":"Elm Sally"},26.231999999999999,null,26.231999999999999]
[0.73769619092465344,7,22,892,{"$f":"IF(D29=\"\",\"\",(VLOOKUP(D29,'Membership #'!$A$1:$C$1005,2,0)))","v":"Donnie MacNeil"},{"$f":"IF(D29=\"\",\"\",(VLOOKUP(D29,'Membership #'!$A$1:$C$1005,3,0)))","v":"Gifted Go Gold"},"n",null,"No Time",null,null,null,null,null,{"$f":"IF(N29=\"\",\"\",(VLOOKUP(N29,'Membership #'!$A$1:$C$1005,2,0)))","v":""},{"$f":"IF(N29=\"\",\"\",(VLOOKUP(N29,'Membership #'!$A$1:$C$1005,3,0)))","v":""}]
[0.74167808925174239,6,23,537,{"$f":"IF(D30=\"\",\"\",(VLOOKUP(D30,'Membership #'!$A$1:$C$1005,2,0)))","v":"Alka Virick"},{"$f":"IF(D30=\"\",\"\",(VLOOKUP(D30,'Membership #'!$A$1:$C$1005,3,0)))","v":"Corona Identity"},"n",null,"No Time"]
[0.84093649074351118,3,24,78,{"$f":"IF(D31=\"\",\"\",(VLOOKUP(D31,'Membership #'!$A$1:$C$1005,2,0)))","v":"Stephanie Rich"},{"$f":"IF(D31=\"\",\"\",(VLOOKUP(D31,'Membership #'!$A$1:$C$1005,3,0)))","v":"Texas Mickey"},"x",null,"Scratch"]
[0.71170654765066943,8,25,530,{"$f":"IF(D32=\"\",\"\",(VLOOKUP(D32,'Membership #'!$A$1:$C$1005,2,0)))","v":"Joan Grant"},{"$f":"IF(D32=\"\",\"\",(VLOOKUP(D32,'Membership #'!$A$1:$C$1005,3,0)))","v":"SLS Dash to Holland"},"x",null,"Scratch"]
[0.23383688556290771,22,26,674,{"$f":"IF(D33=\"\",\"\",(VLOOKUP(D33,'Membership #'!$A$1:$C$1005,2,0)))","v":"Kyle Beaton"},{"$f":"IF(D33=\"\",\"\",(VLOOKUP(D33,'Membership #'!$A$1:$C$1005,3,0)))","v":"Jus For Kicks"},"x",null,"Scratch"]
[0.88791858641950916,2,27,695,{"$f":"IF(D34=\"\",\"\",(VLOOKUP(D34,'Membership #'!$A$1:$C$1005,2,0)))","v":"Tessa Dicks"},{"$f":"IF(D34=\"\",\"\",(VLOOKUP(D34,'Membership #'!$A$1:$C$1005,3,0)))","v":"Charge's Dusty Luck"},"x",null,"Scratch"]
["","","",null,{"$f":"IF(D35=\"\",\"\",(VLOOKUP(D35,'Membership #'!$A$1:$C$1005,2,0)))","v":""},{"$f":"IF(D35=\"\",\"\",(VLOOKUP(D35,'Membership #'!$A$1:$C$1005,3,0)))","v":""},null,null,{"$f":"IF(G35=\"n\",\"No Time\",IF(G35=\"x\",\"Scratch\",IF(G35<>\"\",SUM(G35+H35),\"\")))","v":""}]
["","","",null,{"$f":"IF(D36=\"\",\"\",(VLOOKUP(D36,'Membership #'!$A$1:$C$1005,2,0)))","v":""},{"$f":"IF(D36=\"\",\"\",(VLOOKUP(D36,'Membership #'!$A$1:$C$1005,3,0)))","v":""},null,null,""]
["","","",null,{"$f":"IF(D37=\"\",\"\",(VLOOKUP(D37,'Membership #'!$A$1:$C$1005,2,0)))","v":""},{"$f":"IF(D37=\"\",\"\",(VLOOKUP(D37,'Membership #'!$A$1:$C$1005,3,0)))","v":""},null,null,""]
["","","",null,{"$f":"IF(D38=\"\",\"\",(VLOOKUP(D38,'Membership #'!$A$1:$C$1005,2,0)))","v":""},{"$f":"IF(D38=\"\",\"\",(VLOOKUP(D38,'Membership #'!$A$1:$C$1005,3,0)))","v":""},null,null,""]
["","","",null,{"$f":"IF(D39=\"\",\"\",(VLOOKUP(D39,'Membership #'!$A$1:$C$1005,2,0)))","v":""},{"$f":"IF(D39=\"\",\"\",(VLOOKUP(D39,'Membership #'!$A$1:$C$1005,3,0)))","v":""},null,null,{"$f":"IF(G39=\"n\",\"No Time\",IF(G39=\"x\",\"Scratch\",IF(G39<>\"\",SUM(G39+H39),\"\")))","v":""}]
["","","",null,{"$f":"IF(D40=\"\",\"\",(VLOOKUP(D40,'Membership #'!$A$1:$C$1005,2,0)))","v":""},{"$f":"IF(D40=\"\",\"\",(VLOOKUP(D40,'Membership #'!$A$1:$C$1005,3,0)))","v":""},null,null,{"$f":"IF(G40=\"n\",\"No Time\",IF(G40=\"x\",\"Scratch\",IF(G40<>\"\",SUM(G40+H40),\"\")))","v":""}]
["","","",null,{"$f":"IF(D41=\"\",\"\",(VLOOKUP(D41,'Membership #'!$A$1:$C$1005,2,0)))","v":""},{"$f":"IF(D41=\"\",\"\",(VLOOKUP(D41,'Membership #'!$A$1:$C$1005,3,0)))","v":""},null,null,""]
["","","",null,{"$f":"IF(D42=\"\",\"\",(VLOOKUP(D42,'Membership #'!$A$1:$C$1005,2,0)))","v":""},{"$f":"IF(D42=\"\",\"\",(VLOOKUP(D42,'Membership #'!$A$1:$C$1005,3,0)))","v":""},null,null,""]
[{"$f":"IF(D43<>\"\",RAND(),\"\")","v":""},{"$f":"IF(D43<>\"\",RANK(A43,A$8:A$99),\"\")","v":""},"",null,{"$f":"IF(D43=\"\",\"\",(VLOOKUP(D43,'Membership #'!$A$1:$C$1005,2,0)))","v":""},{"$f":"IF(D43=\"\",\"\",(VLOOKUP(D43,'Membership #'!$A$1:$C$1005,3,0)))","v":""},null,null,""]
["","","",null,{"$f":"IF(D44=\"\",\"\",(VLOOKUP(D44,'Membership #'!$A$1:$C$1005,2,0)))","v":""},{"$f":"IF(D44=\"\",\"\",(VLOOKUP(D44,'Membership #'!$A$1:$C$1005,3,0)))","v":""},null,null,""]
["","","",null,{"$f":"IF(D45=\"\",\"\",(VLOOKUP(D45,'Membership #'!$A$1:$C$1005,2,0)))","v":""},{"$f":"IF(D45=\"\",\"\",(VLOOKUP(D45,'Membership #'!$A$1:$C$1005,3,0)))","v":""},null,null,""]
["","","",null,{"$f":"IF(D46=\"\",\"\",(VLOOKUP(D46,'Membership #'!$A$1:$C$1005,2,0)))","v":""},{"$f":"IF(D46=\"\",\"\",(VLOOKUP(D46,'Membership #'!$A$1:$C$1005,3,0)))","v":""},null,null,""]
["","","",null,{"$f":"IF(D47=\"\",\"\",(VLOOKUP(D47,'Membership #'!$A$1:$C$1005,2,0)))","v":""},{"$f":"IF(D47=\"\",\"\",(VLOOKUP(D47,'Membership #'!$A$1:$C$1005,3,0)))","v":""},null,null,""]
["","","",null,{"$f":"IF(D48=\"\",\"\",(VLOOKUP(D48,'Membership #'!$A$1:$C$1005,2,0)))","v":""},{"$f":"IF(D48=\"\",\"\",(VLOOKUP(D48,'Membership #'!$A$1:$C$1005,3,0)))","v":""},null,null,""]
["","","",null,{"$f":"IF(D49=\"\",\"\",(VLOOKUP(D49,'Membership #'!$A$1:$C$1005,2,0)))","v":""},{"$f":"IF(D49=\"\",\"\",(VLOOKUP(D49,'Membership #'!$A$1:$C$1005,3,0)))","v":""},null,null,""]
["","","",null,{"$f":"IF(D50=\"\",\"\",(VLOOKUP(D50,'Membership #'!$A$1:$C$1005,2,0)))","v":""},{"$f":"IF(D50=\"\",\"\",(VLOOKUP(D50,'Membership #'!$A$1:$C$1005,3,0)))","v":""},null,null,""]
["","","",null,{"$f":"IF(D51=\"\",\"\",(VLOOKUP(D51,'Membership #'!$A$1:$C$1005,2,0)))","v":""},{"$f":"IF(D51=\"\",\"\",(VLOOKUP(D51,'Membership #'!$A$1:$C$1005,3,0)))","v":""},null,null,""]
["","","",null,{"$f":"IF(D52=\"\",\"\",(VLOOKUP(D52,'Membership #'!$A$1:$C$1005,2,0)))","v":""},{"$f":"IF(D52=\"\",\"\",(VLOOKUP(D52,'Membership #'!$A$1:$C$1005,3,0)))","v":""},null,null,""]
["","","",null,{"$f":"IF(D53=\"\",\"\",(VLOOKUP(D53,'Membership #'!$A$1:$C$1005,2,0)))","v":""},{"$f":"IF(D53=\"\",\"\",(VLOOKUP(D53,'Membership #'!$A$1:$C$1005,3,0)))","v":""},null,null,""]
["","","",null,{"$f":"IF(D54=\"\",\"\",(VLOOKUP(D54,'Membership #'!$A$1:$C$1005,2,0)))","v":""},{"$f":"IF(D54=\"\",\"\",(VLOOKUP(D54,'Membership #'!$A$1:$C$1005,3,0)))","v":""},null,null,""]
["","","",null,{"$f":"IF(D55=\"\",\"\",(VLOOKUP(D55,'Membership #'!$A$1:$C$1005,2,0)))","v":""},{"$f":"IF(D55=\"\",\"\",(VLOOKUP(D55,'Membership #'!$A$1:$C$1005,3,0)))","v":""},null,null,""]
["","","",null,{"$f":"IF(D56=\"\",\"\",(VLOOKUP(D56,'Membership #'!$A$1:$C$1005,2,0)))","v":""},{"$f":"IF(D56=\"\",\"\",(VLOOKUP(D56,'Membership #'!$A$1:$C$1005,3,0)))","v":""},null,null,""]
["","","",null,{"$f":"IF(D57=\"\",\"\",(VLOOKUP(D57,'Membership #'!$A$1:$C$1005,2,0)))","v":""},{"$f":"IF(D57=\"\",\"\",(VLOOKUP(D57,'Membership #'!$A$1:$C$1005,3,0)))","v":""},null,null,""]
["","","",null,{"$f":"IF(D58=\"\",\"\",(VLOOKUP(D58,'Membership #'!$A$1:$C$1005,2,0)))","v":""},{"$f":"IF(D58=\"\",\"\",(VLOOKUP(D58,'Membership #'!$A$1:$C$1005,3,0)))","v":""},null,null,""]
["","","",null,{"$f":"IF(D59=\"\",\"\",(VLOOKUP(D59,'Membership #'!$A$1:$C$1005,2,0)))","v":""},{"$f":"IF(D59=\"\",\"\",(VLOOKUP(D59,'Membership #'!$A$1:$C$1005,3,0)))","v":""},null,null,{"$f":"IF(G59=\"n\",\"No Time\",IF(G59=\"x\",\"Scratch\",IF(G59<>\"\",SUM(G59+H59),\"\")))","v":""}]
["","","",null,{"$f":"IF(D60=\"\",\"\",(VLOOKUP(D60,'Membership #'!$A$1:$C$1005,2,0)))","v":""},{"$f":"IF(D60=\"\",\"\",(VLOOKUP(D60,'Membership #'!$A$1:$C$1005,3,0)))","v":""},null,null,""]
["","","",null,{"$f":"IF(D61=\"\",\"\",(VLOOKUP(D61,'Membership #'!$A$1:$C$1005,2,0)))","v":""},{"$f":"IF(D61=\"\",\"\",(VLOOKUP(D61,'Membership #'!$A$1:$C$1005,3,0)))","v":""},null,null,""]
["","","",null,{"$f":"IF(D62=\"\",\"\",(VLOOKUP(D62,'Membership #'!$A$1:$C$1005,2,0)))","v":""},{"$f":"IF(D62=\"\",\"\",(VLOOKUP(D62,'Membership #'!$A$1:$C$1005,3,0)))","v":""},null,null,{"$f":"IF(G62=\"n\",\"No Time\",IF(G62=\"x\",\"Scratch\",IF(G62<>\"\",SUM(G62+H62),\"\")))","v":""}]
["","","",null,{"$f":"IF(D63=\"\",\"\",(VLOOKUP(D63,'Membership #'!$A$1:$C$1005,2,0)))","v":""},{"$f":"IF(D63=\"\",\"\",(VLOOKUP(D63,'Membership #'!$A$1:$C$1005,3,0)))","v":""},null,null,""]
["","","",null,{"$f":"IF(D64=\"\",\"\",(VLOOKUP(D64,'Membership #'!$A$1:$C$1005,2,0)))","v":""},{"$f":"IF(D64=\"\",\"\",(VLOOKUP(D64,'Membership #'!$A$1:$C$1005,3,0)))","v":""},null,null,""]
["","","",null,{"$f":"IF(D65=\"\",\"\",(VLOOKUP(D65,'Membership #'!$A$1:$C$1005,2,0)))","v":""},{"$f":"IF(D65=\"\",\"\",(VLOOKUP(D65,'Membership #'!$A$1:$C$1005,3,0)))","v":""},null,null,""]
["","","",null,{"$f":"IF(D66=\"\",\"\",(VLOOKUP(D66,'Membership #'!$A$1:$C$1005,2,0)))","v":""},{"$f":"IF(D66=\"\",\"\",(VLOOKUP(D66,'Membership #'!$A$1:$C$1005,3,0)))","v":""},null,null,""]
["","","",null,{"$f":"IF(D67=\"\",\"\",(VLOOKUP(D67,'Membership #'!$A$1:$C$1005,2,0)))","v":""},{"$f":"IF(D67=\"\",\"\",(VLOOKUP(D67,'Membership #'!$A$1:$C$1005,3,0)))","v":""},null,null,""]
["","","",null,{"$f":"IF(D68=\"\",\"\",(VLOOKUP(D68,'Membership #'!$A$1:$C$1005,2,0)))","v":""},{"$f":"IF(D68=\"\",\"\",(VLOOKUP(D68,'Membership #'!$A$1:$C$1005,3,0)))","v":""},null,null,""]
["","","",null,{"$f":"IF(D69=\"\",\"\",(VLOOKUP(D69,'Membership #'!$A$1:$C$1005,2,0)))","v":""},{"$f":"IF(D69=\"\",\"\",(VLOOKUP(D69,'Membership #'!$A$1:$C$1005,3,0)))","v":""},null,null,""]
[{"$f":"IF(D70<>\"\",RAND(),\"\")","v":""},"","",null,{"$f":"IF(D70=\"\",\"\",(VLOOKUP(D70,'Membership #'!$A$1:$C$1005,2,0)))","v":""},{"$f":"IF(D70=\"\",\"\",(VLOOKUP(D70,'Membership #'!$A$1:$C$1005,3,0)))","v":""},null,null,""]
["","","",null,{"$f":"IF(D71=\"\",\"\",(VLOOKUP(D71,'Membership #'!$A$1:$C$1005,2,0)))","v":""},{"$f":"IF(D71=\"\",\"\",(VLOOKUP(D71,'Membership #'!$A$1:$C$1005,3,0)))","v":""},null,null,{"$f":"IF(G71=\"n\",\"No Time\",IF(G71=\"x\",\"Scratch\",IF(G71<>\"\",SUM(G71+H71),\"\")))","v":""}]
["",{"$f":"IF(D72<>\"\",RANK(A72,A$8:A$99),\"\")","v":""},"",null,{"$f":"IF(D72=\"\",\"\",(VLOOKUP(D72,'Membership #'!$A$1:$C$1005,2,0)))","v":""},{"$f":"IF(D72=\"\",\"\",(VLOOKUP(D72,'Membership #'!$A$1:$C$1005,3,0)))","v":""},null,null,""]
["","","",null,{"$f":"IF(D73=\"\",\"\",(VLOOKUP(D73,'Membership #'!$A$1:$C$1005,2,0)))","v":""},{"$f":"IF(D73=\"\",\"\",(VLOOKUP(D73,'Membership #'!$A$1:$C$1005,3,0)))","v":""},null,null,""]
["","","",null,{"$f":"IF(D74=\"\",\"\",(VLOOKUP(D74,'Membership #'!$A$1:$C$1005,2,0)))","v":""},{"$f":"IF(D74=\"\",\"\",(VLOOKUP(D74,'Membership #'!$A$1:$C$1005,3,0)))","v":""},null,null,""]
["","","",null,{"$f":"IF(D75=\"\",\"\",(VLOOKUP(D75,'Membership #'!$A$1:$C$1005,2,0)))","v":""},{"$f":"IF(D75=\"\",\"\",(VLOOKUP(D75,'Membership #'!$A$1:$C$1005,3,0)))","v":""},null,null,""]
["","","",null,{"$f":"IF(D76=\"\",\"\",(VLOOKUP(D76,'Membership #'!$A$1:$C$1005,2,0)))","v":""},{"$f":"IF(D76=\"\",\"\",(VLOOKUP(D76,'Membership #'!$A$1:$C$1005,3,0)))","v":""},null,null,""]
["","","",null,{"$f":"IF(D77=\"\",\"\",(VLOOKUP(D77,'Membership #'!$A$1:$C$1005,2,0)))","v":""},{"$f":"IF(D77=\"\",\"\",(VLOOKUP(D77,'Membership #'!$A$1:$C$1005,3,0)))","v":""},null,null,""]
["","","",null,{"$f":"IF(D78=\"\",\"\",(VLOOKUP(D78,'Membership #'!$A$1:$C$1005,2,0)))","v":""},{"$f":"IF(D78=\"\",\"\",(VLOOKUP(D78,'Membership #'!$A$1:$C$1005,3,0)))","v":""},null,null,""]
["","","",null,{"$f":"IF(D79=\"\",\"\",(VLOOKUP(D79,'Membership #'!$A$1:$C$1005,2,0)))","v":""},{"$f":"IF(D79=\"\",\"\",(VLOOKUP(D79,'Membership #'!$A$1:$C$1005,3,0)))","v":""},null,null,""]
["","","",null,{"$f":"IF(D80=\"\",\"\",(VLOOKUP(D80,'Membership #'!$A$1:$C$1005,2,0)))","v":""},{"$f":"IF(D80=\"\",\"\",(VLOOKUP(D80,'Membership #'!$A$1:$C$1005,3,0)))","v":""},null,null,""]
["","","",null,{"$f":"IF(D81=\"\",\"\",(VLOOKUP(D81,'Membership #'!$A$1:$C$1005,2,0)))","v":""},{"$f":"IF(D81=\"\",\"\",(VLOOKUP(D81,'Membership #'!$A$1:$C$1005,3,0)))","v":""},null,null,""]
["","","",null,{"$f":"IF(D82=\"\",\"\",(VLOOKUP(D82,'Membership #'!$A$1:$C$1005,2,0)))","v":""},{"$f":"IF(D82=\"\",\"\",(VLOOKUP(D82,'Membership #'!$A$1:$C$1005,3,0)))","v":""},null,null,""]
["","","",null,{"$f":"IF(D83=\"\",\"\",(VLOOKUP(D83,'Membership #'!$A$1:$C$1005,2,0)))","v":""},{"$f":"IF(D83=\"\",\"\",(VLOOKUP(D83,'Membership #'!$A$1:$C$1005,3,0)))","v":""},null,null,""]
["","","",null,{"$f":"IF(D84=\"\",\"\",(VLOOKUP(D84,'Membership #'!$A$1:$C$1005,2,0)))","v":""},{"$f":"IF(D84=\"\",\"\",(VLOOKUP(D84,'Membership #'!$A$1:$C$1005,3,0)))","v":""},null,null,""]
["","","",null,{"$f":"IF(D85=\"\",\"\",(VLOOKUP(D85,'Membership #'!$A$1:$C$1005,2,0)))","v":""},{"$f":"IF(D85=\"\",\"\",(VLOOKUP(D85,'Membership #'!$A$1:$C$1005,3,0)))","v":""},null,null,""]
["","","",null,{"$f":"IF(D86=\"\",\"\",(VLOOKUP(D86,'Membership #'!$A$1:$C$1005,2,0)))","v":""},{"$f":"IF(D86=\"\",\"\",(VLOOKUP(D86,'Membership #'!$A$1:$C$1005,3,0)))","v":""},null,null,""]
["","","",null,{"$f":"IF(D87=\"\",\"\",(VLOOKUP(D87,'Membership #'!$A$1:$C$1005,2,0)))","v":""},{"$f":"IF(D87=\"\",\"\",(VLOOKUP(D87,'Membership #'!$A$1:$C$1005,3,0)))","v":""},null,null,""]
["","","",null,{"$f":"IF(D88=\"\",\"\",(VLOOKUP(D88,'Membership #'!$A$1:$C$1005,2,0)))","v":""},{"$f":"IF(D88=\"\",\"\",(VLOOKUP(D88,'Membership #'!$A$1:$C$1005,3,0)))","v":""},null,null,""]
["","","",null,{"$f":"IF(D89=\"\",\"\",(VLOOKUP(D89,'Membership #'!$A$1:$C$1005,2,0)))","v":""},{"$f":"IF(D89=\"\",\"\",(VLOOKUP(D89,'Membership #'!$A$1:$C$1005,3,0)))","v":""},null,null,""]
["","","",null,{"$f":"IF(D90=\"\",\"\",(VLOOKUP(D90,'Membership #'!$A$1:$C$1005,2,0)))","v":""},{"$f":"IF(D90=\"\",\"\",(VLOOKUP(D90,'Membership #'!$A$1:$C$1005,3,0)))","v":""},null,null,""]
["","","",null,{"$f":"IF(D91=\"\",\"\",(VLOOKUP(D91,'Membership #'!$A$1:$C$1005,2,0)))","v":""},{"$f":"IF(D91=\"\",\"\",(VLOOKUP(D91,'Membership #'!$A$1:$C$1005,3,0)))","v":""},null,null,""]
["","","",null,{"$f":"IF(D92=\"\",\"\",(VLOOKUP(D92,'Membership #'!$A$1:$C$1005,2,0)))","v":""},{"$f":"IF(D92=\"\",\"\",(VLOOKUP(D92,'Membership #'!$A$1:$C$1005,3,0)))","v":""},null,null,""]
["","","",null,{"$f":"IF(D93=\"\",\"\",(VLOOKUP(D93,'Membership #'!$A$1:$C$1005,2,0)))","v":""},{"$f":"IF(D93=\"\",\"\",(VLOOKUP(D93,'Membership #'!$A$1:$C$1005,3,0)))","v":""},null,null,""]
["","","",null,{"$f":"IF(D94=\"\",\"\",(VLOOKUP(D94,'Membership #'!$A$1:$C$1005,2,0)))","v":""},{"$f":"IF(D94=\"\",\"\",(VLOOKUP(D94,'Membership #'!$A$1:$C$1005,3,0)))","v":""},null,null,""]
["","","",null,{"$f":"IF(D95=\"\",\"\",(VLOOKUP(D95,'Membership #'!$A$1:$C$1005,2,0)))","v":""},{"$f":"IF(D95=\"\",\"\",(VLOOKUP(D95,'Membership #'!$A$1:$C$1005,3,0)))","v":""},null,null,""]
["","","",null,{"$f":"IF(D96=\"\",\"\",(VLOOKUP(D96,'Membership #'!$A$1:$C$1005,2,0)))","v":""},{"$f":"IF(D96=\"\",\"\",(VLOOKUP(D96,'Membership #'!$A$1:$C$1005,3,0)))","v":""},null,null,""]
["","","",null,{"$f":"IF(D97=\"\",\"\",(VLOOKUP(D97,'Membership #'!$A$1:$C$1005,2,0)))","v":""},{"$f":"IF(D97=\"\",\"\",(VLOOKUP(D97,'Membership #'!$A$1:$C$1005,3,0)))","v":""},null,null,""]
["","","",null,{"$f":"IF(D98=\"\",\"\",(VLOOKUP(D98,'Membership #'!$A$1:$C$1005,2,0)))","v":""},{"$f":"IF(D98=\"\",\"\",(VLOOKUP(D98,'Membership #'!$A$1:$C$1005,3,0)))","v":""},null,null,""]
["","","",null,{"$f":"IF(D99=\"\",\"\",(VLOOKUP(D99,'Membership #'!$A$1:$C$1005,2,0)))","v":""},{"$f":"IF(D99=\"\",\"\",(VLOOKUP(D99,'Membership #'!$A$1:$C$1005,3,0)))","v":""},null,null,""]

{"sheet":"ADULT GREEN POLES","index":12,"n_rows":101,"n_cols":26,"rows_kept":101,"cut":false,"hidden":false,"merged":[[5,12,5,15],[0,0,0,10],[1,0,1,10],[2,0,2,3],[2,6,2,10],[3,0,6,0],[3,1,6,1],[3,2,6,2],[3,3,6,3],[3,4,6,4],[3,9,6,9],[3,10,6,10],[3,5,6,5],[3,6,6,6],[3,7,6,7],[3,8,6,8]]}
["Tom Burt & Mark McGuire Memorial Jackpot Aug 21, 2021",null,null,null,null,null,null,null,null,null,null,null,"x=Scratch"]
["ADULT GREEN POLES",null,null,null,null,null,null,null,null,null,null,null,"n=No Time"]
["# Enteries:",null,null,null,{"$f":"COUNTIF($D$8:$D$100,\">0\")","v":1},null,null,null,null,null,null,null,null,null,null,null,null,"Don't Erase these numbers below!!"]
["Rand Draw","Seed","Running Order","RING #      ","NAME","HORSE NAME","TIME","PENALTY ","TOTAL","PLACINGS","POINTS",null,null,null,null,null,null,{"$f":"IF(N9=2,7,IF(N9=3,6,IF(N9=4,5,IF(N9=5,4,IF(AND(N9>5,N11>600),3,IF(AND(N9>5,N11<600,N11>299.99),2,IF(AND(N9>5,N11<300),1,8)))))))","v":7},1,2,3,4,5,6,7,8]
[null,null,null,null,null,null,null,null,null,null,null,null,null,null,null,null,null,null,299,"$300-","$600 -"]
[null,null,null,null,null,null,null,null,null,null,null,null,"ADULT GREEN POLES",null,null,null,null,null,"or less",599,"More","5 Entries","4 Entries","3 Entries","2 Entries"]
[null,null,null,null,null,null,null,null,null,null,null,null,null,null,null,null,null,"1st",0.32,0.27,0.24,0.35,0.4,0.46,0.6]
[{"$f":"IF(D8<>\"\",RAND(),\"\")","v":0.60161539343494719},{"$f":"IF(D8<>\"\",RANK(A8,A$8:A$101),\"\")","v":1},1,"909b",{"$f":"IF(D8=\"\",\"\",(VLOOKUP(D8,'Membership #'!$A$1:$C$1005,2,0)))","v":"Bryden MacNeil"},{"$f":"IF(D8=\"\",\"\",(VLOOKUP(D8,'Membership #'!$A$1:$C$1005,3,0)))","v":"Martha's Tivio Moon"},27.248000000000001,null,{"$f":"IF(G8=\"n\",\"No Time\",IF(G8=\"x\",\"Scratch\",IF(G8<>\"\",SUM(G8+H8),\"\")))","v":27.248000000000001},null,null,null,"Added",25,null,null,null,"2nd",0.23,0.22,0.19,0.25,0.28000000000000003,0.34,0.4]
[0.30875221339288927,2,2,969,{"$f":"IF(D9=\"\",\"\",(VLOOKUP(D9,'Membership #'!$A$1:$C$1005,2,0)))","v":"Kenzie Cook"},{"$f":"IF(D9=\"\",\"\",(VLOOKUP(D9,'Membership #'!$A$1:$C$1005,3,0)))","v":"Pocos Lady Emeralda"},45.295000000000002,null,{"$f":"IF(G9=\"n\",\"No Time\",IF(G9=\"x\",\"Scratch\",IF(G9<>\"\",SUM(G9+H9),\"\")))","v":45.295000000000002},null,null,null,"Entries",2,null,10,"per head","3rd",0.15,0.18,0.16,0.17,0.18,0.2]
["","","",null,{"$f":"IF(D10=\"\",\"\",(VLOOKUP(D10,'Membership #'!$A$1:$C$1005,2,0)))","v":""},{"$f":"IF(D10=\"\",\"\",(VLOOKUP(D10,'Membership #'!$A$1:$C$1005,3,0)))","v":""},null,null,{"$f":"IF(G10=\"n\",\"No Time\",IF(G10=\"x\",\"Scratch\",IF(G10<>\"\",SUM(G10+H10),\"\")))","v":""},null,null,null,"Jackpot",{"$f":"P9*N9","v":20},null,0.85,"payback","4th",0.12,0.13,0.13,0.13,0.14000000000000001]
["","","",null,{"$f":"IF(D11=\"\",\"\",(VLOOKUP(D11,'Membership #'!$A$1:$C$1005,2,0)))","v":""},{"$f":"IF(D11=\"\",\"\",(VLOOKUP(D11,'Membership #'!$A$1:$C$1005,3,0)))","v":""},null,null,{"$f":"IF(G11=\"n\",\"No Time\",IF(G11=\"x\",\"Scratch\",IF(G11<>\"\",SUM(G11+H11),\"\")))","v":""},null,null,null,"Total Money",{"$f":"N8+(N10*P10)","v":42},null,{"$f":"N10*P10","v":17},"Jackpot","5th",0.1,0.09,0.08,0.1]
["","","",null,{"$f":"IF(D12=\"\",\"\",(VLOOKUP(D12,'Membership #'!$A$1:$C$1005,2,0)))","v":""},{"$f":"IF(D12=\"\",\"\",(VLOOKUP(D12,'Membership #'!$A$1:$C$1005,3,0)))","v":""},null,null,"",null,null,null,null,"Percentage","Money","Ring #",null,"6th",0.08,0.06,0.06]
["","","",null,{"$f":"IF(D13=\"\",\"\",(VLOOKUP(D13,'Membership #'!$A$1:$C$1005,2,0)))","v":""},{"$f":"IF(D13=\"\",\"\",(VLOOKUP(D13,'Membership #'!$A$1:$C$1005,3,0)))","v":""},null,null,"",null,null,null,"1st",1,{"$f":"IF(N13<>0,N$11*N13,\"\")","v":42},null,{"$f":"IF(P13=\"\",\"\",(VLOOKUP(P13,'Membership #'!$A$1:$C$1005,2,0)))","v":""},"7th",null,0.03,0.05]
["","","",null,{"$f":"IF(D14=\"\",\"\",(VLOOKUP(D14,'Membership #'!$A$1:$C$1005,2,0)))","v":""},{"$f":"IF(D14=\"\",\"\",(VLOOKUP(D14,'Membership #'!$A$1:$C$1005,3,0)))","v":""},null,null,{"$f":"IF(G14=\"n\",\"No Time\",IF(G14=\"x\",\"Scratch\",IF(G14<>\"\",SUM(G14+H14),\"\")))","v":""},null,null,null,"2nd",null,"",null,{"$f":"IF(P14=\"\",\"\",(VLOOKUP(P14,'Membership #'!$A$1:$C$1005,2,0)))","v":""},"8th",null,0.02,0.04]
["","","",null,{"$f":"IF(D15=\"\",\"\",(VLOOKUP(D15,'Membership #'!$A$1:$C$1005,2,0)))","v":""},{"$f":"IF(D15=\"\",\"\",(VLOOKUP(D15,'Membership #'!$A$1:$C$1005,3,0)))","v":""},null,null,{"$f":"IF(G15=\"n\",\"No Time\",IF(G15=\"x\",\"Scratch\",IF(G15<>\"\",SUM(G15+H15),\"\")))","v":""},null,null,null,"3rd",null,"",null,{"$f":"IF(P15=\"\",\"\",(VLOOKUP(P15,'Membership #'!$A$1:$C$1005,2,0)))","v":""},"9th",null,null,0.03]
["","","",null,{"$f":"IF(D16=\"\",\"\",(VLOOKUP(D16,'Membership #'!$A$1:$C$1005,2,0)))","v":""},{"$f":"IF(D16=\"\",\"\",(VLOOKUP(D16,'Membership #'!$A$1:$C$1005,3,0)))","v":""},null,null,"",null,null,null,"4th",null,"",null,{"$f":"IF(P16=\"\",\"\",(VLOOKUP(P16,'Membership #'!$A$1:$C$1005,2,0)))","v":""},"10th",null,null,0.02]
["","","",null,{"$f":"IF(D17=\"\",\"\",(VLOOKUP(D17,'Membership #'!$A$1:$C$1005,2,0)))","v":""},{"$f":"IF(D17=\"\",\"\",(VLOOKUP(D17,'Membership #'!$A$1:$C$1005,3,0)))","v":""},null,null,"",null,null,null,"5th",null,"",null,{"$f":"IF(P17=\"\",\"\",(VLOOKUP(P17,'Membership #'!$A$1:$C$1005,2,0)))","v":""}]
["","","",null,{"$f":"IF(D18=\"\",\"\",(VLOOKUP(D18,'Membership #'!$A$1:$C$1005,2,0)))","v":""},{"$f":"IF(D18=\"\",\"\",(VLOOKUP(D18,'Membership #'!$A$1:$C$1005,3,0)))","v":""},null,null,"",null,null,null,"6th",null,"",null,{"$f":"IF(P18=\"\",\"\",(VLOOKUP(P18,'Membership #'!$A$1:$C$1005,2,0)))","v":""}]
["","","",null,{"$f":"IF(D19=\"\",\"\",(VLOOKUP(D19,'Membership #'!$A$1:$C$1005,2,0)))","v":""},{"$f":"IF(D19=\"\",\"\",(VLOOKUP(D19,'Membership #'!$A$1:$C$1005,3,0)))","v":""},null,null,"",null,null,null,"7th",{"$f":"HLOOKUP($R$4,$S$4:$Z$17,10,0)","v":0},"",null,{"$f":"IF(P19=\"\",0,(VLOOKUP(P19,'Membership #'!$A$1:$C$1005,2,0)))","v":0}]
["","","",null,{"$f":"IF(D20=\"\",\"\",(VLOOKUP(D20,'Membership #'!$A$1:$C$1005,2,0)))","v":""},{"$f":"IF(D20=\"\",\"\",(VLOOKUP(D20,'Membership #'!$A$1:$C$1005,3,0)))","v":""},null,null,"",null,null,null,"8th",{"$f":"HLOOKUP($R$4,$S$4:$Z$17,11,0)","v":0},"",null,{"$f":"IF(P20=\"\",0,(VLOOKUP(P20,'Membership #'!$A$1:$C$1005,2,0)))","v":0}]
["","","",null,{"$f":"IF(D21=\"\",\"\",(VLOOKUP(D21,'Membership #'!$A$1:$C$1005,2,0)))","v":""},{"$f":"IF(D21=\"\",\"\",(VLOOKUP(D21,'Membership #'!$A$1:$C$1005,3,0)))","v":""},null,null,"",null,null,null,"9th",{"$f":"HLOOKUP($R$4,$S$4:$Z$17,12,0)","v":0},""]
["","","",null,{"$f":"IF(D22=\"\",\"\",(VLOOKUP(D22,'Membership #'!$A$1:$C$1005,2,0)))","v":""},{"$f":"IF(D22=\"\",\"\",(VLOOKUP(D22,'Membership #'!$A$1:$C$1005,3,0)))","v":""},null,null,"",null,null,null,"10th",{"$f":"HLOOKUP($R$4,$S$4:$Z$17,13,0)","v":0},""]
["","","",null,{"$f":"IF(D23=\"\",\"\",(VLOOKUP(D23,'Membership #'!$A$1:$C$1005,2,0)))","v":""},{"$f":"IF(D23=\"\",\"\",(VLOOKUP(D23,'Membership #'!$A$1:$C$1005,3,0)))","v":""},null,null,"",null,null,null,"Total Money",null,{"$f":"SUM(O13:O22)","v":42}]
["","","",null,{"$f":"IF(D24=\"\",\"\",(VLOOKUP(D24,'Membership #'!$A$1:$C$1005,2,0)))","v":""},{"$f":"IF(D24=\"\",\"\",(VLOOKUP(D24,'Membership #'!$A$1:$C$1005,3,0)))","v":""},null,null,""]
["","","",null,{"$f":"IF(D25=\"\",\"\",(VLOOKUP(D25,'Membership #'!$A$1:$C$1005,2,0)))","v":""},{"$f":"IF(D25=\"\",\"\",(VLOOKUP(D25,'Membership #'!$A$1:$C$1005,3,0)))","v":""},null,null,""]
["","","",null,{"$f":"IF(D26=\"\",\"\",(VLOOKUP(D26,'Membership #'!$A$1:$C$1005,2,0)))","v":""},{"$f":"IF(D26=\"\",\"\",(VLOOKUP(D26,'Membership #'!$A$1:$C$1005,3,0)))","v":""},null,null,""]
["","","",null,{"$f":"IF(D27=\"\",\"\",(VLOOKUP(D27,'Membership #'!$A$1:$C$1005,2,0)))","v":""},{"$f":"IF(D27=\"\",\"\",(VLOOKUP(D27,'Membership #'!$A$1:$C$1005,3,0)))","v":""},null,null,""]
["","","",null,{"$f":"IF(D28=\"\",\"\",(VLOOKUP(D28,'Membership #'!$A$1:$C$1005,2,0)))","v":""},{"$f":"IF(D28=\"\",\"\",(VLOOKUP(D28,'Membership #'!$A$1:$C$1005,3,0)))","v":""},null,null,""]
["","","",null,{"$f":"IF(D29=\"\",\"\",(VLOOKUP(D29,'Membership #'!$A$1:$C$1005,2,0)))","v":""},{"$f":"IF(D29=\"\",\"\",(VLOOKUP(D29,'Membership #'!$A$1:$C$1005,3,0)))","v":""},null,null,""]
["","","",null,{"$f":"IF(D30=\"\",\"\",(VLOOKUP(D30,'Membership #'!$A$1:$C$1005,2,0)))","v":""},{"$f":"IF(D30=\"\",\"\",(VLOOKUP(D30,'Membership #'!$A$1:$C$1005,3,0)))","v":""},null,null,""]
["","","",null,{"$f":"IF(D31=\"\",\"\",(VLOOKUP(D31,'Membership #'!$A$1:$C$1005,2,0)))","v":""},{"$f":"IF(D31=\"\",\"\",(VLOOKUP(D31,'Membership #'!$A$1:$C$1005,3,0)))","v":""},null,null,""]
["","","",null,{"$f":"IF(D32=\"\",\"\",(VLOOKUP(D32,'Membership #'!$A$1:$C$1005,2,0)))","v":""},{"$f":"IF(D32=\"\",\"\",(VLOOKUP(D32,'Membership #'!$A$1:$C$1005,3,0)))","v":""},null,null,""]
["","","",null,{"$f":"IF(D33=\"\",\"\",(VLOOKUP(D33,'Membership #'!$A$1:$C$1005,2,0)))","v":""},{"$f":"IF(D33=\"\",\"\",(VLOOKUP(D33,'Membership #'!$A$1:$C$1005,3,0)))","v":""},null,null,""]
["","","",null,{"$f":"IF(D34=\"\",\"\",(VLOOKUP(D34,'Membership #'!$A$1:$C$1005,2,0)))","v":""},{"$f":"IF(D34=\"\",\"\",(VLOOKUP(D34,'Membership #'!$A$1:$C$1005,3,0)))","v":""},null,null,""]
["","","",null,{"$f":"IF(D35=\"\",\"\",(VLOOKUP(D35,'Membership #'!$A$1:$C$1005,2,0)))","v":""},{"$f":"IF(D35=\"\",\"\",(VLOOKUP(D35,'Membership #'!$A$1:$C$1005,3,0)))","v":""},null,null,""]
["","","",null,{"$f":"IF(D36=\"\",\"\",(VLOOKUP(D36,'Membership #'!$A$1:$C$1005,2,0)))","v":""},{"$f":"IF(D36=\"\",\"\",(VLOOKUP(D36,'Membership #'!$A$1:$C$1005,3,0)))","v":""},null,null,""]
["","","",null,{"$f":"IF(D37=\"\",\"\",(VLOOKUP(D37,'Membership #'!$A$1:$C$1005,2,0)))","v":""},{"$f":"IF(D37=\"\",\"\",(VLOOKUP(D37,'Membership #'!$A$1:$C$1005,3,0)))","v":""},null,null,""]
["","","",null,{"$f":"IF(D38=\"\",\"\",(VLOOKUP(D38,'Membership #'!$A$1:$C$1005,2,0)))","v":""},{"$f":"IF(D38=\"\",\"\",(VLOOKUP(D38,'Membership #'!$A$1:$C$1005,3,0)))","v":""},null,null,""]
["","","",null,{"$f":"IF(D39=\"\",\"\",(VLOOKUP(D39,'Membership #'!$A$1:$C$1005,2,0)))","v":""},{"$f":"IF(D39=\"\",\"\",(VLOOKUP(D39,'Membership #'!$A$1:$C$1005,3,0)))","v":""},null,null,""]
["","","",null,{"$f":"IF(D40=\"\",\"\",(VLOOKUP(D40,'Membership #'!$A$1:$C$1005,2,0)))","v":""},{"$f":"IF(D40=\"\",\"\",(VLOOKUP(D40,'Membership #'!$A$1:$C$1005,3,0)))","v":""},null,null,""]
["","","",null,{"$f":"IF(D41=\"\",\"\",(VLOOKUP(D41,'Membership #'!$A$1:$C$1005,2,0)))","v":""},{"$f":"IF(D41=\"\",\"\",(VLOOKUP(D41,'Membership #'!$A$1:$C$1005,3,0)))","v":""},null,null,""]
["","","",null,{"$f":"IF(D42=\"\",\"\",(VLOOKUP(D42,'Membership #'!$A$1:$C$1005,2,0)))","v":""},{"$f":"IF(D42=\"\",\"\",(VLOOKUP(D42,'Membership #'!$A$1:$C$1005,3,0)))","v":""},null,null,""]
["","","",null,{"$f":"IF(D43=\"\",\"\",(VLOOKUP(D43,'Membership #'!$A$1:$C$1005,2,0)))","v":""},{"$f":"IF(D43=\"\",\"\",(VLOOKUP(D43,'Membership #'!$A$1:$C$1005,3,0)))","v":""},null,null,""]
["","","",null,{"$f":"IF(D44=\"\",\"\",(VLOOKUP(D44,'Membership #'!$A$1:$C$1005,2,0)))","v":""},{"$f":"IF(D44=\"\",\"\",(VLOOKUP(D44,'Membership #'!$A$1:$C$1005,3,0)))","v":""},null,null,""]
["","","",null,{"$f":"IF(D45=\"\",\"\",(VLOOKUP(D45,'Membership #'!$A$1:$C$1005,2,0)))","v":""},{"$f":"IF(D45=\"\",\"\",(VLOOKUP(D45,'Membership #'!$A$1:$C$1005,3,0)))","v":""},null,null,""]
["","","",null,{"$f":"IF(D46=\"\",\"\",(VLOOKUP(D46,'Membership #'!$A$1:$C$1005,2,0)))","v":""},{"$f":"IF(D46=\"\",\"\",(VLOOKUP(D46,'Membership #'!$A$1:$C$1005,3,0)))","v":""},null,null,""]
["","","",null,{"$f":"IF(D47=\"\",\"\",(VLOOKUP(D47,'Membership #'!$A$1:$C$1005,2,0)))","v":""},{"$f":"IF(D47=\"\",\"\",(VLOOKUP(D47,'Membership #'!$A$1:$C$1005,3,0)))","v":""},null,null,""]
["","","",null,{"$f":"IF(D48=\"\",\"\",(VLOOKUP(D48,'Membership #'!$A$1:$C$1005,2,0)))","v":""},{"$f":"IF(D48=\"\",\"\",(VLOOKUP(D48,'Membership #'!$A$1:$C$1005,3,0)))","v":""},null,null,""]
["","","",null,{"$f":"IF(D49=\"\",\"\",(VLOOKUP(D49,'Membership #'!$A$1:$C$1005,2,0)))","v":""},{"$f":"IF(D49=\"\",\"\",(VLOOKUP(D49,'Membership #'!$A$1:$C$1005,3,0)))","v":""},null,null,""]
["","","",null,{"$f":"IF(D50=\"\",\"\",(VLOOKUP(D50,'Membership #'!$A$1:$C$1005,2,0)))","v":""},{"$f":"IF(D50=\"\",\"\",(VLOOKUP(D50,'Membership #'!$A$1:$C$1005,3,0)))","v":""},null,null,""]
["","","",null,{"$f":"IF(D51=\"\",\"\",(VLOOKUP(D51,'Membership #'!$A$1:$C$1005,2,0)))","v":""},{"$f":"IF(D51=\"\",\"\",(VLOOKUP(D51,'Membership #'!$A$1:$C$1005,3,0)))","v":""},null,null,""]
["","","",null,{"$f":"IF(D52=\"\",\"\",(VLOOKUP(D52,'Membership #'!$A$1:$C$1005,2,0)))","v":""},{"$f":"IF(D52=\"\",\"\",(VLOOKUP(D52,'Membership #'!$A$1:$C$1005,3,0)))","v":""},null,null,""]
["","","",null,{"$f":"IF(D53=\"\",\"\",(VLOOKUP(D53,'Membership #'!$A$1:$C$1005,2,0)))","v":""},{"$f":"IF(D53=\"\",\"\",(VLOOKUP(D53,'Membership #'!$A$1:$C$1005,3,0)))","v":""},null,null,""]
["","","",null,{"$f":"IF(D54=\"\",\"\",(VLOOKUP(D54,'Membership #'!$A$1:$C$1005,2,0)))","v":""},{"$f":"IF(D54=\"\",\"\",(VLOOKUP(D54,'Membership #'!$A$1:$C$1005,3,0)))","v":""},null,null,""]
["","","",null,{"$f":"IF(D55=\"\",\"\",(VLOOKUP(D55,'Membership #'!$A$1:$C$1005,2,0)))","v":""},{"$f":"IF(D55=\"\",\"\",(VLOOKUP(D55,'Membership #'!$A$1:$C$1005,3,0)))","v":""},null,null,""]
["","","",null,{"$f":"IF(D56=\"\",\"\",(VLOOKUP(D56,'Membership #'!$A$1:$C$1005,2,0)))","v":""},{"$f":"IF(D56=\"\",\"\",(VLOOKUP(D56,'Membership #'!$A$1:$C$1005,3,0)))","v":""},null,null,""]
["","","",null,{"$f":"IF(D57=\"\",\"\",(VLOOKUP(D57,'Membership #'!$A$1:$C$1005,2,0)))","v":""},{"$f":"IF(D57=\"\",\"\",(VLOOKUP(D57,'Membership #'!$A$1:$C$1005,3,0)))","v":""},null,null,""]
["","","",null,{"$f":"IF(D58=\"\",\"\",(VLOOKUP(D58,'Membership #'!$A$1:$C$1005,2,0)))","v":""},{"$f":"IF(D58=\"\",\"\",(VLOOKUP(D58,'Membership #'!$A$1:$C$1005,3,0)))","v":""},null,null,""]
["","","",null,{"$f":"IF(D59=\"\",\"\",(VLOOKUP(D59,'Membership #'!$A$1:$C$1005,2,0)))","v":""},{"$f":"IF(D59=\"\",\"\",(VLOOKUP(D59,'Membership #'!$A$1:$C$1005,3,0)))","v":""},null,null,""]
["","","",null,{"$f":"IF(D60=\"\",\"\",(VLOOKUP(D60,'Membership #'!$A$1:$C$1005,2,0)))","v":""},{"$f":"IF(D60=\"\",\"\",(VLOOKUP(D60,'Membership #'!$A$1:$C$1005,3,0)))","v":""},null,null,""]
["","","",null,{"$f":"IF(D61=\"\",\"\",(VLOOKUP(D61,'Membership #'!$A$1:$C$1005,2,0)))","v":""},{"$f":"IF(D61=\"\",\"\",(VLOOKUP(D61,'Membership #'!$A$1:$C$1005,3,0)))","v":""},null,null,""]
["","","",null,{"$f":"IF(D62=\"\",\"\",(VLOOKUP(D62,'Membership #'!$A$1:$C$1005,2,0)))","v":""},{"$f":"IF(D62=\"\",\"\",(VLOOKUP(D62,'Membership #'!$A$1:$C$1005,3,0)))","v":""},null,null,""]
["","","",null,{"$f":"IF(D63=\"\",\"\",(VLOOKUP(D63,'Membership #'!$A$1:$C$1005,2,0)))","v":""},{"$f":"IF(D63=\"\",\"\",(VLOOKUP(D63,'Membership #'!$A$1:$C$1005,3,0)))","v":""},null,null,""]
["","","",null,{"$f":"IF(D64=\"\",\"\",(VLOOKUP(D64,'Membership #'!$A$1:$C$1005,2,0)))","v":""},{"$f":"IF(D64=\"\",\"\",(VLOOKUP(D64,'Membership #'!$A$1:$C$1005,3,0)))","v":""},null,null,""]
["","","",null,{"$f":"IF(D65=\"\",\"\",(VLOOKUP(D65,'Membership #'!$A$1:$C$1005,2,0)))","v":""},{"$f":"IF(D65=\"\",\"\",(VLOOKUP(D65,'Membership #'!$A$1:$C$1005,3,0)))","v":""},null,null,""]
["","","",null,{"$f":"IF(D66=\"\",\"\",(VLOOKUP(D66,'Membership #'!$A$1:$C$1005,2,0)))","v":""},{"$f":"IF(D66=\"\",\"\",(VLOOKUP(D66,'Membership #'!$A$1:$C$1005,3,0)))","v":""},null,null,""]
["","","",null,{"$f":"IF(D67=\"\",\"\",(VLOOKUP(D67,'Membership #'!$A$1:$C$1005,2,0)))","v":""},{"$f":"IF(D67=\"\",\"\",(VLOOKUP(D67,'Membership #'!$A$1:$C$1005,3,0)))","v":""},null,null,""]
["","","",null,{"$f":"IF(D68=\"\",\"\",(VLOOKUP(D68,'Membership #'!$A$1:$C$1005,2,0)))","v":""},{"$f":"IF(D68=\"\",\"\",(VLOOKUP(D68,'Membership #'!$A$1:$C$1005,3,0)))","v":""},null,null,""]
["","","",null,{"$f":"IF(D69=\"\",\"\",(VLOOKUP(D69,'Membership #'!$A$1:$C$1005,2,0)))","v":""},{"$f":"IF(D69=\"\",\"\",(VLOOKUP(D69,'Membership #'!$A$1:$C$1005,3,0)))","v":""},null,null,""]
["","","",null,{"$f":"IF(D70=\"\",\"\",(VLOOKUP(D70,'Membership #'!$A$1:$C$1005,2,0)))","v":""},{"$f":"IF(D70=\"\",\"\",(VLOOKUP(D70,'Membership #'!$A$1:$C$1005,3,0)))","v":""},null,null,""]
["","","",null,{"$f":"IF(D71=\"\",\"\",(VLOOKUP(D71,'Membership #'!$A$1:$C$1005,2,0)))","v":""},{"$f":"IF(D71=\"\",\"\",(VLOOKUP(D71,'Membership #'!$A$1:$C$1005,3,0)))","v":""},null,null,""]
[{"$f":"IF(D72<>\"\",RAND(),\"\")","v":""},{"$f":"IF(D72<>\"\",RANK(A72,A$8:A$101),\"\")","v":""},"",null,{"$f":"IF(D72=\"\",\"\",(VLOOKUP(D72,'Membership #'!$A$1:$C$1005,2,0)))","v":""},{"$f":"IF(D72=\"\",\"\",(VLOOKUP(D72,'Membership #'!$A$1:$C$1005,3,0)))","v":""},null,null,""]
["","","",null,{"$f":"IF(D73=\"\",\"\",(VLOOKUP(D73,'Membership #'!$A$1:$C$1005,2,0)))","v":""},{"$f":"IF(D73=\"\",\"\",(VLOOKUP(D73,'Membership #'!$A$1:$C$1005,3,0)))","v":""},null,null,{"$f":"IF(G73=\"n\",\"No Time\",IF(G73=\"x\",\"Scratch\",IF(G73<>\"\",SUM(G73+H73),\"\")))","v":""}]
["","","",null,{"$f":"IF(D74=\"\",\"\",(VLOOKUP(D74,'Membership #'!$A$1:$C$1005,2,0)))","v":""},{"$f":"IF(D74=\"\",\"\",(VLOOKUP(D74,'Membership #'!$A$1:$C$1005,3,0)))","v":""},null,null,""]
["","","",null,{"$f":"IF(D75=\"\",\"\",(VLOOKUP(D75,'Membership #'!$A$1:$C$1005,2,0)))","v":""},{"$f":"IF(D75=\"\",\"\",(VLOOKUP(D75,'Membership #'!$A$1:$C$1005,3,0)))","v":""},null,null,""]
["","","",null,{"$f":"IF(D76=\"\",\"\",(VLOOKUP(D76,'Membership #'!$A$1:$C$1005,2,0)))","v":""},{"$f":"IF(D76=\"\",\"\",(VLOOKUP(D76,'Membership #'!$A$1:$C$1005,3,0)))","v":""},null,null,""]
["","","",null,{"$f":"IF(D77=\"\",\"\",(VLOOKUP(D77,'Membership #'!$A$1:$C$1005,2,0)))","v":""},{"$f":"IF(D77=\"\",\"\",(VLOOKUP(D77,'Membership #'!$A$1:$C$1005,3,0)))","v":""},null,null,""]
["","","",null,{"$f":"IF(D78=\"\",\"\",(VLOOKUP(D78,'Membership #'!$A$1:$C$1005,2,0)))","v":""},{"$f":"IF(D78=\"\",\"\",(VLOOKUP(D78,'Membership #'!$A$1:$C$1005,3,0)))","v":""},null,null,""]
["","","",null,{"$f":"IF(D79=\"\",\"\",(VLOOKUP(D79,'Membership #'!$A$1:$C$1005,2,0)))","v":""},{"$f":"IF(D79=\"\",\"\",(VLOOKUP(D79,'Membership #'!$A$1:$C$1005,3,0)))","v":""},null,null,""]
["","","",null,{"$f":"IF(D80=\"\",\"\",(VLOOKUP(D80,'Membership #'!$A$1:$C$1005,2,0)))","v":""},{"$f":"IF(D80=\"\",\"\",(VLOOKUP(D80,'Membership #'!$A$1:$C$1005,3,0)))","v":""},null,null,""]
["","","",null,{"$f":"IF(D81=\"\",\"\",(VLOOKUP(D81,'Membership #'!$A$1:$C$1005,2,0)))","v":""},{"$f":"IF(D81=\"\",\"\",(VLOOKUP(D81,'Membership #'!$A$1:$C$1005,3,0)))","v":""},null,null,""]
["","","",null,{"$f":"IF(D82=\"\",\"\",(VLOOKUP(D82,'Membership #'!$A$1:$C$1005,2,0)))","v":""},{"$f":"IF(D82=\"\",\"\",(VLOOKUP(D82,'Membership #'!$A$1:$C$1005,3,0)))","v":""},null,null,""]
["","","",null,{"$f":"IF(D83=\"\",\"\",(VLOOKUP(D83,'Membership #'!$A$1:$C$1005,2,0)))","v":""},{"$f":"IF(D83=\"\",\"\",(VLOOKUP(D83,'Membership #'!$A$1:$C$1005,3,0)))","v":""},null,null,""]
["","","",null,{"$f":"IF(D84=\"\",\"\",(VLOOKUP(D84,'Membership #'!$A$1:$C$1005,2,0)))","v":""},{"$f":"IF(D84=\"\",\"\",(VLOOKUP(D84,'Membership #'!$A$1:$C$1005,3,0)))","v":""},null,null,""]
["","","",null,{"$f":"IF(D85=\"\",\"\",(VLOOKUP(D85,'Membership #'!$A$1:$C$1005,2,0)))","v":""},{"$f":"IF(D85=\"\",\"\",(VLOOKUP(D85,'Membership #'!$A$1:$C$1005,3,0)))","v":""},null,null,""]
["","","",null,{"$f":"IF(D86=\"\",\"\",(VLOOKUP(D86,'Membership #'!$A$1:$C$1005,2,0)))","v":""},{"$f":"IF(D86=\"\",\"\",(VLOOKUP(D86,'Membership #'!$A$1:$C$1005,3,0)))","v":""},null,null,""]
["","","",null,{"$f":"IF(D87=\"\",\"\",(VLOOKUP(D87,'Membership #'!$A$1:$C$1005,2,0)))","v":""},{"$f":"IF(D87=\"\",\"\",(VLOOKUP(D87,'Membership #'!$A$1:$C$1005,3,0)))","v":""},null,null,""]
["","","",null,{"$f":"IF(D88=\"\",\"\",(VLOOKUP(D88,'Membership #'!$A$1:$C$1005,2,0)))","v":""},{"$f":"IF(D88=\"\",\"\",(VLOOKUP(D88,'Membership #'!$A$1:$C$1005,3,0)))","v":""},null,null,""]
["","","",null,{"$f":"IF(D89=\"\",\"\",(VLOOKUP(D89,'Membership #'!$A$1:$C$1005,2,0)))","v":""},{"$f":"IF(D89=\"\",\"\",(VLOOKUP(D89,'Membership #'!$A$1:$C$1005,3,0)))","v":""},null,null,""]
["","","",null,{"$f":"IF(D90=\"\",\"\",(VLOOKUP(D90,'Membership #'!$A$1:$C$1005,2,0)))","v":""},{"$f":"IF(D90=\"\",\"\",(VLOOKUP(D90,'Membership #'!$A$1:$C$1005,3,0)))","v":""},null,null,""]
["","","",null,{"$f":"IF(D91=\"\",\"\",(VLOOKUP(D91,'Membership #'!$A$1:$C$1005,2,0)))","v":""},{"$f":"IF(D91=\"\",\"\",(VLOOKUP(D91,'Membership #'!$A$1:$C$1005,3,0)))","v":""},null,null,""]
["","","",null,{"$f":"IF(D92=\"\",\"\",(VLOOKUP(D92,'Membership #'!$A$1:$C$1005,2,0)))","v":""},{"$f":"IF(D92=\"\",\"\",(VLOOKUP(D92,'Membership #'!$A$1:$C$1005,3,0)))","v":""},null,null,""]
["","","",null,{"$f":"IF(D93=\"\",\"\",(VLOOKUP(D93,'Membership #'!$A$1:$C$1005,2,0)))","v":""},{"$f":"IF(D93=\"\",\"\",(VLOOKUP(D93,'Membership #'!$A$1:$C$1005,3,0)))","v":""},null,null,""]
["","","",null,{"$f":"IF(D94=\"\",\"\",(VLOOKUP(D94,'Membership #'!$A$1:$C$1005,2,0)))","v":""},{"$f":"IF(D94=\"\",\"\",(VLOOKUP(D94,'Membership #'!$A$1:$C$1005,3,0)))","v":""},null,null,""]
["","","",null,{"$f":"IF(D95=\"\",\"\",(VLOOKUP(D95,'Membership #'!$A$1:$C$1005,2,0)))","v":""},{"$f":"IF(D95=\"\",\"\",(VLOOKUP(D95,'Membership #'!$A$1:$C$1005,3,0)))","v":""},null,null,""]
["","","",null,{"$f":"IF(D96=\"\",\"\",(VLOOKUP(D96,'Membership #'!$A$1:$C$1005,2,0)))","v":""},{"$f":"IF(D96=\"\",\"\",(VLOOKUP(D96,'Membership #'!$A$1:$C$1005,3,0)))","v":""},null,null,""]
["","","",null,{"$f":"IF(D97=\"\",\"\",(VLOOKUP(D97,'Membership #'!$A$1:$C$1005,2,0)))","v":""},{"$f":"IF(D97=\"\",\"\",(VLOOKUP(D97,'Membership #'!$A$1:$C$1005,3,0)))","v":""},null,null,""]
["","","",null,{"$f":"IF(D98=\"\",\"\",(VLOOKUP(D98,'Membership #'!$A$1:$C$1005,2,0)))","v":""},{"$f":"IF(D98=\"\",\"\",(VLOOKUP(D98,'Membership #'!$A$1:$C$1005,3,0)))","v":""},null,null,""]
["","","",null,{"$f":"IF(D99=\"\",\"\",(VLOOKUP(D99,'Membership #'!$A$1:$C$1005,2,0)))","v":""},{"$f":"IF(D99=\"\",\"\",(VLOOKUP(D99,'Membership #'!$A$1:$C$1005,3,0)))","v":""},null,null,""]
["","","",null,{"$f":"IF(D100=\"\",\"\",(VLOOKUP(D100,'Membership #'!$A$1:$C$1005,2,0)))","v":""},{"$f":"IF(D100=\"\",\"\",(VLOOKUP(D100,'Membership #'!$A$1:$C$1005,3,0)))","v":""},null,null,""]
["","","",null,{"$f":"IF(D101=\"\",\"\",(VLOOKUP(D101,'Membership #'!$A$1:$C$1005,2,0)))","v":""},{"$f":"IF(D101=\"\",\"\",(VLOOKUP(D101,'Membership #'!$A$1:$C$1005,3,0)))","v":""},null,null,""]

{"sheet":"YOUTH POLES","index":13,"n_rows":100,"n_cols":26,"rows_kept":100,"cut":false,"hidden":false,"merged":[[5,12,5,15],[0,0,0,10],[1,0,1,10],[2,0,2,3],[2,6,2,10],[3,0,6,0],[3,1,6,1],[3,2,6,2],[3,3,6,3],[3,4,6,4],[3,9,6,9],[3,10,6,10],[3,5,6,5],[3,6,6,6],[3,7,6,7],[3,8,6,8]]}
["Tom Burt & Mark McGuire Memorial Jackpot Aug 21, 2021",null,null,null,null,null,null,null,null,null,null,null,"x=Scratch"]
["YOUTH POLES",null,null,null,null,null,null,null,null,null,null,null,"n=No Time"]
["# Enteries:",null,null,null,{"$f":"COUNTIF($D$8:$D$99,\">0\")","v":16},null,null,null,null,null,null,null,null,null,null,null,null,"Don't Erase these numbers below!!"]
["Rand Draw","Seed","Running Order","RING #      ","NAME","HORSE NAME","TIME","PENALTY ","TOTAL","PLACINGS","POINTS",null,null,null,null,null,null,{"$f":"IF(N9=2,7,IF(N9=3,6,IF(N9=4,5,IF(N9=5,4,IF(AND(N9>5,N11>600),3,IF(AND(N9>5,N11<600,N11>299.99),2,IF(AND(N9>5,N11<300),1,8)))))))","v":1},1,2,3,4,5,6,7,8]
[null,null,null,null,null,null,null,null,null,null,null,null,null,null,null,null,null,null,299,"$300-","$600 -"]
[null,null,null,null,null,null,null,null,null,null,null,null,"YOUTH POLES",null,null,null,null,null,"or less",599,"More","5 Entries","4 Entries","3 Entries","2 Entries"]
[null,null,null,null,null,null,null,null,null,null,null,null,null,null,null,null,null,"1st",0.32,0.27,0.24,0.35,0.4,0.46,0.6]
[{"$f":"IF(D8<>\"\",RAND(),\"\")","v":0.85205218071619937},{"$f":"IF(D8<>\"\",RANK(A8,A$8:A$100),\"\")","v":2},1,815,{"$f":"IF(D8=\"\",\"\",(VLOOKUP(D8,'Membership #'!$A$1:$C$1005,2,0)))","v":"Brooke Kennedy"},{"$f":"IF(D8=\"\",\"\",(VLOOKUP(D8,'Membership #'!$A$1:$C$1005,3,0)))","v":"Tic Toc Teazer"},22.808,null,{"$f":"IF(G8=\"n\",\"No Time\",IF(G8=\"x\",\"Scratch\",IF(G8<>\"\",SUM(G8+H8),\"\")))","v":22.808},null,null,null,"Added",25,null,null,null,"2nd",0.23,0.22,0.19,0.25,0.28000000000000003,0.34,0.4]
[{"$f":"IF(D9<>\"\",RAND(),\"\")","v":0.95160487134968486},{"$f":"IF(D9<>\"\",RANK(A9,A$8:A$100),\"\")","v":1},2,941,{"$f":"IF(D9=\"\",\"\",(VLOOKUP(D9,'Membership #'!$A$1:$C$1005,2,0)))","v":"Taylor Hurley"},{"$f":"IF(D9=\"\",\"\",(VLOOKUP(D9,'Membership #'!$A$1:$C$1005,3,0)))","v":"Nacho Business"},24.611000000000001,null,24.611000000000001,null,null,null,"Entries",16,null,5,"per head","3rd",0.15,0.18,0.16,0.17,0.18,0.2]
[0.6028272131954594,9,3,636,{"$f":"IF(D10=\"\",\"\",(VLOOKUP(D10,'Membership #'!$A$1:$C$1005,2,0)))","v":"Ceilidh Gosse"},{"$f":"IF(D10=\"\",\"\",(VLOOKUP(D10,'Membership #'!$A$1:$C$1005,3,0)))","v":"ELM Silver Crime"},27.041,null,27.041,null,null,null,"Jackpot",{"$f":"P9*N9","v":80},null,0.85,"payback","4th",0.12,0.13,0.13,0.13,0.14000000000000001]
[0.74119094459908907,5,4,954,{"$f":"IF(D11=\"\",\"\",(VLOOKUP(D11,'Membership #'!$A$1:$C$1005,2,0)))","v":"Scotia MacEachern"},{"$f":"IF(D11=\"\",\"\",(VLOOKUP(D11,'Membership #'!$A$1:$C$1005,3,0)))","v":"Hick-a-Licious"},27.335000000000001,null,27.335000000000001,null,null,null,"Total Money",{"$f":"N8+(N10*P10)","v":93},null,{"$f":"N10*P10","v":68},"Jackpot","5th",0.1,0.09,0.08,0.1]
[0.69003009128022852,6,5,688,{"$f":"IF(D12=\"\",\"\",(VLOOKUP(D12,'Membership #'!$A$1:$C$1005,2,0)))","v":"Lenee Sampson"},{"$f":"IF(D12=\"\",\"\",(VLOOKUP(D12,'Membership #'!$A$1:$C$1005,3,0)))","v":"Six Dash Run"},22.956,5,27.956,null,null,null,null,"Percentage","Money","Ring #",null,"6th",0.08,0.06,0.06]
[0.74209507489466442,4,6,652,{"$f":"IF(D13=\"\",\"\",(VLOOKUP(D13,'Membership #'!$A$1:$C$1005,2,0)))","v":"Molly O'Grady"},{"$f":"IF(D13=\"\",\"\",(VLOOKUP(D13,'Membership #'!$A$1:$C$1005,3,0)))","v":"Teelano's Twister"},25.295999999999999,5,30.295999999999999,null,null,null,"1st",0.32,{"$f":"IF(N13<>0,N$11*N13,\"\")","v":29.76},null,{"$f":"IF(P13=\"\",\"\",(VLOOKUP(P13,'Membership #'!$A$1:$C$1005,2,0)))","v":""},"7th",null,0.03,0.05]
[0.12044196082583891,14,7,967,{"$f":"IF(D14=\"\",\"\",(VLOOKUP(D14,'Membership #'!$A$1:$C$1005,2,0)))","v":"Marissa Hillier"},{"$f":"IF(D14=\"\",\"\",(VLOOKUP(D14,'Membership #'!$A$1:$C$1005,3,0)))","v":"Notice Betty Boop"},30.521999999999998,null,30.521999999999998,null,null,null,"2nd",0.23,21.39,null,{"$f":"IF(P14=\"\",\"\",(VLOOKUP(P14,'Membership #'!$A$1:$C$1005,2,0)))","v":""},"8th",null,0.02,0.04]
[0.34544242278587267,12,8,973,{"$f":"IF(D15=\"\",\"\",(VLOOKUP(D15,'Membership #'!$A$1:$C$1005,2,0)))","v":"Sara Ivey"},{"$f":"IF(D15=\"\",\"\",(VLOOKUP(D15,'Membership #'!$A$1:$C$1005,3,0)))","v":"Ms Heavenly Gator"},30.530999999999999,null,30.530999999999999,null,null,null,"3rd",0.15,13.95,null,{"$f":"IF(P15=\"\",\"\",(VLOOKUP(P15,'Membership #'!$A$1:$C$1005,2,0)))","v":""},"9th",null,null,0.03]
[0.81869321636467973,3,9,966,{"$f":"IF(D16=\"\",\"\",(VLOOKUP(D16,'Membership #'!$A$1:$C$1005,2,0)))","v":"Ava Anderson"},{"$f":"IF(D16=\"\",\"\",(VLOOKUP(D16,'Membership #'!$A$1:$C$1005,3,0)))","v":"Black Sass"},27.956,5,32.956000000000003,null,null,null,"4th",0.12,11.16,null,{"$f":"IF(P16=\"\",\"\",(VLOOKUP(P16,'Membership #'!$A$1:$C$1005,2,0)))","v":""},"10th",null,null,0.02]
[9.6047438643458438E-2,16,10,867,{"$f":"IF(D17=\"\",\"\",(VLOOKUP(D17,'Membership #'!$A$1:$C$1005,2,0)))","v":"Layla MacEachem"},{"$f":"IF(D17=\"\",\"\",(VLOOKUP(D17,'Membership #'!$A$1:$C$1005,3,0)))","v":"Shes a gem"},32.755000000000003,10,42.755000000000003,null,null,null,"5th",0.1,9.3000000000000007,null,{"$f":"IF(P17=\"\",\"\",(VLOOKUP(P17,'Membership #'!$A$1:$C$1005,2,0)))","v":""}]
[0.61370005872469602,8,11,961,{"$f":"IF(D18=\"\",\"\",(VLOOKUP(D18,'Membership #'!$A$1:$C$1005,2,0)))","v":"Jacie Burke"},{"$f":"IF(D18=\"\",\"\",(VLOOKUP(D18,'Membership #'!$A$1:$C$1005,3,0)))","v":"She's Just That Sassy"},29.69,15,44.69,null,null,null,"6th",0.08,7.44,null,{"$f":"IF(P18=\"\",\"\",(VLOOKUP(P18,'Membership #'!$A$1:$C$1005,2,0)))","v":""}]
[0.22130847317857327,13,12,918,{"$f":"IF(D19=\"\",\"\",(VLOOKUP(D19,'Membership #'!$A$1:$C$1005,2,0)))","v":"Keira Rose"},{"$f":"IF(D19=\"\",\"\",(VLOOKUP(D19,'Membership #'!$A$1:$C$1005,3,0)))","v":"LL Its All About Red"},52.488,15,67.488,null,null,null,"7th",{"$f":"HLOOKUP($R$4,$S$4:$Z$17,10,0)","v":0},""]
[0.44254882260373818,10,13,904,{"$f":"IF(D20=\"\",\"\",(VLOOKUP(D20,'Membership #'!$A$1:$C$1005,2,0)))","v":"Ella Cowley"},{"$f":"IF(D20=\"\",\"\",(VLOOKUP(D20,'Membership #'!$A$1:$C$1005,3,0)))","v":"Blazin Boots"},"n",null,"No Time",null,null,null,"8th",{"$f":"HLOOKUP($R$4,$S$4:$Z$17,11,0)","v":0},""]
[0.67324233613110473,7,14,638,{"$f":"IF(D21=\"\",\"\",(VLOOKUP(D21,'Membership #'!$A$1:$C$1005,2,0)))","v":"Bella Peters"},{"$f":"IF(D21=\"\",\"\",(VLOOKUP(D21,'Membership #'!$A$1:$C$1005,3,0)))","v":"Super Star"},"n",null,"No Time",null,null,null,"9th",{"$f":"HLOOKUP($R$4,$S$4:$Z$17,12,0)","v":0},""]
[0.11796852107185452,15,15,666,{"$f":"IF(D22=\"\",\"\",(VLOOKUP(D22,'Membership #'!$A$1:$C$1005,2,0)))","v":"Summer Fraser"},{"$f":"IF(D22=\"\",\"\",(VLOOKUP(D22,'Membership #'!$A$1:$C$1005,3,0)))","v":"Sheza Smokin' Girl"},"x",null,"Scratch",null,null,null,"10th",{"$f":"HLOOKUP($R$4,$S$4:$Z$17,13,0)","v":0},""]
[0.36958447249778903,11,16,532,{"$f":"IF(D23=\"\",\"\",(VLOOKUP(D23,'Membership #'!$A$1:$C$1005,2,0)))","v":"Gracie MacLean"},{"$f":"IF(D23=\"\",\"\",(VLOOKUP(D23,'Membership #'!$A$1:$C$1005,3,0)))","v":"Secret"},"X",null,"Scratch",null,null,null,"Total Money",null,{"$f":"SUM(O13:O22)","v":93}]
["","","",null,{"$f":"IF(D24=\"\",\"\",(VLOOKUP(D24,'Membership #'!$A$1:$C$1005,2,0)))","v":""},{"$f":"IF(D24=\"\",\"\",(VLOOKUP(D24,'Membership #'!$A$1:$C$1005,3,0)))","v":""},null,null,{"$f":"IF(G24=\"n\",\"No Time\",IF(G24=\"x\",\"Scratch\",IF(G24<>\"\",SUM(G24+H24),\"\")))","v":""}]
["","","",null,{"$f":"IF(D25=\"\",\"\",(VLOOKUP(D25,'Membership #'!$A$1:$C$1005,2,0)))","v":""},{"$f":"IF(D25=\"\",\"\",(VLOOKUP(D25,'Membership #'!$A$1:$C$1005,3,0)))","v":""},null,null,""]
["","","",null,{"$f":"IF(D26=\"\",\"\",(VLOOKUP(D26,'Membership #'!$A$1:$C$1005,2,0)))","v":""},{"$f":"IF(D26=\"\",\"\",(VLOOKUP(D26,'Membership #'!$A$1:$C$1005,3,0)))","v":""},null,null,""]
["","","",null,{"$f":"IF(D27=\"\",\"\",(VLOOKUP(D27,'Membership #'!$A$1:$C$1005,2,0)))","v":""},{"$f":"IF(D27=\"\",\"\",(VLOOKUP(D27,'Membership #'!$A$1:$C$1005,3,0)))","v":""},null,null,""]
["","","",null,{"$f":"IF(D28=\"\",\"\",(VLOOKUP(D28,'Membership #'!$A$1:$C$1005,2,0)))","v":""},{"$f":"IF(D28=\"\",\"\",(VLOOKUP(D28,'Membership #'!$A$1:$C$1005,3,0)))","v":""},null,null,{"$f":"IF(G28=\"n\",\"No Time\",IF(G28=\"x\",\"Scratch\",IF(G28<>\"\",SUM(G28+H28),\"\")))","v":""}]
["","","",null,{"$f":"IF(D29=\"\",\"\",(VLOOKUP(D29,'Membership #'!$A$1:$C$1005,2,0)))","v":""},{"$f":"IF(D29=\"\",\"\",(VLOOKUP(D29,'Membership #'!$A$1:$C$1005,3,0)))","v":""},null,null,""]
["","","",null,{"$f":"IF(D30=\"\",\"\",(VLOOKUP(D30,'Membership #'!$A$1:$C$1005,2,0)))","v":""},{"$f":"IF(D30=\"\",\"\",(VLOOKUP(D30,'Membership #'!$A$1:$C$1005,3,0)))","v":""},null,null,""]
["","","",null,{"$f":"IF(D31=\"\",\"\",(VLOOKUP(D31,'Membership #'!$A$1:$C$1005,2,0)))","v":""},{"$f":"IF(D31=\"\",\"\",(VLOOKUP(D31,'Membership #'!$A$1:$C$1005,3,0)))","v":""},null,null,{"$f":"IF(G31=\"n\",\"No Time\",IF(G31=\"x\",\"Scratch\",IF(G31<>\"\",SUM(G31+H31),\"\")))","v":""}]
["","","",null,{"$f":"IF(D32=\"\",\"\",(VLOOKUP(D32,'Membership #'!$A$1:$C$1005,2,0)))","v":""},{"$f":"IF(D32=\"\",\"\",(VLOOKUP(D32,'Membership #'!$A$1:$C$1005,3,0)))","v":""},null,null,""]
["","","",null,{"$f":"IF(D33=\"\",\"\",(VLOOKUP(D33,'Membership #'!$A$1:$C$1005,2,0)))","v":""},{"$f":"IF(D33=\"\",\"\",(VLOOKUP(D33,'Membership #'!$A$1:$C$1005,3,0)))","v":""},null,null,""]
["","","",null,{"$f":"IF(D34=\"\",\"\",(VLOOKUP(D34,'Membership #'!$A$1:$C$1005,2,0)))","v":""},{"$f":"IF(D34=\"\",\"\",(VLOOKUP(D34,'Membership #'!$A$1:$C$1005,3,0)))","v":""},null,null,""]
["","","",null,{"$f":"IF(D35=\"\",\"\",(VLOOKUP(D35,'Membership #'!$A$1:$C$1005,2,0)))","v":""},{"$f":"IF(D35=\"\",\"\",(VLOOKUP(D35,'Membership #'!$A$1:$C$1005,3,0)))","v":""},null,null,""]
["","","",null,{"$f":"IF(D36=\"\",\"\",(VLOOKUP(D36,'Membership #'!$A$1:$C$1005,2,0)))","v":""},{"$f":"IF(D36=\"\",\"\",(VLOOKUP(D36,'Membership #'!$A$1:$C$1005,3,0)))","v":""},null,null,{"$f":"IF(G36=\"n\",\"No Time\",IF(G36=\"x\",\"Scratch\",IF(G36<>\"\",SUM(G36+H36),\"\")))","v":""}]
["","","",null,{"$f":"IF(D37=\"\",\"\",(VLOOKUP(D37,'Membership #'!$A$1:$C$1005,2,0)))","v":""},{"$f":"IF(D37=\"\",\"\",(VLOOKUP(D37,'Membership #'!$A$1:$C$1005,3,0)))","v":""},null,null,""]
["","","",null,{"$f":"IF(D38=\"\",\"\",(VLOOKUP(D38,'Membership #'!$A$1:$C$1005,2,0)))","v":""},{"$f":"IF(D38=\"\",\"\",(VLOOKUP(D38,'Membership #'!$A$1:$C$1005,3,0)))","v":""},null,null,""]
["","","",null,{"$f":"IF(D39=\"\",\"\",(VLOOKUP(D39,'Membership #'!$A$1:$C$1005,2,0)))","v":""},{"$f":"IF(D39=\"\",\"\",(VLOOKUP(D39,'Membership #'!$A$1:$C$1005,3,0)))","v":""},null,null,""]
["","","",null,{"$f":"IF(D40=\"\",\"\",(VLOOKUP(D40,'Membership #'!$A$1:$C$1005,2,0)))","v":""},{"$f":"IF(D40=\"\",\"\",(VLOOKUP(D40,'Membership #'!$A$1:$C$1005,3,0)))","v":""},null,null,""]
["","","",null,{"$f":"IF(D41=\"\",\"\",(VLOOKUP(D41,'Membership #'!$A$1:$C$1005,2,0)))","v":""},{"$f":"IF(D41=\"\",\"\",(VLOOKUP(D41,'Membership #'!$A$1:$C$1005,3,0)))","v":""},null,null,""]
["","","",null,{"$f":"IF(D42=\"\",\"\",(VLOOKUP(D42,'Membership #'!$A$1:$C$1005,2,0)))","v":""},{"$f":"IF(D42=\"\",\"\",(VLOOKUP(D42,'Membership #'!$A$1:$C$1005,3,0)))","v":""},null,null,""]
["","","",null,{"$f":"IF(D43=\"\",\"\",(VLOOKUP(D43,'Membership #'!$A$1:$C$1005,2,0)))","v":""},{"$f":"IF(D43=\"\",\"\",(VLOOKUP(D43,'Membership #'!$A$1:$C$1005,3,0)))","v":""},null,null,""]
["","","",null,{"$f":"IF(D44=\"\",\"\",(VLOOKUP(D44,'Membership #'!$A$1:$C$1005,2,0)))","v":""},{"$f":"IF(D44=\"\",\"\",(VLOOKUP(D44,'Membership #'!$A$1:$C$1005,3,0)))","v":""},null,null,""]
["","","",null,{"$f":"IF(D45=\"\",\"\",(VLOOKUP(D45,'Membership #'!$A$1:$C$1005,2,0)))","v":""},{"$f":"IF(D45=\"\",\"\",(VLOOKUP(D45,'Membership #'!$A$1:$C$1005,3,0)))","v":""},null,null,""]
["","","",null,{"$f":"IF(D46=\"\",\"\",(VLOOKUP(D46,'Membership #'!$A$1:$C$1005,2,0)))","v":""},{"$f":"IF(D46=\"\",\"\",(VLOOKUP(D46,'Membership #'!$A$1:$C$1005,3,0)))","v":""},null,null,""]
["","","",null,{"$f":"IF(D47=\"\",\"\",(VLOOKUP(D47,'Membership #'!$A$1:$C$1005,2,0)))","v":""},{"$f":"IF(D47=\"\",\"\",(VLOOKUP(D47,'Membership #'!$A$1:$C$1005,3,0)))","v":""},null,null,""]
["","","",null,{"$f":"IF(D48=\"\",\"\",(VLOOKUP(D48,'Membership #'!$A$1:$C$1005,2,0)))","v":""},{"$f":"IF(D48=\"\",\"\",(VLOOKUP(D48,'Membership #'!$A$1:$C$1005,3,0)))","v":""},null,null,""]
["","","",null,{"$f":"IF(D49=\"\",\"\",(VLOOKUP(D49,'Membership #'!$A$1:$C$1005,2,0)))","v":""},{"$f":"IF(D49=\"\",\"\",(VLOOKUP(D49,'Membership #'!$A$1:$C$1005,3,0)))","v":""},null,null,""]
["","","",null,{"$f":"IF(D50=\"\",\"\",(VLOOKUP(D50,'Membership #'!$A$1:$C$1005,2,0)))","v":""},{"$f":"IF(D50=\"\",\"\",(VLOOKUP(D50,'Membership #'!$A$1:$C$1005,3,0)))","v":""},null,null,""]
["","","",null,{"$f":"IF(D51=\"\",\"\",(VLOOKUP(D51,'Membership #'!$A$1:$C$1005,2,0)))","v":""},{"$f":"IF(D51=\"\",\"\",(VLOOKUP(D51,'Membership #'!$A$1:$C$1005,3,0)))","v":""},null,null,""]
["","","",null,{"$f":"IF(D52=\"\",\"\",(VLOOKUP(D52,'Membership #'!$A$1:$C$1005,2,0)))","v":""},{"$f":"IF(D52=\"\",\"\",(VLOOKUP(D52,'Membership #'!$A$1:$C$1005,3,0)))","v":""},null,null,""]
["","","",null,{"$f":"IF(D53=\"\",\"\",(VLOOKUP(D53,'Membership #'!$A$1:$C$1005,2,0)))","v":""},{"$f":"IF(D53=\"\",\"\",(VLOOKUP(D53,'Membership #'!$A$1:$C$1005,3,0)))","v":""},null,null,""]
["","","",null,{"$f":"IF(D54=\"\",\"\",(VLOOKUP(D54,'Membership #'!$A$1:$C$1005,2,0)))","v":""},{"$f":"IF(D54=\"\",\"\",(VLOOKUP(D54,'Membership #'!$A$1:$C$1005,3,0)))","v":""},null,null,""]
["","","",null,{"$f":"IF(D55=\"\",\"\",(VLOOKUP(D55,'Membership #'!$A$1:$C$1005,2,0)))","v":""},{"$f":"IF(D55=\"\",\"\",(VLOOKUP(D55,'Membership #'!$A$1:$C$1005,3,0)))","v":""},null,null,""]
["","","",null,{"$f":"IF(D56=\"\",\"\",(VLOOKUP(D56,'Membership #'!$A$1:$C$1005,2,0)))","v":""},{"$f":"IF(D56=\"\",\"\",(VLOOKUP(D56,'Membership #'!$A$1:$C$1005,3,0)))","v":""},null,null,""]
["","","",null,{"$f":"IF(D57=\"\",\"\",(VLOOKUP(D57,'Membership #'!$A$1:$C$1005,2,0)))","v":""},{"$f":"IF(D57=\"\",\"\",(VLOOKUP(D57,'Membership #'!$A$1:$C$1005,3,0)))","v":""},null,null,""]
["","","",null,{"$f":"IF(D58=\"\",\"\",(VLOOKUP(D58,'Membership #'!$A$1:$C$1005,2,0)))","v":""},{"$f":"IF(D58=\"\",\"\",(VLOOKUP(D58,'Membership #'!$A$1:$C$1005,3,0)))","v":""},null,null,""]
["","","",null,{"$f":"IF(D59=\"\",\"\",(VLOOKUP(D59,'Membership #'!$A$1:$C$1005,2,0)))","v":""},{"$f":"IF(D59=\"\",\"\",(VLOOKUP(D59,'Membership #'!$A$1:$C$1005,3,0)))","v":""},null,null,""]
["","","",null,{"$f":"IF(D60=\"\",\"\",(VLOOKUP(D60,'Membership #'!$A$1:$C$1005,2,0)))","v":""},{"$f":"IF(D60=\"\",\"\",(VLOOKUP(D60,'Membership #'!$A$1:$C$1005,3,0)))","v":""},null,null,""]
["","","",null,{"$f":"IF(D61=\"\",\"\",(VLOOKUP(D61,'Membership #'!$A$1:$C$1005,2,0)))","v":""},{"$f":"IF(D61=\"\",\"\",(VLOOKUP(D61,'Membership #'!$A$1:$C$1005,3,0)))","v":""},null,null,""]
["","","",null,{"$f":"IF(D62=\"\",\"\",(VLOOKUP(D62,'Membership #'!$A$1:$C$1005,2,0)))","v":""},{"$f":"IF(D62=\"\",\"\",(VLOOKUP(D62,'Membership #'!$A$1:$C$1005,3,0)))","v":""},null,null,""]
["","","",null,{"$f":"IF(D63=\"\",\"\",(VLOOKUP(D63,'Membership #'!$A$1:$C$1005,2,0)))","v":""},{"$f":"IF(D63=\"\",\"\",(VLOOKUP(D63,'Membership #'!$A$1:$C$1005,3,0)))","v":""},null,null,""]
["","","",null,{"$f":"IF(D64=\"\",\"\",(VLOOKUP(D64,'Membership #'!$A$1:$C$1005,2,0)))","v":""},{"$f":"IF(D64=\"\",\"\",(VLOOKUP(D64,'Membership #'!$A$1:$C$1005,3,0)))","v":""},null,null,""]
["","","",null,{"$f":"IF(D65=\"\",\"\",(VLOOKUP(D65,'Membership #'!$A$1:$C$1005,2,0)))","v":""},{"$f":"IF(D65=\"\",\"\",(VLOOKUP(D65,'Membership #'!$A$1:$C$1005,3,0)))","v":""},null,null,""]
["","","",null,{"$f":"IF(D66=\"\",\"\",(VLOOKUP(D66,'Membership #'!$A$1:$C$1005,2,0)))","v":""},{"$f":"IF(D66=\"\",\"\",(VLOOKUP(D66,'Membership #'!$A$1:$C$1005,3,0)))","v":""},null,null,""]
["","","",null,{"$f":"IF(D67=\"\",\"\",(VLOOKUP(D67,'Membership #'!$A$1:$C$1005,2,0)))","v":""},{"$f":"IF(D67=\"\",\"\",(VLOOKUP(D67,'Membership #'!$A$1:$C$1005,3,0)))","v":""},null,null,""]
["","","",null,{"$f":"IF(D68=\"\",\"\",(VLOOKUP(D68,'Membership #'!$A$1:$C$1005,2,0)))","v":""},{"$f":"IF(D68=\"\",\"\",(VLOOKUP(D68,'Membership #'!$A$1:$C$1005,3,0)))","v":""},null,null,""]
["","","",null,{"$f":"IF(D69=\"\",\"\",(VLOOKUP(D69,'Membership #'!$A$1:$C$1005,2,0)))","v":""},{"$f":"IF(D69=\"\",\"\",(VLOOKUP(D69,'Membership #'!$A$1:$C$1005,3,0)))","v":""},null,null,""]
["","","",null,{"$f":"IF(D70=\"\",\"\",(VLOOKUP(D70,'Membership #'!$A$1:$C$1005,2,0)))","v":""},{"$f":"IF(D70=\"\",\"\",(VLOOKUP(D70,'Membership #'!$A$1:$C$1005,3,0)))","v":""},null,null,""]
["","","",null,{"$f":"IF(D71=\"\",\"\",(VLOOKUP(D71,'Membership #'!$A$1:$C$1005,2,0)))","v":""},{"$f":"IF(D71=\"\",\"\",(VLOOKUP(D71,'Membership #'!$A$1:$C$1005,3,0)))","v":""},null,null,""]
["","","",null,{"$f":"IF(D72=\"\",\"\",(VLOOKUP(D72,'Membership #'!$A$1:$C$1005,2,0)))","v":""},{"$f":"IF(D72=\"\",\"\",(VLOOKUP(D72,'Membership #'!$A$1:$C$1005,3,0)))","v":""},null,null,{"$f":"IF(G72=\"n\",\"No Time\",IF(G72=\"x\",\"Scratch\",IF(G72<>\"\",SUM(G72+H72),\"\")))","v":""}]
[{"$f":"IF(D73<>\"\",RAND(),\"\")","v":""},{"$f":"IF(D73<>\"\",RANK(A73,A$8:A$100),\"\")","v":""},"",null,{"$f":"IF(D73=\"\",\"\",(VLOOKUP(D73,'Membership #'!$A$1:$C$1005,2,0)))","v":""},{"$f":"IF(D73=\"\",\"\",(VLOOKUP(D73,'Membership #'!$A$1:$C$1005,3,0)))","v":""},null,null,""]
["","","",null,{"$f":"IF(D74=\"\",\"\",(VLOOKUP(D74,'Membership #'!$A$1:$C$1005,2,0)))","v":""},{"$f":"IF(D74=\"\",\"\",(VLOOKUP(D74,'Membership #'!$A$1:$C$1005,3,0)))","v":""},null,null,""]
["","","",null,{"$f":"IF(D75=\"\",\"\",(VLOOKUP(D75,'Membership #'!$A$1:$C$1005,2,0)))","v":""},{"$f":"IF(D75=\"\",\"\",(VLOOKUP(D75,'Membership #'!$A$1:$C$1005,3,0)))","v":""},null,null,""]
["","","",null,{"$f":"IF(D76=\"\",\"\",(VLOOKUP(D76,'Membership #'!$A$1:$C$1005,2,0)))","v":""},{"$f":"IF(D76=\"\",\"\",(VLOOKUP(D76,'Membership #'!$A$1:$C$1005,3,0)))","v":""},null,null,""]
["","","",null,{"$f":"IF(D77=\"\",\"\",(VLOOKUP(D77,'Membership #'!$A$1:$C$1005,2,0)))","v":""},{"$f":"IF(D77=\"\",\"\",(VLOOKUP(D77,'Membership #'!$A$1:$C$1005,3,0)))","v":""},null,null,""]
["","","",null,{"$f":"IF(D78=\"\",\"\",(VLOOKUP(D78,'Membership #'!$A$1:$C$1005,2,0)))","v":""},{"$f":"IF(D78=\"\",\"\",(VLOOKUP(D78,'Membership #'!$A$1:$C$1005,3,0)))","v":""},null,null,""]
["","","",null,{"$f":"IF(D79=\"\",\"\",(VLOOKUP(D79,'Membership #'!$A$1:$C$1005,2,0)))","v":""},{"$f":"IF(D79=\"\",\"\",(VLOOKUP(D79,'Membership #'!$A$1:$C$1005,3,0)))","v":""},null,null,""]
["","","",null,{"$f":"IF(D80=\"\",\"\",(VLOOKUP(D80,'Membership #'!$A$1:$C$1005,2,0)))","v":""},{"$f":"IF(D80=\"\",\"\",(VLOOKUP(D80,'Membership #'!$A$1:$C$1005,3,0)))","v":""},null,null,""]
["","","",null,{"$f":"IF(D81=\"\",\"\",(VLOOKUP(D81,'Membership #'!$A$1:$C$1005,2,0)))","v":""},{"$f":"IF(D81=\"\",\"\",(VLOOKUP(D81,'Membership #'!$A$1:$C$1005,3,0)))","v":""},null,null,""]
["","","",null,{"$f":"IF(D82=\"\",\"\",(VLOOKUP(D82,'Membership #'!$A$1:$C$1005,2,0)))","v":""},{"$f":"IF(D82=\"\",\"\",(VLOOKUP(D82,'Membership #'!$A$1:$C$1005,3,0)))","v":""},null,null,""]
["","","",null,{"$f":"IF(D83=\"\",\"\",(VLOOKUP(D83,'Membership #'!$A$1:$C$1005,2,0)))","v":""},{"$f":"IF(D83=\"\",\"\",(VLOOKUP(D83,'Membership #'!$A$1:$C$1005,3,0)))","v":""},null,null,""]
["","","",null,{"$f":"IF(D84=\"\",\"\",(VLOOKUP(D84,'Membership #'!$A$1:$C$1005,2,0)))","v":""},{"$f":"IF(D84=\"\",\"\",(VLOOKUP(D84,'Membership #'!$A$1:$C$1005,3,0)))","v":""},null,null,""]
["","","",null,{"$f":"IF(D85=\"\",\"\",(VLOOKUP(D85,'Membership #'!$A$1:$C$1005,2,0)))","v":""},{"$f":"IF(D85=\"\",\"\",(VLOOKUP(D85,'Membership #'!$A$1:$C$1005,3,0)))","v":""},null,null,""]
["","","",null,{"$f":"IF(D86=\"\",\"\",(VLOOKUP(D86,'Membership #'!$A$1:$C$1005,2,0)))","v":""},{"$f":"IF(D86=\"\",\"\",(VLOOKUP(D86,'Membership #'!$A$1:$C$1005,3,0)))","v":""},null,null,""]
["","","",null,{"$f":"IF(D87=\"\",\"\",(VLOOKUP(D87,'Membership #'!$A$1:$C$1005,2,0)))","v":""},{"$f":"IF(D87=\"\",\"\",(VLOOKUP(D87,'Membership #'!$A$1:$C$1005,3,0)))","v":""},null,null,""]
["","","",null,{"$f":"IF(D88=\"\",\"\",(VLOOKUP(D88,'Membership #'!$A$1:$C$1005,2,0)))","v":""},{"$f":"IF(D88=\"\",\"\",(VLOOKUP(D88,'Membership #'!$A$1:$C$1005,3,0)))","v":""},null,null,""]
["","","",null,{"$f":"IF(D89=\"\",\"\",(VLOOKUP(D89,'Membership #'!$A$1:$C$1005,2,0)))","v":""},{"$f":"IF(D89=\"\",\"\",(VLOOKUP(D89,'Membership #'!$A$1:$C$1005,3,0)))","v":""},null,null,""]
["","","",null,{"$f":"IF(D90=\"\",\"\",(VLOOKUP(D90,'Membership #'!$A$1:$C$1005,2,0)))","v":""},{"$f":"IF(D90=\"\",\"\",(VLOOKUP(D90,'Membership #'!$A$1:$C$1005,3,0)))","v":""},null,null,""]
["","","",null,{"$f":"IF(D91=\"\",\"\",(VLOOKUP(D91,'Membership #'!$A$1:$C$1005,2,0)))","v":""},{"$f":"IF(D91=\"\",\"\",(VLOOKUP(D91,'Membership #'!$A$1:$C$1005,3,0)))","v":""},null,null,""]
["","","",null,{"$f":"IF(D92=\"\",\"\",(VLOOKUP(D92,'Membership #'!$A$1:$C$1005,2,0)))","v":""},{"$f":"IF(D92=\"\",\"\",(VLOOKUP(D92,'Membership #'!$A$1:$C$1005,3,0)))","v":""},null,null,""]
["","","",null,{"$f":"IF(D93=\"\",\"\",(VLOOKUP(D93,'Membership #'!$A$1:$C$1005,2,0)))","v":""},{"$f":"IF(D93=\"\",\"\",(VLOOKUP(D93,'Membership #'!$A$1:$C$1005,3,0)))","v":""},null,null,""]
["","","",null,{"$f":"IF(D94=\"\",\"\",(VLOOKUP(D94,'Membership #'!$A$1:$C$1005,2,0)))","v":""},{"$f":"IF(D94=\"\",\"\",(VLOOKUP(D94,'Membership #'!$A$1:$C$1005,3,0)))","v":""},null,null,""]
["","","",null,{"$f":"IF(D95=\"\",\"\",(VLOOKUP(D95,'Membership #'!$A$1:$C$1005,2,0)))","v":""},{"$f":"IF(D95=\"\",\"\",(VLOOKUP(D95,'Membership #'!$A$1:$C$1005,3,0)))","v":""},null,null,""]
["","","",null,{"$f":"IF(D96=\"\",\"\",(VLOOKUP(D96,'Membership #'!$A$1:$C$1005,2,0)))","v":""},{"$f":"IF(D96=\"\",\"\",(VLOOKUP(D96,'Membership #'!$A$1:$C$1005,3,0)))","v":""},null,null,""]
["","","",null,{"$f":"IF(D97=\"\",\"\",(VLOOKUP(D97,'Membership #'!$A$1:$C$1005,2,0)))","v":""},{"$f":"IF(D97=\"\",\"\",(VLOOKUP(D97,'Membership #'!$A$1:$C$1005,3,0)))","v":""},null,null,""]
["","","",null,{"$f":"IF(D98=\"\",\"\",(VLOOKUP(D98,'Membership #'!$A$1:$C$1005,2,0)))","v":""},{"$f":"IF(D98=\"\",\"\",(VLOOKUP(D98,'Membership #'!$A$1:$C$1005,3,0)))","v":""},null,null,""]
["","","",null,{"$f":"IF(D99=\"\",\"\",(VLOOKUP(D99,'Membership #'!$A$1:$C$1005,2,0)))","v":""},{"$f":"IF(D99=\"\",\"\",(VLOOKUP(D99,'Membership #'!$A$1:$C$1005,3,0)))","v":""},null,null,""]
["","","",null,{"$f":"IF(D100=\"\",\"\",(VLOOKUP(D100,'Membership #'!$A$1:$C$1005,2,0)))","v":""},{"$f":"IF(D100=\"\",\"\",(VLOOKUP(D100,'Membership #'!$A$1:$C$1005,3,0)))","v":""},null,null,""]

{"sheet":"NOVICE POLES","index":14,"n_rows":97,"n_cols":26,"rows_kept":97,"cut":false,"hidden":false,"merged":[[5,12,5,15],[0,0,0,10],[1,0,1,10],[2,0,2,3],[2,6,2,10],[3,0,6,0],[3,1,6,1],[3,2,6,2],[3,3,6,3],[3,4,6,4],[3,9,6,9],[3,10,6,10],[3,5,6,5],[3,6,6,6],[3,7,6,7],[3,8,6,8]]}
["Tom Burt & Mark McGuire Memorial Jackpot Aug 21, 2021",null,null,null,null,null,null,null,null,null,null,null,"x=Scratch"]
["NOVICE POLES",null,null,null,null,null,null,null,null,null,null,null,"n=No Time"]
["# Enteries:",null,null,null,{"$f":"COUNTIF($D$8:$D$96,\">0\")","v":19},null,null,null,null,null,null,null,null,null,null,null,null,"Don't Erase these numbers below!!"]
["Rand Draw","Seed","Running Order","RING #      ","NAME","HORSE NAME","TIME","PENALTY ","TOTAL","PLACINGS","POINTS",null,null,null,null,null,null,{"$f":"IF(N9=2,7,IF(N9=3,6,IF(N9=4,5,IF(N9=5,4,IF(AND(N9>5,N11>600),3,IF(AND(N9>5,N11<600,N11>299.99),2,IF(AND(N9>5,N11<300),1,8)))))))","v":1},1,2,3,4,5,6,7,8]
[null,null,null,null,null,null,null,null,null,null,null,null,null,null,null,null,null,null,299,"$300-","$600 -"]
[null,null,null,null,null,null,null,null,null,null,null,null,"NOVICE POLES",null,null,null,null,null,"or less",599,"More","5 Entries","4 Entries","3 Entries","2 Entries"]
[null,null,null,null,null,null,null,null,null,null,null,null,null,null,null,null,null,"1st",0.32,0.27,0.24,0.35,0.4,0.46,0.6]
[{"$f":"IF(D8<>\"\",RAND(),\"\")","v":0.11239288234059686},{"$f":"IF(D8<>\"\",RANK(A8,A$8:A$97),\"\")","v":16},1,556,{"$f":"IF(D8=\"\",\"\",(VLOOKUP(D8,'Membership #'!$A$1:$C$1005,2,0)))","v":"Stephaine Clark"},{"$f":"IF(D8=\"\",\"\",(VLOOKUP(D8,'Membership #'!$A$1:$C$1005,3,0)))","v":"Perks A Flyin"},23.039000000000001,null,{"$f":"IF(G8=\"n\",\"No Time\",IF(G8=\"x\",\"Scratch\",IF(G8<>\"\",SUM(G8+H8),\"\")))","v":23.039000000000001},null,null,null,"Added",75,null,null,null,"2nd",0.23,0.22,0.19,0.25,0.28000000000000003,0.34,0.4]
[0.13799393617786126,14,2,750,{"$f":"IF(D9=\"\",\"\",(VLOOKUP(D9,'Membership #'!$A$1:$C$1005,2,0)))","v":"Tanya Kennedy"},{"$f":"IF(D9=\"\",\"\",(VLOOKUP(D9,'Membership #'!$A$1:$C$1005,3,0)))","v":"Old Stations Pride"},23.225000000000001,null,23.225000000000001,null,null,null,"Entries",19,null,10,"per head","3rd",0.15,0.18,0.16,0.17,0.18,0.2]
[0.94724564192510741,2,3,909,{"$f":"IF(D10=\"\",\"\",(VLOOKUP(D10,'Membership #'!$A$1:$C$1005,2,0)))","v":"Rebecca Gillis"},{"$f":"IF(D10=\"\",\"\",(VLOOKUP(D10,'Membership #'!$A$1:$C$1005,3,0)))","v":"Martha's Tivio Moon"},23.638000000000002,null,23.638000000000002,null,null,null,"Jackpot",{"$f":"P9*N9","v":190},null,0.85,"payback","4th",0.12,0.13,0.13,0.13,0.14000000000000001]
[6.8985190419603382E-2,18,4,954,{"$f":"IF(D11=\"\",\"\",(VLOOKUP(D11,'Membership #'!$A$1:$C$1005,2,0)))","v":"Scotia MacEachern"},{"$f":"IF(D11=\"\",\"\",(VLOOKUP(D11,'Membership #'!$A$1:$C$1005,3,0)))","v":"Hick-a-Licious"},26.202999999999999,null,26.202999999999999,null,null,null,"Total Money",{"$f":"N8+(N10*P10)","v":236.5},null,{"$f":"N10*P10","v":161.5},"Jackpot","5th",0.1,0.09,0.08,0.1]
[0.29782506011429322,12,5,732,{"$f":"IF(D12=\"\",\"\",(VLOOKUP(D12,'Membership #'!$A$1:$C$1005,2,0)))","v":"Brenna Carrigan"},{"$f":"IF(D12=\"\",\"\",(VLOOKUP(D12,'Membership #'!$A$1:$C$1005,3,0)))","v":"Carlos"},27.187000000000001,null,27.187000000000001,null,null,null,null,"Percentage","Money","Ring #",null,"6th",0.08,0.06,0.06]
[0.13538656558483597,15,6,600,{"$f":"IF(D13=\"\",\"\",(VLOOKUP(D13,'Membership #'!$A$1:$C$1005,2,0)))","v":"Stan Brown"},{"$f":"IF(D13=\"\",\"\",(VLOOKUP(D13,'Membership #'!$A$1:$C$1005,3,0)))","v":"A Perty Sure Thing"},27.716999999999999,null,27.716999999999999,null,null,null,"1st",{"$f":"HLOOKUP($R$4,$S$4:$Z$17,4,0)","v":0.32},{"$f":"IF(N13<>0,N$11*N13,\"\")","v":75.680000000000007},null,{"$f":"IF(P13=\"\",\"\",(VLOOKUP(P13,'Membership #'!$A$1:$C$1005,2,0)))","v":""},"7th",null,0.03,0.05]
[0.15769778758092912,13,7,973,{"$f":"IF(D14=\"\",\"\",(VLOOKUP(D14,'Membership #'!$A$1:$C$1005,2,0)))","v":"Sara Ivey"},{"$f":"IF(D14=\"\",\"\",(VLOOKUP(D14,'Membership #'!$A$1:$C$1005,3,0)))","v":"Ms Heavenly Gator"},29.238,null,29.238,null,null,null,"2nd",{"$f":"HLOOKUP($R$4,$S$4:$Z$17,5,0)","v":0.23},54.395000000000003,null,{"$f":"IF(P14=\"\",\"\",(VLOOKUP(P14,'Membership #'!$A$1:$C$1005,2,0)))","v":""},"8th",null,0.02,0.04]
[0.96367292921159742,1,8,652,{"$f":"IF(D15=\"\",\"\",(VLOOKUP(D15,'Membership #'!$A$1:$C$1005,2,0)))","v":"Molly O'Grady"},{"$f":"IF(D15=\"\",\"\",(VLOOKUP(D15,'Membership #'!$A$1:$C$1005,3,0)))","v":"Teelano's Twister"},24.587,5,29.587,null,null,null,"3rd",{"$f":"HLOOKUP($R$4,$S$4:$Z$17,6,0)","v":0.15},35.475000000000001,null,{"$f":"IF(P15=\"\",\"\",(VLOOKUP(P15,'Membership #'!$A$1:$C$1005,2,0)))","v":""},"9th",null,null,0.03]
[0.30944405664420527,11,9,892,{"$f":"IF(D16=\"\",\"\",(VLOOKUP(D16,'Membership #'!$A$1:$C$1005,2,0)))","v":"Donnie MacNeil"},{"$f":"IF(D16=\"\",\"\",(VLOOKUP(D16,'Membership #'!$A$1:$C$1005,3,0)))","v":"Gifted Go Gold"},25.254000000000001,5,30.254000000000001,null,null,null,"4th",{"$f":"HLOOKUP($R$4,$S$4:$Z$17,7,0)","v":0.12},28.38,null,{"$f":"IF(P16=\"\",\"\",(VLOOKUP(P16,'Membership #'!$A$1:$C$1005,2,0)))","v":""},"10th",null,null,0.02]
[0.31583719055069559,10,10,855,{"$f":"IF(D17=\"\",\"\",(VLOOKUP(D17,'Membership #'!$A$1:$C$1005,2,0)))","v":"Jenelle Collier"},{"$f":"IF(D17=\"\",\"\",(VLOOKUP(D17,'Membership #'!$A$1:$C$1005,3,0)))","v":"Peppy Sans Surprise"},24.882000000000001,10,34.882000000000005,null,null,null,"5th",{"$f":"HLOOKUP($R$4,$S$4:$Z$17,8,0)","v":0.1},23.650000000000002,null,{"$f":"IF(P17=\"\",\"\",(VLOOKUP(P17,'Membership #'!$A$1:$C$1005,2,0)))","v":""}]
[7.9796021526237215E-2,17,11,966,{"$f":"IF(D18=\"\",\"\",(VLOOKUP(D18,'Membership #'!$A$1:$C$1005,2,0)))","v":"Ava Anderson"},{"$f":"IF(D18=\"\",\"\",(VLOOKUP(D18,'Membership #'!$A$1:$C$1005,3,0)))","v":"Black Sass"},28.033000000000001,10,38.033000000000001,null,null,null,"6th",{"$f":"HLOOKUP($R$4,$S$4:$Z$17,9,0)","v":0.08},18.920000000000002,null,{"$f":"IF(P18=\"\",\"\",(VLOOKUP(P18,'Membership #'!$A$1:$C$1005,2,0)))","v":""}]
[0.77636534794821865,5,12,753,{"$f":"IF(D19=\"\",\"\",(VLOOKUP(D19,'Membership #'!$A$1:$C$1005,2,0)))","v":"Kayla Boudreau"},{"$f":"IF(D19=\"\",\"\",(VLOOKUP(D19,'Membership #'!$A$1:$C$1005,3,0)))","v":"Lady Jane"},40.304000000000002,null,40.304000000000002,null,null,null,"7th",{"$f":"HLOOKUP($R$4,$S$4:$Z$17,10,0)","v":0},"",null,{"$f":"IF(P19=\"\",\"\",(VLOOKUP(P19,'Membership #'!$A$1:$C$1005,2,0)))","v":""}]
[0.79944029797884986,4,13,746,{"$f":"IF(D20=\"\",\"\",(VLOOKUP(D20,'Membership #'!$A$1:$C$1005,2,0)))","v":"Cassie MacDonald"},{"$f":"IF(D20=\"\",\"\",(VLOOKUP(D20,'Membership #'!$A$1:$C$1005,3,0)))","v":"Sandy Dew"},46.045999999999999,null,46.045999999999999,null,null,null,"8th",{"$f":"HLOOKUP($R$4,$S$4:$Z$17,11,0)","v":0},"",null,{"$f":"IF(P20=\"\",\"\",(VLOOKUP(P20,'Membership #'!$A$1:$C$1005,2,0)))","v":""}]
[0.91458362336974508,3,14,971,{"$f":"IF(D21=\"\",\"\",(VLOOKUP(D21,'Membership #'!$A$1:$C$1005,2,0)))","v":"Arielle Burke"},{"$f":"IF(D21=\"\",\"\",(VLOOKUP(D21,'Membership #'!$A$1:$C$1005,3,0)))","v":"Elm Sally"},48.213999999999999,null,48.213999999999999,null,null,null,"9th",{"$f":"HLOOKUP($R$4,$S$4:$Z$17,12,0)","v":0},"",null,{"$f":"IF(P21=\"\",\"\",(VLOOKUP(P21,'Membership #'!$A$1:$C$1005,2,0)))","v":""}]
[0.35827743340544971,9,15,904,{"$f":"IF(D22=\"\",\"\",(VLOOKUP(D22,'Membership #'!$A$1:$C$1005,2,0)))","v":"Ella Cowley"},{"$f":"IF(D22=\"\",\"\",(VLOOKUP(D22,'Membership #'!$A$1:$C$1005,3,0)))","v":"Blazin Boots"},"n",null,"No Time",null,null,null,"10th",{"$f":"HLOOKUP($R$4,$S$4:$Z$17,13,0)","v":0},""]
[0.76391384838130816,6,16,928,{"$f":"IF(D23=\"\",\"\",(VLOOKUP(D23,'Membership #'!$A$1:$C$1005,2,0)))","v":"Tessa Dicks"},{"$f":"IF(D23=\"\",\"\",(VLOOKUP(D23,'Membership #'!$A$1:$C$1005,3,0)))","v":"ELM Dash of Crime"},"n",null,"No Time",null,null,null,"Total Money",null,{"$f":"SUM(O13:O22)","v":236.5}]
[1.2600217584933016E-2,19,17,716,{"$f":"IF(D24=\"\",\"\",(VLOOKUP(D24,'Membership #'!$A$1:$C$1005,2,0)))","v":"Kayla Martin"},{"$f":"IF(D24=\"\",\"\",(VLOOKUP(D24,'Membership #'!$A$1:$C$1005,3,0)))","v":"Dash Ta Home"},"n",null,"No Time"]
[0.58716687247999222,8,18,889,{"$f":"IF(D25=\"\",\"\",(VLOOKUP(D25,'Membership #'!$A$1:$C$1005,2,0)))","v":"Adelaine Cowley"},{"$f":"IF(D25=\"\",\"\",(VLOOKUP(D25,'Membership #'!$A$1:$C$1005,3,0)))","v":"Frenchman's Promise"},"x",null,"Scratch"]
[0.71466534663711101,7,19,78,{"$f":"IF(D26=\"\",\"\",(VLOOKUP(D26,'Membership #'!$A$1:$C$1005,2,0)))","v":"Stephanie Rich"},{"$f":"IF(D26=\"\",\"\",(VLOOKUP(D26,'Membership #'!$A$1:$C$1005,3,0)))","v":"Texas Mickey"},"x",null,"Scratch"]
["","","",null,{"$f":"IF(D27=\"\",\"\",(VLOOKUP(D27,'Membership #'!$A$1:$C$1005,2,0)))","v":""},{"$f":"IF(D27=\"\",\"\",(VLOOKUP(D27,'Membership #'!$A$1:$C$1005,3,0)))","v":""},null,null,{"$f":"IF(G27=\"n\",\"No Time\",IF(G27=\"x\",\"Scratch\",IF(G27<>\"\",SUM(G27+H27),\"\")))","v":""}]
["","","",null,{"$f":"IF(D28=\"\",\"\",(VLOOKUP(D28,'Membership #'!$A$1:$C$1005,2,0)))","v":""},{"$f":"IF(D28=\"\",\"\",(VLOOKUP(D28,'Membership #'!$A$1:$C$1005,3,0)))","v":""},null,null,""]
["","","",null,{"$f":"IF(D29=\"\",\"\",(VLOOKUP(D29,'Membership #'!$A$1:$C$1005,2,0)))","v":""},{"$f":"IF(D29=\"\",\"\",(VLOOKUP(D29,'Membership #'!$A$1:$C$1005,3,0)))","v":""},null,null,""]
["","","",null,{"$f":"IF(D30=\"\",\"\",(VLOOKUP(D30,'Membership #'!$A$1:$C$1005,2,0)))","v":""},{"$f":"IF(D30=\"\",\"\",(VLOOKUP(D30,'Membership #'!$A$1:$C$1005,3,0)))","v":""},null,null,""]
["","","",null,{"$f":"IF(D31=\"\",\"\",(VLOOKUP(D31,'Membership #'!$A$1:$C$1005,2,0)))","v":""},{"$f":"IF(D31=\"\",\"\",(VLOOKUP(D31,'Membership #'!$A$1:$C$1005,3,0)))","v":""},null,null,""]
["","","",null,{"$f":"IF(D32=\"\",\"\",(VLOOKUP(D32,'Membership #'!$A$1:$C$1005,2,0)))","v":""},{"$f":"IF(D32=\"\",\"\",(VLOOKUP(D32,'Membership #'!$A$1:$C$1005,3,0)))","v":""},null,null,""]
["","","",null,{"$f":"IF(D33=\"\",\"\",(VLOOKUP(D33,'Membership #'!$A$1:$C$1005,2,0)))","v":""},{"$f":"IF(D33=\"\",\"\",(VLOOKUP(D33,'Membership #'!$A$1:$C$1005,3,0)))","v":""},null,null,{"$f":"IF(G33=\"n\",\"No Time\",IF(G33=\"x\",\"Scratch\",IF(G33<>\"\",SUM(G33+H33),\"\")))","v":""}]
["","","",null,{"$f":"IF(D34=\"\",\"\",(VLOOKUP(D34,'Membership #'!$A$1:$C$1005,2,0)))","v":""},{"$f":"IF(D34=\"\",\"\",(VLOOKUP(D34,'Membership #'!$A$1:$C$1005,3,0)))","v":""},null,null,""]
["","","",null,{"$f":"IF(D35=\"\",\"\",(VLOOKUP(D35,'Membership #'!$A$1:$C$1005,2,0)))","v":""},{"$f":"IF(D35=\"\",\"\",(VLOOKUP(D35,'Membership #'!$A$1:$C$1005,3,0)))","v":""},null,null,""]
["","","",null,{"$f":"IF(D36=\"\",\"\",(VLOOKUP(D36,'Membership #'!$A$1:$C$1005,2,0)))","v":""},{"$f":"IF(D36=\"\",\"\",(VLOOKUP(D36,'Membership #'!$A$1:$C$1005,3,0)))","v":""},null,null,""]
["","","",null,{"$f":"IF(D37=\"\",\"\",(VLOOKUP(D37,'Membership #'!$A$1:$C$1005,2,0)))","v":""},{"$f":"IF(D37=\"\",\"\",(VLOOKUP(D37,'Membership #'!$A$1:$C$1005,3,0)))","v":""},null,null,{"$f":"IF(G37=\"n\",\"No Time\",IF(G37=\"x\",\"Scratch\",IF(G37<>\"\",SUM(G37+H37),\"\")))","v":""}]
["","","",null,{"$f":"IF(D38=\"\",\"\",(VLOOKUP(D38,'Membership #'!$A$1:$C$1005,2,0)))","v":""},{"$f":"IF(D38=\"\",\"\",(VLOOKUP(D38,'Membership #'!$A$1:$C$1005,3,0)))","v":""},null,null,""]
["","","",null,{"$f":"IF(D39=\"\",\"\",(VLOOKUP(D39,'Membership #'!$A$1:$C$1005,2,0)))","v":""},{"$f":"IF(D39=\"\",\"\",(VLOOKUP(D39,'Membership #'!$A$1:$C$1005,3,0)))","v":""},null,null,""]
["",{"$f":"IF(D40<>\"\",RANK(A40,A$8:A$97),\"\")","v":""},"",null,{"$f":"IF(D40=\"\",\"\",(VLOOKUP(D40,'Membership #'!$A$1:$C$1005,2,0)))","v":""},{"$f":"IF(D40=\"\",\"\",(VLOOKUP(D40,'Membership #'!$A$1:$C$1005,3,0)))","v":""},null,null,""]
["","","",null,{"$f":"IF(D41=\"\",\"\",(VLOOKUP(D41,'Membership #'!$A$1:$C$1005,2,0)))","v":""},{"$f":"IF(D41=\"\",\"\",(VLOOKUP(D41,'Membership #'!$A$1:$C$1005,3,0)))","v":""},null,null,""]
["","","",null,{"$f":"IF(D42=\"\",\"\",(VLOOKUP(D42,'Membership #'!$A$1:$C$1005,2,0)))","v":""},{"$f":"IF(D42=\"\",\"\",(VLOOKUP(D42,'Membership #'!$A$1:$C$1005,3,0)))","v":""},null,null,""]
["","","",null,{"$f":"IF(D43=\"\",\"\",(VLOOKUP(D43,'Membership #'!$A$1:$C$1005,2,0)))","v":""},{"$f":"IF(D43=\"\",\"\",(VLOOKUP(D43,'Membership #'!$A$1:$C$1005,3,0)))","v":""},null,null,""]
["","","",null,{"$f":"IF(D44=\"\",\"\",(VLOOKUP(D44,'Membership #'!$A$1:$C$1005,2,0)))","v":""},{"$f":"IF(D44=\"\",\"\",(VLOOKUP(D44,'Membership #'!$A$1:$C$1005,3,0)))","v":""},null,null,""]
["","","",null,{"$f":"IF(D45=\"\",\"\",(VLOOKUP(D45,'Membership #'!$A$1:$C$1005,2,0)))","v":""},{"$f":"IF(D45=\"\",\"\",(VLOOKUP(D45,'Membership #'!$A$1:$C$1005,3,0)))","v":""},null,null,""]
["","","",null,{"$f":"IF(D46=\"\",\"\",(VLOOKUP(D46,'Membership #'!$A$1:$C$1005,2,0)))","v":""},{"$f":"IF(D46=\"\",\"\",(VLOOKUP(D46,'Membership #'!$A$1:$C$1005,3,0)))","v":""},null,null,""]
["","","",null,{"$f":"IF(D47=\"\",\"\",(VLOOKUP(D47,'Membership #'!$A$1:$C$1005,2,0)))","v":""},{"$f":"IF(D47=\"\",\"\",(VLOOKUP(D47,'Membership #'!$A$1:$C$1005,3,0)))","v":""},null,null,""]
["","","",null,{"$f":"IF(D48=\"\",\"\",(VLOOKUP(D48,'Membership #'!$A$1:$C$1005,2,0)))","v":""},{"$f":"IF(D48=\"\",\"\",(VLOOKUP(D48,'Membership #'!$A$1:$C$1005,3,0)))","v":""},null,null,""]
["","","",null,{"$f":"IF(D49=\"\",\"\",(VLOOKUP(D49,'Membership #'!$A$1:$C$1005,2,0)))","v":""},{"$f":"IF(D49=\"\",\"\",(VLOOKUP(D49,'Membership #'!$A$1:$C$1005,3,0)))","v":""},null,null,""]
["","","",null,{"$f":"IF(D50=\"\",\"\",(VLOOKUP(D50,'Membership #'!$A$1:$C$1005,2,0)))","v":""},{"$f":"IF(D50=\"\",\"\",(VLOOKUP(D50,'Membership #'!$A$1:$C$1005,3,0)))","v":""},null,null,""]
["","","",null,{"$f":"IF(D51=\"\",\"\",(VLOOKUP(D51,'Membership #'!$A$1:$C$1005,2,0)))","v":""},{"$f":"IF(D51=\"\",\"\",(VLOOKUP(D51,'Membership #'!$A$1:$C$1005,3,0)))","v":""},null,null,""]
["","","",null,{"$f":"IF(D52=\"\",\"\",(VLOOKUP(D52,'Membership #'!$A$1:$C$1005,2,0)))","v":""},{"$f":"IF(D52=\"\",\"\",(VLOOKUP(D52,'Membership #'!$A$1:$C$1005,3,0)))","v":""},null,null,""]
["","","",null,{"$f":"IF(D53=\"\",\"\",(VLOOKUP(D53,'Membership #'!$A$1:$C$1005,2,0)))","v":""},{"$f":"IF(D53=\"\",\"\",(VLOOKUP(D53,'Membership #'!$A$1:$C$1005,3,0)))","v":""},null,null,""]
["","","",null,{"$f":"IF(D54=\"\",\"\",(VLOOKUP(D54,'Membership #'!$A$1:$C$1005,2,0)))","v":""},{"$f":"IF(D54=\"\",\"\",(VLOOKUP(D54,'Membership #'!$A$1:$C$1005,3,0)))","v":""},null,null,""]
["","","",null,{"$f":"IF(D55=\"\",\"\",(VLOOKUP(D55,'Membership #'!$A$1:$C$1005,2,0)))","v":""},{"$f":"IF(D55=\"\",\"\",(VLOOKUP(D55,'Membership #'!$A$1:$C$1005,3,0)))","v":""},null,null,""]
["","","",null,{"$f":"IF(D56=\"\",\"\",(VLOOKUP(D56,'Membership #'!$A$1:$C$1005,2,0)))","v":""},{"$f":"IF(D56=\"\",\"\",(VLOOKUP(D56,'Membership #'!$A$1:$C$1005,3,0)))","v":""},null,null,""]
["","","",null,{"$f":"IF(D57=\"\",\"\",(VLOOKUP(D57,'Membership #'!$A$1:$C$1005,2,0)))","v":""},{"$f":"IF(D57=\"\",\"\",(VLOOKUP(D57,'Membership #'!$A$1:$C$1005,3,0)))","v":""},null,null,""]
["","","",null,{"$f":"IF(D58=\"\",\"\",(VLOOKUP(D58,'Membership #'!$A$1:$C$1005,2,0)))","v":""},{"$f":"IF(D58=\"\",\"\",(VLOOKUP(D58,'Membership #'!$A$1:$C$1005,3,0)))","v":""},null,null,""]
["","","",null,{"$f":"IF(D59=\"\",\"\",(VLOOKUP(D59,'Membership #'!$A$1:$C$1005,2,0)))","v":""},{"$f":"IF(D59=\"\",\"\",(VLOOKUP(D59,'Membership #'!$A$1:$C$1005,3,0)))","v":""},null,null,""]
["","","",null,{"$f":"IF(D60=\"\",\"\",(VLOOKUP(D60,'Membership #'!$A$1:$C$1005,2,0)))","v":""},{"$f":"IF(D60=\"\",\"\",(VLOOKUP(D60,'Membership #'!$A$1:$C$1005,3,0)))","v":""},null,null,""]
["","","",null,{"$f":"IF(D61=\"\",\"\",(VLOOKUP(D61,'Membership #'!$A$1:$C$1005,2,0)))","v":""},{"$f":"IF(D61=\"\",\"\",(VLOOKUP(D61,'Membership #'!$A$1:$C$1005,3,0)))","v":""},null,null,""]
["","","",null,{"$f":"IF(D62=\"\",\"\",(VLOOKUP(D62,'Membership #'!$A$1:$C$1005,2,0)))","v":""},{"$f":"IF(D62=\"\",\"\",(VLOOKUP(D62,'Membership #'!$A$1:$C$1005,3,0)))","v":""},null,null,""]
["","","",null,{"$f":"IF(D63=\"\",\"\",(VLOOKUP(D63,'Membership #'!$A$1:$C$1005,2,0)))","v":""},{"$f":"IF(D63=\"\",\"\",(VLOOKUP(D63,'Membership #'!$A$1:$C$1005,3,0)))","v":""},null,null,""]
["","","",null,{"$f":"IF(D64=\"\",\"\",(VLOOKUP(D64,'Membership #'!$A$1:$C$1005,2,0)))","v":""},{"$f":"IF(D64=\"\",\"\",(VLOOKUP(D64,'Membership #'!$A$1:$C$1005,3,0)))","v":""},null,null,""]
["","","",null,{"$f":"IF(D65=\"\",\"\",(VLOOKUP(D65,'Membership #'!$A$1:$C$1005,2,0)))","v":""},{"$f":"IF(D65=\"\",\"\",(VLOOKUP(D65,'Membership #'!$A$1:$C$1005,3,0)))","v":""},null,null,""]
["","","",null,{"$f":"IF(D66=\"\",\"\",(VLOOKUP(D66,'Membership #'!$A$1:$C$1005,2,0)))","v":""},{"$f":"IF(D66=\"\",\"\",(VLOOKUP(D66,'Membership #'!$A$1:$C$1005,3,0)))","v":""},null,null,""]
["","","",null,{"$f":"IF(D67=\"\",\"\",(VLOOKUP(D67,'Membership #'!$A$1:$C$1005,2,0)))","v":""},{"$f":"IF(D67=\"\",\"\",(VLOOKUP(D67,'Membership #'!$A$1:$C$1005,3,0)))","v":""},null,null,""]
[{"$f":"IF(D68<>\"\",RAND(),\"\")","v":""},"","",null,{"$f":"IF(D68=\"\",\"\",(VLOOKUP(D68,'Membership #'!$A$1:$C$1005,2,0)))","v":""},{"$f":"IF(D68=\"\",\"\",(VLOOKUP(D68,'Membership #'!$A$1:$C$1005,3,0)))","v":""},null,null,""]
["","","",null,{"$f":"IF(D69=\"\",\"\",(VLOOKUP(D69,'Membership #'!$A$1:$C$1005,2,0)))","v":""},{"$f":"IF(D69=\"\",\"\",(VLOOKUP(D69,'Membership #'!$A$1:$C$1005,3,0)))","v":""},null,null,{"$f":"IF(G69=\"n\",\"No Time\",IF(G69=\"x\",\"Scratch\",IF(G69<>\"\",SUM(G69+H69),\"\")))","v":""}]
["","","",null,{"$f":"IF(D70=\"\",\"\",(VLOOKUP(D70,'Membership #'!$A$1:$C$1005,2,0)))","v":""},{"$f":"IF(D70=\"\",\"\",(VLOOKUP(D70,'Membership #'!$A$1:$C$1005,3,0)))","v":""},null,null,""]
["","","",null,{"$f":"IF(D71=\"\",\"\",(VLOOKUP(D71,'Membership #'!$A$1:$C$1005,2,0)))","v":""},{"$f":"IF(D71=\"\",\"\",(VLOOKUP(D71,'Membership #'!$A$1:$C$1005,3,0)))","v":""},null,null,""]
["",{"$f":"IF(D72<>\"\",RANK(A72,A$8:A$97),\"\")","v":""},"",null,{"$f":"IF(D72=\"\",\"\",(VLOOKUP(D72,'Membership #'!$A$1:$C$1005,2,0)))","v":""},{"$f":"IF(D72=\"\",\"\",(VLOOKUP(D72,'Membership #'!$A$1:$C$1005,3,0)))","v":""},null,null,""]
["","","",null,{"$f":"IF(D73=\"\",\"\",(VLOOKUP(D73,'Membership #'!$A$1:$C$1005,2,0)))","v":""},{"$f":"IF(D73=\"\",\"\",(VLOOKUP(D73,'Membership #'!$A$1:$C$1005,3,0)))","v":""},null,null,""]
["","","",null,{"$f":"IF(D74=\"\",\"\",(VLOOKUP(D74,'Membership #'!$A$1:$C$1005,2,0)))","v":""},{"$f":"IF(D74=\"\",\"\",(VLOOKUP(D74,'Membership #'!$A$1:$C$1005,3,0)))","v":""},null,null,""]
["","","",null,{"$f":"IF(D75=\"\",\"\",(VLOOKUP(D75,'Membership #'!$A$1:$C$1005,2,0)))","v":""},{"$f":"IF(D75=\"\",\"\",(VLOOKUP(D75,'Membership #'!$A$1:$C$1005,3,0)))","v":""},null,null,""]
["","","",null,{"$f":"IF(D76=\"\",\"\",(VLOOKUP(D76,'Membership #'!$A$1:$C$1005,2,0)))","v":""},{"$f":"IF(D76=\"\",\"\",(VLOOKUP(D76,'Membership #'!$A$1:$C$1005,3,0)))","v":""},null,null,""]
["","","",null,{"$f":"IF(D77=\"\",\"\",(VLOOKUP(D77,'Membership #'!$A$1:$C$1005,2,0)))","v":""},{"$f":"IF(D77=\"\",\"\",(VLOOKUP(D77,'Membership #'!$A$1:$C$1005,3,0)))","v":""},null,null,""]
["","","",null,{"$f":"IF(D78=\"\",\"\",(VLOOKUP(D78,'Membership #'!$A$1:$C$1005,2,0)))","v":""},{"$f":"IF(D78=\"\",\"\",(VLOOKUP(D78,'Membership #'!$A$1:$C$1005,3,0)))","v":""},null,null,""]
["","","",null,{"$f":"IF(D79=\"\",\"\",(VLOOKUP(D79,'Membership #'!$A$1:$C$1005,2,0)))","v":""},{"$f":"IF(D79=\"\",\"\",(VLOOKUP(D79,'Membership #'!$A$1:$C$1005,3,0)))","v":""},null,null,""]
["","","",null,{"$f":"IF(D80=\"\",\"\",(VLOOKUP(D80,'Membership #'!$A$1:$C$1005,2,0)))","v":""},{"$f":"IF(D80=\"\",\"\",(VLOOKUP(D80,'Membership #'!$A$1:$C$1005,3,0)))","v":""},null,null,""]
["","","",null,{"$f":"IF(D81=\"\",\"\",(VLOOKUP(D81,'Membership #'!$A$1:$C$1005,2,0)))","v":""},{"$f":"IF(D81=\"\",\"\",(VLOOKUP(D81,'Membership #'!$A$1:$C$1005,3,0)))","v":""},null,null,""]
["","","",null,{"$f":"IF(D82=\"\",\"\",(VLOOKUP(D82,'Membership #'!$A$1:$C$1005,2,0)))","v":""},{"$f":"IF(D82=\"\",\"\",(VLOOKUP(D82,'Membership #'!$A$1:$C$1005,3,0)))","v":""},null,null,""]
["","","",null,{"$f":"IF(D83=\"\",\"\",(VLOOKUP(D83,'Membership #'!$A$1:$C$1005,2,0)))","v":""},{"$f":"IF(D83=\"\",\"\",(VLOOKUP(D83,'Membership #'!$A$1:$C$1005,3,0)))","v":""},null,null,""]
["","","",null,{"$f":"IF(D84=\"\",\"\",(VLOOKUP(D84,'Membership #'!$A$1:$C$1005,2,0)))","v":""},{"$f":"IF(D84=\"\",\"\",(VLOOKUP(D84,'Membership #'!$A$1:$C$1005,3,0)))","v":""},null,null,""]
["","","",null,{"$f":"IF(D85=\"\",\"\",(VLOOKUP(D85,'Membership #'!$A$1:$C$1005,2,0)))","v":""},{"$f":"IF(D85=\"\",\"\",(VLOOKUP(D85,'Membership #'!$A$1:$C$1005,3,0)))","v":""},null,null,""]
["","","",null,{"$f":"IF(D86=\"\",\"\",(VLOOKUP(D86,'Membership #'!$A$1:$C$1005,2,0)))","v":""},{"$f":"IF(D86=\"\",\"\",(VLOOKUP(D86,'Membership #'!$A$1:$C$1005,3,0)))","v":""},null,null,""]
["","","",null,{"$f":"IF(D87=\"\",\"\",(VLOOKUP(D87,'Membership #'!$A$1:$C$1005,2,0)))","v":""},{"$f":"IF(D87=\"\",\"\",(VLOOKUP(D87,'Membership #'!$A$1:$C$1005,3,0)))","v":""},null,null,""]
["","","",null,{"$f":"IF(D88=\"\",\"\",(VLOOKUP(D88,'Membership #'!$A$1:$C$1005,2,0)))","v":""},{"$f":"IF(D88=\"\",\"\",(VLOOKUP(D88,'Membership #'!$A$1:$C$1005,3,0)))","v":""},null,null,""]
["","","",null,{"$f":"IF(D89=\"\",\"\",(VLOOKUP(D89,'Membership #'!$A$1:$C$1005,2,0)))","v":""},{"$f":"IF(D89=\"\",\"\",(VLOOKUP(D89,'Membership #'!$A$1:$C$1005,3,0)))","v":""},null,null,""]
["","","",null,{"$f":"IF(D90=\"\",\"\",(VLOOKUP(D90,'Membership #'!$A$1:$C$1005,2,0)))","v":""},{"$f":"IF(D90=\"\",\"\",(VLOOKUP(D90,'Membership #'!$A$1:$C$1005,3,0)))","v":""},null,null,""]
["","","",null,{"$f":"IF(D91=\"\",\"\",(VLOOKUP(D91,'Membership #'!$A$1:$C$1005,2,0)))","v":""},{"$f":"IF(D91=\"\",\"\",(VLOOKUP(D91,'Membership #'!$A$1:$C$1005,3,0)))","v":""},null,null,""]
["","","",null,{"$f":"IF(D92=\"\",\"\",(VLOOKUP(D92,'Membership #'!$A$1:$C$1005,2,0)))","v":""},{"$f":"IF(D92=\"\",\"\",(VLOOKUP(D92,'Membership #'!$A$1:$C$1005,3,0)))","v":""},null,null,""]
["","","",null,{"$f":"IF(D93=\"\",\"\",(VLOOKUP(D93,'Membership #'!$A$1:$C$1005,2,0)))","v":""},{"$f":"IF(D93=\"\",\"\",(VLOOKUP(D93,'Membership #'!$A$1:$C$1005,3,0)))","v":""},null,null,""]
["","","",null,{"$f":"IF(D94=\"\",\"\",(VLOOKUP(D94,'Membership #'!$A$1:$C$1005,2,0)))","v":""},{"$f":"IF(D94=\"\",\"\",(VLOOKUP(D94,'Membership #'!$A$1:$C$1005,3,0)))","v":""},null,null,""]
["","","",null,{"$f":"IF(D95=\"\",\"\",(VLOOKUP(D95,'Membership #'!$A$1:$C$1005,2,0)))","v":""},{"$f":"IF(D95=\"\",\"\",(VLOOKUP(D95,'Membership #'!$A$1:$C$1005,3,0)))","v":""},null,null,""]
["","","",null,{"$f":"IF(D96=\"\",\"\",(VLOOKUP(D96,'Membership #'!$A$1:$C$1005,2,0)))","v":""},{"$f":"IF(D96=\"\",\"\",(VLOOKUP(D96,'Membership #'!$A$1:$C$1005,3,0)))","v":""},null,null,""]
["","","",null,{"$f":"IF(D97=\"\",\"\",(VLOOKUP(D97,'Membership #'!$A$1:$C$1005,2,0)))","v":""},{"$f":"IF(D97=\"\",\"\",(VLOOKUP(D97,'Membership #'!$A$1:$C$1005,3,0)))","v":""},null,null,""]

{"sheet":"OPEN POLES","index":15,"n_rows":101,"n_cols":26,"rows_kept":101,"cut":false,"hidden":false,"merged":[[0,0,0,10],[1,0,1,10],[2,6,2,10],[3,0,6,0],[3,4,6,4],[3,5,6,5],[3,6,6,6],[3,1,6,1],[2,0,2,3],[3,2,6,2],[5,12,5,15],[3,3,6,3],[3,7,6,7],[3,10,6,10],[3,8,6,8],[3,9,6,9]]}
["Tom Burt & Mark McGuire Memorial Jackpot Aug 21, 2021",null,null,null,null,null,null,null,null,null,null,null,"x=Scratch"]
["OPEN POLES",null,null,null,null,null,null,null,null,null,null,null,"n=No Time"]
["# Enteries:",null,null,null,{"$f":"COUNTIF($D$8:$D$100,\">0\")","v":19},null,null,null,null,null,null,null,null,null,null,null,null,"Don't Erase these numbers below!!"]
["Rand Draw","Seed","Running Order","RING #      ","NAME","HORSE NAME","TIME","PENALTY ","TOTAL","PLACINGS","POINTS",null,null,null,null,null,null,{"$f":"IF(N9=2,7,IF(N9=3,6,IF(N9=4,5,IF(N9=5,4,IF(AND(N9>5,N11>600),3,IF(AND(N9>5,N11<600,N11>299.99),2,IF(AND(N9>5,N11<300),1,8)))))))","v":2},1,2,3,4,5,6,7,8]
[null,null,null,null,null,null,null,null,null,null,null,null,null,null,null,null,null,null,299,"$300-","$600 -"]
[null,null,null,null,null,null,null,null,null,null,null,null,"OPEN Poles",null,null,null,null,null,"or less",599,"More","5 Entries","4 Entries","3 Entries","2 Entries"]
[null,null,null,null,null,null,null,null,null,null,null,null,null,null,null,null,null,"1st",0.32,0.27,0.24,0.35,0.4,0.46,0.6]
[{"$f":"IF(D8<>\"\",RAND(),\"\")","v":0.78236530639771784},{"$f":"IF(D8<>\"\",RANK(A8,A$8:A$101),\"\")","v":7},1,703,{"$f":"IF(D8=\"\",\"\",(VLOOKUP(D8,'Membership #'!$A$1:$C$1005,2,0)))","v":"Chris Baker"},{"$f":"IF(D8=\"\",\"\",(VLOOKUP(D8,'Membership #'!$A$1:$C$1005,3,0)))","v":"Jamer All Fired Up"},21.163,null,{"$f":"IF(G8=\"n\",\"No Time\",IF(G8=\"x\",\"Scratch\",IF(G8<>\"\",SUM(G8+H8),\"\")))","v":21.163},null,null,null,"Added",150,null,null,null,"2nd",0.23,0.22,0.19,0.25,0.28000000000000003,0.34,0.4]
[{"$f":"IF(D9<>\"\",RAND(),\"\")","v":0.82542276820858518},{"$f":"IF(D9<>\"\",RANK(A9,A$8:A$101),\"\")","v":5},2,922,{"$f":"IF(D9=\"\",\"\",(VLOOKUP(D9,'Membership #'!$A$1:$C$1005,2,0)))","v":"Stevi Jardine"},{"$f":"IF(D9=\"\",\"\",(VLOOKUP(D9,'Membership #'!$A$1:$C$1005,3,0)))","v":"Paytons Pretty Cool"},21.811,null,21.811,null,null,null,"Entries",19,null,20,"per head","3rd",0.15,0.18,0.16,0.17,0.18,0.2]
[{"$f":"IF(D10<>\"\",RAND(),\"\")","v":0.24456948591378913},{"$f":"IF(D10<>\"\",RANK(A10,A$8:A$101),\"\")","v":18},3,616,{"$f":"IF(D10=\"\",\"\",(VLOOKUP(D10,'Membership #'!$A$1:$C$1005,2,0)))","v":"Judy Bateman"},{"$f":"IF(D10=\"\",\"\",(VLOOKUP(D10,'Membership #'!$A$1:$C$1005,3,0)))","v":"HM HollywoodRockstar"},22.786000000000001,null,22.786000000000001,null,null,null,"Jackpot",{"$f":"P9*N9","v":380},null,0.85,"payback","4th",0.12,0.13,0.13,0.13,0.14000000000000001]
[{"$f":"IF(D11<>\"\",RAND(),\"\")","v":0.2494435185706273},{"$f":"IF(D11<>\"\",RANK(A11,A$8:A$101),\"\")","v":17},4,892,{"$f":"IF(D11=\"\",\"\",(VLOOKUP(D11,'Membership #'!$A$1:$C$1005,2,0)))","v":"Donnie MacNeil"},{"$f":"IF(D11=\"\",\"\",(VLOOKUP(D11,'Membership #'!$A$1:$C$1005,3,0)))","v":"Gifted Go Gold"},23.753,null,23.753,null,null,null,"Total Money",{"$f":"N8+(N10*P10)","v":473},null,{"$f":"N10*P10","v":323},"Jackpot","5th",0.1,0.09,0.08,0.1]
[0.65465629348027632,11,5,855,{"$f":"IF(D12=\"\",\"\",(VLOOKUP(D12,'Membership #'!$A$1:$C$1005,2,0)))","v":"Jenelle Collier"},{"$f":"IF(D12=\"\",\"\",(VLOOKUP(D12,'Membership #'!$A$1:$C$1005,3,0)))","v":"Peppy Sans Surprise"},24.036999999999999,null,24.036999999999999,null,null,null,null,"Percentage","Money","Ring #",null,"6th",0.08,0.06,0.06]
[0.43027713401454293,15,6,904,{"$f":"IF(D13=\"\",\"\",(VLOOKUP(D13,'Membership #'!$A$1:$C$1005,2,0)))","v":"Ella Cowley"},{"$f":"IF(D13=\"\",\"\",(VLOOKUP(D13,'Membership #'!$A$1:$C$1005,3,0)))","v":"Blazin Boots"},24.611000000000001,null,24.611000000000001,null,null,null,"1st",{"$f":"HLOOKUP($R$4,$S$4:$Z$17,4,0)","v":0.27},{"$f":"IF(N13<>0,N$11*N13,\"\")","v":127.71000000000001},null,{"$f":"IF(P13=\"\",\"\",(VLOOKUP(P13,'Membership #'!$A$1:$C$1005,2,0)))","v":""},"7th",null,0.03,0.05]
[0.9017449921820172,3,7,684,{"$f":"IF(D14=\"\",\"\",(VLOOKUP(D14,'Membership #'!$A$1:$C$1005,2,0)))","v":"Shann Cox"},{"$f":"IF(D14=\"\",\"\",(VLOOKUP(D14,'Membership #'!$A$1:$C$1005,3,0)))","v":"Jags Cash Flow"},21.401,5,26.401,null,null,null,"2nd",{"$f":"HLOOKUP($R$4,$S$4:$Z$17,5,0)","v":0.22},104.06,null,{"$f":"IF(P14=\"\",\"\",(VLOOKUP(P14,'Membership #'!$A$1:$C$1005,2,0)))","v":""},"8th",null,0.02,0.04]
[0.96330738082315359,1,8,516,{"$f":"IF(D15=\"\",\"\",(VLOOKUP(D15,'Membership #'!$A$1:$C$1005,2,0)))","v":"Laurie Don Reginato"},{"$f":"IF(D15=\"\",\"\",(VLOOKUP(D15,'Membership #'!$A$1:$C$1005,3,0)))","v":"TCR Gold Runny"},22.015000000000001,5,27.015000000000001,null,null,null,"3rd",{"$f":"HLOOKUP($R$4,$S$4:$Z$17,6,0)","v":0.18},85.14,null,{"$f":"IF(P15=\"\",\"\",(VLOOKUP(P15,'Membership #'!$A$1:$C$1005,2,0)))","v":""},"9th",null,null,0.03]
[0.76234493358951594,8,9,700,{"$f":"IF(D16=\"\",\"\",(VLOOKUP(D16,'Membership #'!$A$1:$C$1005,2,0)))","v":"Lindsay Baker"},{"$f":"IF(D16=\"\",\"\",(VLOOKUP(D16,'Membership #'!$A$1:$C$1005,3,0)))","v":"Boons Laughing Boy"},22.03,5,27.03,null,null,null,"4th",{"$f":"HLOOKUP($R$4,$S$4:$Z$17,7,0)","v":0.13},61.49,null,{"$f":"IF(P16=\"\",\"\",(VLOOKUP(P16,'Membership #'!$A$1:$C$1005,2,0)))","v":""},"10th",null,null,0.02]
[0.58680897428206091,12,10,914,{"$f":"IF(D17=\"\",\"\",(VLOOKUP(D17,'Membership #'!$A$1:$C$1005,2,0)))","v":"Shelby MacPherson"},{"$f":"IF(D17=\"\",\"\",(VLOOKUP(D17,'Membership #'!$A$1:$C$1005,3,0)))","v":"Shelbys Badger Bar"},22.773,5,27.773,null,null,null,"5th",{"$f":"HLOOKUP($R$4,$S$4:$Z$17,8,0)","v":0.09},42.57,null,{"$f":"IF(P17=\"\",\"\",(VLOOKUP(P17,'Membership #'!$A$1:$C$1005,2,0)))","v":""}]
[0.72770733503229346,10,11,695,{"$f":"IF(D18=\"\",\"\",(VLOOKUP(D18,'Membership #'!$A$1:$C$1005,2,0)))","v":"Tessa Dicks"},{"$f":"IF(D18=\"\",\"\",(VLOOKUP(D18,'Membership #'!$A$1:$C$1005,3,0)))","v":"Charge's Dusty Luck"},23.184000000000001,5,28.184000000000001,null,null,null,"6th",{"$f":"HLOOKUP($R$4,$S$4:$Z$17,9,0)","v":0.06},28.38,null,{"$f":"IF(P18=\"\",\"\",(VLOOKUP(P18,'Membership #'!$A$1:$C$1005,2,0)))","v":""}]
[0.55413646698831687,13,12,732,{"$f":"IF(D19=\"\",\"\",(VLOOKUP(D19,'Membership #'!$A$1:$C$1005,2,0)))","v":"Brenna Carrigan"},{"$f":"IF(D19=\"\",\"\",(VLOOKUP(D19,'Membership #'!$A$1:$C$1005,3,0)))","v":"Carlos"},29.388000000000002,null,29.388000000000002,null,null,null,"7th",{"$f":"HLOOKUP($R$4,$S$4:$Z$17,10,0)","v":0.03},14.19,null,{"$f":"IF(P19=\"\",\"\",(VLOOKUP(P19,'Membership #'!$A$1:$C$1005,2,0)))","v":""}]
[0.32902523000775685,16,13,777,{"$f":"IF(D20=\"\",\"\",(VLOOKUP(D20,'Membership #'!$A$1:$C$1005,2,0)))","v":"Julia Parker"},{"$f":"IF(D20=\"\",\"\",(VLOOKUP(D20,'Membership #'!$A$1:$C$1005,3,0)))","v":"Doc's Spirit Prairie"},23.003,10,33.003,null,null,null,"8th",{"$f":"HLOOKUP($R$4,$S$4:$Z$17,11,0)","v":0.02},9.4600000000000009,null,{"$f":"IF(P20=\"\",\"\",(VLOOKUP(P20,'Membership #'!$A$1:$C$1005,2,0)))","v":""}]
[0.91260614005168117,2,14,973,{"$f":"IF(D21=\"\",\"\",(VLOOKUP(D21,'Membership #'!$A$1:$C$1005,2,0)))","v":"Sara Ivey"},{"$f":"IF(D21=\"\",\"\",(VLOOKUP(D21,'Membership #'!$A$1:$C$1005,3,0)))","v":"Ms Heavenly Gator"},34.69,5,39.69,null,null,null,"9th",{"$f":"HLOOKUP($R$4,$S$4:$Z$17,12,0)","v":0},"",null,{"$f":"IF(P21=\"\",\"\",(VLOOKUP(P21,'Membership #'!$A$1:$C$1005,2,0)))","v":""}]
[0.45920737218363583,14,15,971,{"$f":"IF(D22=\"\",\"\",(VLOOKUP(D22,'Membership #'!$A$1:$C$1005,2,0)))","v":"Arielle Burke"},{"$f":"IF(D22=\"\",\"\",(VLOOKUP(D22,'Membership #'!$A$1:$C$1005,3,0)))","v":"Elm Sally"},42.372,null,42.372,null,null,null,"10th",{"$f":"HLOOKUP($R$4,$S$4:$Z$17,13,0)","v":0},"",null,{"$f":"IF(P22=\"\",\"\",(VLOOKUP(P22,'Membership #'!$A$1:$C$1005,2,0)))","v":""}]
[0.78628531123864187,6,16,698,{"$f":"IF(D23=\"\",\"\",(VLOOKUP(D23,'Membership #'!$A$1:$C$1005,2,0)))","v":"Kaleigh Denton"},{"$f":"IF(D23=\"\",\"\",(VLOOKUP(D23,'Membership #'!$A$1:$C$1005,3,0)))","v":"Coleasaki"},52.609000000000002,10,62.609000000000002,null,null,null,"Total Money",null,{"$f":"SUM(O13:O22)","v":473}]
[0.75514907534980369,9,17,538,{"$f":"IF(D24=\"\",\"\",(VLOOKUP(D24,'Membership #'!$A$1:$C$1005,2,0)))","v":"Jean DuGas"},{"$f":"IF(D24=\"\",\"\",(VLOOKUP(D24,'Membership #'!$A$1:$C$1005,3,0)))","v":"Pal's Lilguy"},"x",null,"Scratch"]
[0.13300268781553437,19,18,674,{"$f":"IF(D25=\"\",\"\",(VLOOKUP(D25,'Membership #'!$A$1:$C$1005,2,0)))","v":"Kyle Beaton"},{"$f":"IF(D25=\"\",\"\",(VLOOKUP(D25,'Membership #'!$A$1:$C$1005,3,0)))","v":"Jus For Kicks"},"x",null,"Scratch"]
[0.88859259954701986,4,19,78,{"$f":"IF(D26=\"\",\"\",(VLOOKUP(D26,'Membership #'!$A$1:$C$1005,2,0)))","v":"Stephanie Rich"},{"$f":"IF(D26=\"\",\"\",(VLOOKUP(D26,'Membership #'!$A$1:$C$1005,3,0)))","v":"Texas Mickey"},"x",null,"Scratch"]
["","","",null,{"$f":"IF(D27=\"\",\"\",(VLOOKUP(D27,'Membership #'!$A$1:$C$1005,2,0)))","v":""},{"$f":"IF(D27=\"\",\"\",(VLOOKUP(D27,'Membership #'!$A$1:$C$1005,3,0)))","v":""},null,null,{"$f":"IF(G27=\"n\",\"No Time\",IF(G27=\"x\",\"Scratch\",IF(G27<>\"\",SUM(G27+H27),\"\")))","v":""}]
["","","",null,{"$f":"IF(D28=\"\",\"\",(VLOOKUP(D28,'Membership #'!$A$1:$C$1005,2,0)))","v":""},{"$f":"IF(D28=\"\",\"\",(VLOOKUP(D28,'Membership #'!$A$1:$C$1005,3,0)))","v":""},null,null,""]
["","","",null,{"$f":"IF(D29=\"\",\"\",(VLOOKUP(D29,'Membership #'!$A$1:$C$1005,2,0)))","v":""},{"$f":"IF(D29=\"\",\"\",(VLOOKUP(D29,'Membership #'!$A$1:$C$1005,3,0)))","v":""},null,null,""]
["","","",null,{"$f":"IF(D30=\"\",\"\",(VLOOKUP(D30,'Membership #'!$A$1:$C$1005,2,0)))","v":""},{"$f":"IF(D30=\"\",\"\",(VLOOKUP(D30,'Membership #'!$A$1:$C$1005,3,0)))","v":""},null,null,""]
[{"$f":"IF(D31<>\"\",RAND(),\"\")","v":""},{"$f":"IF(D31<>\"\",RANK(A31,A$8:A$101),\"\")","v":""},"",null,{"$f":"IF(D31=\"\",\"\",(VLOOKUP(D31,'Membership #'!$A$1:$C$1005,2,0)))","v":""},{"$f":"IF(D31=\"\",\"\",(VLOOKUP(D31,'Membership #'!$A$1:$C$1005,3,0)))","v":""},null,null,{"$f":"IF(G31=\"n\",\"No Time\",IF(G31=\"x\",\"Scratch\",IF(G31<>\"\",SUM(G31+H31),\"\")))","v":""}]
["","","",null,{"$f":"IF(D32=\"\",\"\",(VLOOKUP(D32,'Membership #'!$A$1:$C$1005,2,0)))","v":""},{"$f":"IF(D32=\"\",\"\",(VLOOKUP(D32,'Membership #'!$A$1:$C$1005,3,0)))","v":""},null,null,""]
["","","",null,{"$f":"IF(D33=\"\",\"\",(VLOOKUP(D33,'Membership #'!$A$1:$C$1005,2,0)))","v":""},{"$f":"IF(D33=\"\",\"\",(VLOOKUP(D33,'Membership #'!$A$1:$C$1005,3,0)))","v":""},null,null,""]
["","","",null,{"$f":"IF(D34=\"\",\"\",(VLOOKUP(D34,'Membership #'!$A$1:$C$1005,2,0)))","v":""},{"$f":"IF(D34=\"\",\"\",(VLOOKUP(D34,'Membership #'!$A$1:$C$1005,3,0)))","v":""},null,null,{"$f":"IF(G34=\"n\",\"No Time\",IF(G34=\"x\",\"Scratch\",IF(G34<>\"\",SUM(G34+H34),\"\")))","v":""}]
["","","",null,{"$f":"IF(D35=\"\",\"\",(VLOOKUP(D35,'Membership #'!$A$1:$C$1005,2,0)))","v":""},{"$f":"IF(D35=\"\",\"\",(VLOOKUP(D35,'Membership #'!$A$1:$C$1005,3,0)))","v":""},null,null,{"$f":"IF(G35=\"n\",\"No Time\",IF(G35=\"x\",\"Scratch\",IF(G35<>\"\",SUM(G35+H35),\"\")))","v":""}]
["","","",null,{"$f":"IF(D36=\"\",\"\",(VLOOKUP(D36,'Membership #'!$A$1:$C$1005,2,0)))","v":""},{"$f":"IF(D36=\"\",\"\",(VLOOKUP(D36,'Membership #'!$A$1:$C$1005,3,0)))","v":""},null,null,""]
["","","",null,{"$f":"IF(D37=\"\",\"\",(VLOOKUP(D37,'Membership #'!$A$1:$C$1005,2,0)))","v":""},{"$f":"IF(D37=\"\",\"\",(VLOOKUP(D37,'Membership #'!$A$1:$C$1005,3,0)))","v":""},null,null,""]
["","","",null,{"$f":"IF(D38=\"\",\"\",(VLOOKUP(D38,'Membership #'!$A$1:$C$1005,2,0)))","v":""},{"$f":"IF(D38=\"\",\"\",(VLOOKUP(D38,'Membership #'!$A$1:$C$1005,3,0)))","v":""},null,null,{"$f":"IF(G38=\"n\",\"No Time\",IF(G38=\"x\",\"Scratch\",IF(G38<>\"\",SUM(G38+H38),\"\")))","v":""}]
["","","",null,{"$f":"IF(D39=\"\",\"\",(VLOOKUP(D39,'Membership #'!$A$1:$C$1005,2,0)))","v":""},{"$f":"IF(D39=\"\",\"\",(VLOOKUP(D39,'Membership #'!$A$1:$C$1005,3,0)))","v":""},null,null,""]
["",{"$f":"IF(D40<>\"\",RANK(A40,A$8:A$101),\"\")","v":""},"",null,{"$f":"IF(D40=\"\",\"\",(VLOOKUP(D40,'Membership #'!$A$1:$C$1005,2,0)))","v":""},{"$f":"IF(D40=\"\",\"\",(VLOOKUP(D40,'Membership #'!$A$1:$C$1005,3,0)))","v":""},null,null,""]
["","","",null,{"$f":"IF(D41=\"\",\"\",(VLOOKUP(D41,'Membership #'!$A$1:$C$1005,2,0)))","v":""},{"$f":"IF(D41=\"\",\"\",(VLOOKUP(D41,'Membership #'!$A$1:$C$1005,3,0)))","v":""},null,null,""]
["","","",null,{"$f":"IF(D42=\"\",\"\",(VLOOKUP(D42,'Membership #'!$A$1:$C$1005,2,0)))","v":""},{"$f":"IF(D42=\"\",\"\",(VLOOKUP(D42,'Membership #'!$A$1:$C$1005,3,0)))","v":""},null,null,""]
["","","",null,{"$f":"IF(D43=\"\",\"\",(VLOOKUP(D43,'Membership #'!$A$1:$C$1005,2,0)))","v":""},{"$f":"IF(D43=\"\",\"\",(VLOOKUP(D43,'Membership #'!$A$1:$C$1005,3,0)))","v":""},null,null,""]
["","","",null,{"$f":"IF(D44=\"\",\"\",(VLOOKUP(D44,'Membership #'!$A$1:$C$1005,2,0)))","v":""},{"$f":"IF(D44=\"\",\"\",(VLOOKUP(D44,'Membership #'!$A$1:$C$1005,3,0)))","v":""},null,null,""]
["","","",null,{"$f":"IF(D45=\"\",\"\",(VLOOKUP(D45,'Membership #'!$A$1:$C$1005,2,0)))","v":""},{"$f":"IF(D45=\"\",\"\",(VLOOKUP(D45,'Membership #'!$A$1:$C$1005,3,0)))","v":""},null,null,""]
["","","",null,{"$f":"IF(D46=\"\",\"\",(VLOOKUP(D46,'Membership #'!$A$1:$C$1005,2,0)))","v":""},{"$f":"IF(D46=\"\",\"\",(VLOOKUP(D46,'Membership #'!$A$1:$C$1005,3,0)))","v":""},null,null,""]
["","","",null,{"$f":"IF(D47=\"\",\"\",(VLOOKUP(D47,'Membership #'!$A$1:$C$1005,2,0)))","v":""},{"$f":"IF(D47=\"\",\"\",(VLOOKUP(D47,'Membership #'!$A$1:$C$1005,3,0)))","v":""},null,null,""]
["","","",null,{"$f":"IF(D48=\"\",\"\",(VLOOKUP(D48,'Membership #'!$A$1:$C$1005,2,0)))","v":""},{"$f":"IF(D48=\"\",\"\",(VLOOKUP(D48,'Membership #'!$A$1:$C$1005,3,0)))","v":""},null,null,""]
["","","",null,{"$f":"IF(D49=\"\",\"\",(VLOOKUP(D49,'Membership #'!$A$1:$C$1005,2,0)))","v":""},{"$f":"IF(D49=\"\",\"\",(VLOOKUP(D49,'Membership #'!$A$1:$C$1005,3,0)))","v":""},null,null,""]
["","","",null,{"$f":"IF(D50=\"\",\"\",(VLOOKUP(D50,'Membership #'!$A$1:$C$1005,2,0)))","v":""},{"$f":"IF(D50=\"\",\"\",(VLOOKUP(D50,'Membership #'!$A$1:$C$1005,3,0)))","v":""},null,null,""]
["","","",null,{"$f":"IF(D51=\"\",\"\",(VLOOKUP(D51,'Membership #'!$A$1:$C$1005,2,0)))","v":""},{"$f":"IF(D51=\"\",\"\",(VLOOKUP(D51,'Membership #'!$A$1:$C$1005,3,0)))","v":""},null,null,""]
["","","",null,{"$f":"IF(D52=\"\",\"\",(VLOOKUP(D52,'Membership #'!$A$1:$C$1005,2,0)))","v":""},{"$f":"IF(D52=\"\",\"\",(VLOOKUP(D52,'Membership #'!$A$1:$C$1005,3,0)))","v":""},null,null,""]
["","","",null,{"$f":"IF(D53=\"\",\"\",(VLOOKUP(D53,'Membership #'!$A$1:$C$1005,2,0)))","v":""},{"$f":"IF(D53=\"\",\"\",(VLOOKUP(D53,'Membership #'!$A$1:$C$1005,3,0)))","v":""},null,null,""]
["","","",null,{"$f":"IF(D54=\"\",\"\",(VLOOKUP(D54,'Membership #'!$A$1:$C$1005,2,0)))","v":""},{"$f":"IF(D54=\"\",\"\",(VLOOKUP(D54,'Membership #'!$A$1:$C$1005,3,0)))","v":""},null,null,""]
["","","",null,{"$f":"IF(D55=\"\",\"\",(VLOOKUP(D55,'Membership #'!$A$1:$C$1005,2,0)))","v":""},{"$f":"IF(D55=\"\",\"\",(VLOOKUP(D55,'Membership #'!$A$1:$C$1005,3,0)))","v":""},null,null,""]
["","","",null,{"$f":"IF(D56=\"\",\"\",(VLOOKUP(D56,'Membership #'!$A$1:$C$1005,2,0)))","v":""},{"$f":"IF(D56=\"\",\"\",(VLOOKUP(D56,'Membership #'!$A$1:$C$1005,3,0)))","v":""},null,null,""]
["","","",null,{"$f":"IF(D57=\"\",\"\",(VLOOKUP(D57,'Membership #'!$A$1:$C$1005,2,0)))","v":""},{"$f":"IF(D57=\"\",\"\",(VLOOKUP(D57,'Membership #'!$A$1:$C$1005,3,0)))","v":""},null,null,""]
["","","",null,{"$f":"IF(D58=\"\",\"\",(VLOOKUP(D58,'Membership #'!$A$1:$C$1005,2,0)))","v":""},{"$f":"IF(D58=\"\",\"\",(VLOOKUP(D58,'Membership #'!$A$1:$C$1005,3,0)))","v":""},null,null,""]
["","","",null,{"$f":"IF(D59=\"\",\"\",(VLOOKUP(D59,'Membership #'!$A$1:$C$1005,2,0)))","v":""},{"$f":"IF(D59=\"\",\"\",(VLOOKUP(D59,'Membership #'!$A$1:$C$1005,3,0)))","v":""},null,null,""]
["","","",null,{"$f":"IF(D60=\"\",\"\",(VLOOKUP(D60,'Membership #'!$A$1:$C$1005,2,0)))","v":""},{"$f":"IF(D60=\"\",\"\",(VLOOKUP(D60,'Membership #'!$A$1:$C$1005,3,0)))","v":""},null,null,""]
["","","",null,{"$f":"IF(D61=\"\",\"\",(VLOOKUP(D61,'Membership #'!$A$1:$C$1005,2,0)))","v":""},{"$f":"IF(D61=\"\",\"\",(VLOOKUP(D61,'Membership #'!$A$1:$C$1005,3,0)))","v":""},null,null,""]
["","","",null,{"$f":"IF(D62=\"\",\"\",(VLOOKUP(D62,'Membership #'!$A$1:$C$1005,2,0)))","v":""},{"$f":"IF(D62=\"\",\"\",(VLOOKUP(D62,'Membership #'!$A$1:$C$1005,3,0)))","v":""},null,null,""]
["","","",null,{"$f":"IF(D63=\"\",\"\",(VLOOKUP(D63,'Membership #'!$A$1:$C$1005,2,0)))","v":""},{"$f":"IF(D63=\"\",\"\",(VLOOKUP(D63,'Membership #'!$A$1:$C$1005,3,0)))","v":""},null,null,""]
["","","",null,{"$f":"IF(D64=\"\",\"\",(VLOOKUP(D64,'Membership #'!$A$1:$C$1005,2,0)))","v":""},{"$f":"IF(D64=\"\",\"\",(VLOOKUP(D64,'Membership #'!$A$1:$C$1005,3,0)))","v":""},null,null,""]
["","","",null,{"$f":"IF(D65=\"\",\"\",(VLOOKUP(D65,'Membership #'!$A$1:$C$1005,2,0)))","v":""},{"$f":"IF(D65=\"\",\"\",(VLOOKUP(D65,'Membership #'!$A$1:$C$1005,3,0)))","v":""},null,null,""]
["","","",null,{"$f":"IF(D66=\"\",\"\",(VLOOKUP(D66,'Membership #'!$A$1:$C$1005,2,0)))","v":""},{"$f":"IF(D66=\"\",\"\",(VLOOKUP(D66,'Membership #'!$A$1:$C$1005,3,0)))","v":""},null,null,""]
["","","",null,{"$f":"IF(D67=\"\",\"\",(VLOOKUP(D67,'Membership #'!$A$1:$C$1005,2,0)))","v":""},{"$f":"IF(D67=\"\",\"\",(VLOOKUP(D67,'Membership #'!$A$1:$C$1005,3,0)))","v":""},null,null,""]
["","","",null,{"$f":"IF(D68=\"\",\"\",(VLOOKUP(D68,'Membership #'!$A$1:$C$1005,2,0)))","v":""},{"$f":"IF(D68=\"\",\"\",(VLOOKUP(D68,'Membership #'!$A$1:$C$1005,3,0)))","v":""},null,null,""]
["","","",null,{"$f":"IF(D69=\"\",\"\",(VLOOKUP(D69,'Membership #'!$A$1:$C$1005,2,0)))","v":""},{"$f":"IF(D69=\"\",\"\",(VLOOKUP(D69,'Membership #'!$A$1:$C$1005,3,0)))","v":""},null,null,""]
["","","",null,{"$f":"IF(D70=\"\",\"\",(VLOOKUP(D70,'Membership #'!$A$1:$C$1005,2,0)))","v":""},{"$f":"IF(D70=\"\",\"\",(VLOOKUP(D70,'Membership #'!$A$1:$C$1005,3,0)))","v":""},null,null,""]
["","","",null,{"$f":"IF(D71=\"\",\"\",(VLOOKUP(D71,'Membership #'!$A$1:$C$1005,2,0)))","v":""},{"$f":"IF(D71=\"\",\"\",(VLOOKUP(D71,'Membership #'!$A$1:$C$1005,3,0)))","v":""},null,null,""]
["",{"$f":"IF(D72<>\"\",RANK(A72,A$8:A$101),\"\")","v":""},"",null,{"$f":"IF(D72=\"\",\"\",(VLOOKUP(D72,'Membership #'!$A$1:$C$1005,2,0)))","v":""},{"$f":"IF(D72=\"\",\"\",(VLOOKUP(D72,'Membership #'!$A$1:$C$1005,3,0)))","v":""},null,null,""]
["","","",null,{"$f":"IF(D73=\"\",\"\",(VLOOKUP(D73,'Membership #'!$A$1:$C$1005,2,0)))","v":""},{"$f":"IF(D73=\"\",\"\",(VLOOKUP(D73,'Membership #'!$A$1:$C$1005,3,0)))","v":""},null,null,{"$f":"IF(G73=\"n\",\"No Time\",IF(G73=\"x\",\"Scratch\",IF(G73<>\"\",SUM(G73+H73),\"\")))","v":""}]
["","","",null,{"$f":"IF(D74=\"\",\"\",(VLOOKUP(D74,'Membership #'!$A$1:$C$1005,2,0)))","v":""},{"$f":"IF(D74=\"\",\"\",(VLOOKUP(D74,'Membership #'!$A$1:$C$1005,3,0)))","v":""},null,null,""]
["","","",null,{"$f":"IF(D75=\"\",\"\",(VLOOKUP(D75,'Membership #'!$A$1:$C$1005,2,0)))","v":""},{"$f":"IF(D75=\"\",\"\",(VLOOKUP(D75,'Membership #'!$A$1:$C$1005,3,0)))","v":""},null,null,""]
["","","",null,{"$f":"IF(D76=\"\",\"\",(VLOOKUP(D76,'Membership #'!$A$1:$C$1005,2,0)))","v":""},{"$f":"IF(D76=\"\",\"\",(VLOOKUP(D76,'Membership #'!$A$1:$C$1005,3,0)))","v":""},null,null,""]
["","","",null,{"$f":"IF(D77=\"\",\"\",(VLOOKUP(D77,'Membership #'!$A$1:$C$1005,2,0)))","v":""},{"$f":"IF(D77=\"\",\"\",(VLOOKUP(D77,'Membership #'!$A$1:$C$1005,3,0)))","v":""},null,null,""]
["","","",null,{"$f":"IF(D78=\"\",\"\",(VLOOKUP(D78,'Membership #'!$A$1:$C$1005,2,0)))","v":""},{"$f":"IF(D78=\"\",\"\",(VLOOKUP(D78,'Membership #'!$A$1:$C$1005,3,0)))","v":""},null,null,""]
["","","",null,{"$f":"IF(D79=\"\",\"\",(VLOOKUP(D79,'Membership #'!$A$1:$C$1005,2,0)))","v":""},{"$f":"IF(D79=\"\",\"\",(VLOOKUP(D79,'Membership #'!$A$1:$C$1005,3,0)))","v":""},null,null,""]
["","","",null,{"$f":"IF(D80=\"\",\"\",(VLOOKUP(D80,'Membership #'!$A$1:$C$1005,2,0)))","v":""},{"$f":"IF(D80=\"\",\"\",(VLOOKUP(D80,'Membership #'!$A$1:$C$1005,3,0)))","v":""},null,null,""]
["","","",null,{"$f":"IF(D81=\"\",\"\",(VLOOKUP(D81,'Membership #'!$A$1:$C$1005,2,0)))","v":""},{"$f":"IF(D81=\"\",\"\",(VLOOKUP(D81,'Membership #'!$A$1:$C$1005,3,0)))","v":""},null,null,""]
["","","",null,{"$f":"IF(D82=\"\",\"\",(VLOOKUP(D82,'Membership #'!$A$1:$C$1005,2,0)))","v":""},{"$f":"IF(D82=\"\",\"\",(VLOOKUP(D82,'Membership #'!$A$1:$C$1005,3,0)))","v":""},null,null,""]
["","","",null,{"$f":"IF(D83=\"\",\"\",(VLOOKUP(D83,'Membership #'!$A$1:$C$1005,2,0)))","v":""},{"$f":"IF(D83=\"\",\"\",(VLOOKUP(D83,'Membership #'!$A$1:$C$1005,3,0)))","v":""},null,null,""]
["","","",null,{"$f":"IF(D84=\"\",\"\",(VLOOKUP(D84,'Membership #'!$A$1:$C$1005,2,0)))","v":""},{"$f":"IF(D84=\"\",\"\",(VLOOKUP(D84,'Membership #'!$A$1:$C$1005,3,0)))","v":""},null,null,""]
["","","",null,{"$f":"IF(D85=\"\",\"\",(VLOOKUP(D85,'Membership #'!$A$1:$C$1005,2,0)))","v":""},{"$f":"IF(D85=\"\",\"\",(VLOOKUP(D85,'Membership #'!$A$1:$C$1005,3,0)))","v":""},null,null,""]
["","","",null,{"$f":"IF(D86=\"\",\"\",(VLOOKUP(D86,'Membership #'!$A$1:$C$1005,2,0)))","v":""},{"$f":"IF(D86=\"\",\"\",(VLOOKUP(D86,'Membership #'!$A$1:$C$1005,3,0)))","v":""},null,null,""]
[{"$f":"IF(D87<>\"\",RAND(),\"\")","v":""},"","",null,{"$f":"IF(D87=\"\",\"\",(VLOOKUP(D87,'Membership #'!$A$1:$C$1005,2,0)))","v":""},{"$f":"IF(D87=\"\",\"\",(VLOOKUP(D87,'Membership #'!$A$1:$C$1005,3,0)))","v":""},null,null,""]
["","","",null,{"$f":"IF(D88=\"\",\"\",(VLOOKUP(D88,'Membership #'!$A$1:$C$1005,2,0)))","v":""},{"$f":"IF(D88=\"\",\"\",(VLOOKUP(D88,'Membership #'!$A$1:$C$1005,3,0)))","v":""},null,null,""]
["","","",null,{"$f":"IF(D89=\"\",\"\",(VLOOKUP(D89,'Membership #'!$A$1:$C$1005,2,0)))","v":""},{"$f":"IF(D89=\"\",\"\",(VLOOKUP(D89,'Membership #'!$A$1:$C$1005,3,0)))","v":""},null,null,""]
["","","",null,{"$f":"IF(D90=\"\",\"\",(VLOOKUP(D90,'Membership #'!$A$1:$C$1005,2,0)))","v":""},{"$f":"IF(D90=\"\",\"\",(VLOOKUP(D90,'Membership #'!$A$1:$C$1005,3,0)))","v":""},null,null,""]
["","","",null,{"$f":"IF(D91=\"\",\"\",(VLOOKUP(D91,'Membership #'!$A$1:$C$1005,2,0)))","v":""},{"$f":"IF(D91=\"\",\"\",(VLOOKUP(D91,'Membership #'!$A$1:$C$1005,3,0)))","v":""},null,null,""]
["","","",null,{"$f":"IF(D92=\"\",\"\",(VLOOKUP(D92,'Membership #'!$A$1:$C$1005,2,0)))","v":""},{"$f":"IF(D92=\"\",\"\",(VLOOKUP(D92,'Membership #'!$A$1:$C$1005,3,0)))","v":""},null,null,""]
["","","",null,{"$f":"IF(D93=\"\",\"\",(VLOOKUP(D93,'Membership #'!$A$1:$C$1005,2,0)))","v":""},{"$f":"IF(D93=\"\",\"\",(VLOOKUP(D93,'Membership #'!$A$1:$C$1005,3,0)))","v":""},null,null,""]
["","","",null,{"$f":"IF(D94=\"\",\"\",(VLOOKUP(D94,'Membership #'!$A$1:$C$1005,2,0)))","v":""},{"$f":"IF(D94=\"\",\"\",(VLOOKUP(D94,'Membership #'!$A$1:$C$1005,3,0)))","v":""},null,null,""]
["","","",null,{"$f":"IF(D95=\"\",\"\",(VLOOKUP(D95,'Membership #'!$A$1:$C$1005,2,0)))","v":""},{"$f":"IF(D95=\"\",\"\",(VLOOKUP(D95,'Membership #'!$A$1:$C$1005,3,0)))","v":""},null,null,""]
["","","",null,{"$f":"IF(D96=\"\",\"\",(VLOOKUP(D96,'Membership #'!$A$1:$C$1005,2,0)))","v":""},{"$f":"IF(D96=\"\",\"\",(VLOOKUP(D96,'Membership #'!$A$1:$C$1005,3,0)))","v":""},null,null,""]
["","","",null,{"$f":"IF(D97=\"\",\"\",(VLOOKUP(D97,'Membership #'!$A$1:$C$1005,2,0)))","v":""},{"$f":"IF(D97=\"\",\"\",(VLOOKUP(D97,'Membership #'!$A$1:$C$1005,3,0)))","v":""},null,null,""]
["","","",null,{"$f":"IF(D98=\"\",\"\",(VLOOKUP(D98,'Membership #'!$A$1:$C$1005,2,0)))","v":""},{"$f":"IF(D98=\"\",\"\",(VLOOKUP(D98,'Membership #'!$A$1:$C$1005,3,0)))","v":""},null,null,""]
["","","",null,{"$f":"IF(D99=\"\",\"\",(VLOOKUP(D99,'Membership #'!$A$1:$C$1005,2,0)))","v":""},{"$f":"IF(D99=\"\",\"\",(VLOOKUP(D99,'Membership #'!$A$1:$C$1005,3,0)))","v":""},null,null,""]
["","","",null,{"$f":"IF(D100=\"\",\"\",(VLOOKUP(D100,'Membership #'!$A$1:$C$1005,2,0)))","v":""},{"$f":"IF(D100=\"\",\"\",(VLOOKUP(D100,'Membership #'!$A$1:$C$1005,3,0)))","v":""},null,null,""]
["","","",null,{"$f":"IF(D101=\"\",\"\",(VLOOKUP(D101,'Membership #'!$A$1:$C$1005,2,0)))","v":""},{"$f":"IF(D101=\"\",\"\",(VLOOKUP(D101,'Membership #'!$A$1:$C$1005,3,0)))","v":""},null,null,""]

{"sheet":"3D Barrels","index":16,"n_rows":105,"n_cols":22,"rows_kept":105,"cut":false,"hidden":false,"merged":[[5,12,5,15],[0,0,0,10],[1,0,1,10],[2,0,2,3],[2,6,2,10],[3,0,6,0],[3,1,6,1],[3,2,6,2],[3,3,6,3],[3,4,6,4],[3,9,6,9],[3,10,6,10],[3,5,6,5],[3,6,6,6],[3,7,6,7],[3,8,6,8]]}
["Tom Burt & Mark McGuire Memorial Jackpot Aug 21, 2021",null,null,null,null,null,null,null,null,null,null,null,"x=Scratch"]
["3D Barrels",null,null,null,null,null,null,null,null,null,null,null,"n=No Time"]
["# Enteries:",null,null,null,{"$f":"COUNTIF($D$8:$D$102,\">0\")","v":49},null,null,null,null,null,null,null,null,null,null,null,null,"1 -29 horses per class pay 3 placings"]
["Rand Draw","Seed","Running Order","RING #      ","NAME","HORSE NAME","TIME","PENALTY ","TOTAL","PLACINGS","POINTS",null,"3D Sponsored By ",null,null,null,null,"30 -39 horses per class pay 4 placings"]
[null,null,null,null,null,null,null,null,null,null,null,null,null,null,null,null,null,"40 and over horses per class pay 5 placings"]
[null,null,null,null,null,null,null,null,null,null,null,null,"3D Barrels"]
[null,null,null,null,null,null,null,null,null,null,null,null,null,null,null,null,null,null,"5 Entries","4 Entries","3 Entries","2 Entries"]
[{"$f":"IF(D8<>\"\",RAND(),\"\")","v":0.28010138863492184},{"$f":"IF(D8<>\"\",RANK(A8,A$8:A$105),\"\")","v":{"$error":"#REF!"}},1,700,{"$f":"IF(D8=\"\",\"\",(VLOOKUP(D8,'Membership #'!$A$1:$C$1005,2,0)))","v":"Lindsay Baker"},{"$f":"IF(D8=\"\",\"\",(VLOOKUP(D8,'Membership #'!$A$1:$C$1005,3,0)))","v":"Boons Laughing Boy"},14.928000000000001,null,{"$f":"IF(G8=\"n\",\"No Time\",IF(G8=\"x\",\"Scratch\",IF(G8<>\"\",SUM(G8+H8),\"\")))","v":14.928000000000001},1,null,null,"Added",null,null,null,null,"1st",0.35,0.4,0.5,0.6]
[0.12578296355910745,{"$error":"#REF!"},2,703,{"$f":"IF(D9=\"\",\"\",(VLOOKUP(D9,'Membership #'!$A$1:$C$1005,2,0)))","v":"Chris Baker"},{"$f":"IF(D9=\"\",\"\",(VLOOKUP(D9,'Membership #'!$A$1:$C$1005,3,0)))","v":"Jamer All Fired Up"},14.946,null,14.946,2,null,null,"Entries",47,null,15,"per head","2nd",0.25,0.3,0.3,0.4]
[0.98656376551961589,{"$error":"#REF!"},3,538,{"$f":"IF(D10=\"\",\"\",(VLOOKUP(D10,'Membership #'!$A$1:$C$1005,2,0)))","v":"Jean DuGas"},{"$f":"IF(D10=\"\",\"\",(VLOOKUP(D10,'Membership #'!$A$1:$C$1005,3,0)))","v":"Pal's Lilguy"},15.287000000000001,null,15.287000000000001,3,null,null,"Jackpot",{"$f":"P9*N9","v":705},null,0.85,"payback","3rd",0.2,0.2,0.2]
[0.49943878979317868,{"$error":"#REF!"},4,657,{"$f":"IF(D11=\"\",\"\",(VLOOKUP(D11,'Membership #'!$A$1:$C$1005,2,0)))","v":"Laura Morrison"},{"$f":"IF(D11=\"\",\"\",(VLOOKUP(D11,'Membership #'!$A$1:$C$1005,3,0)))","v":"Steal Ta Fame"},15.494999999999999,null,15.494999999999999,4,null,null,"Total Money",{"$f":"N8+(N10*P10)","v":599.25},null,{"$f":"N10*P10","v":599.25},"Jackpot","4th",0.15,0.1]
[0.91618925954497155,{"$error":"#REF!"},5,647,{"$f":"IF(D12=\"\",\"\",(VLOOKUP(D12,'Membership #'!$A$1:$C$1005,2,0)))","v":"Courtney Parker"},{"$f":"IF(D12=\"\",\"\",(VLOOKUP(D12,'Membership #'!$A$1:$C$1005,3,0)))","v":"BW Rare Kinda Love"},15.615,null,15.615,5,null,null,"1D","Percentage","Money","Ring #",null,"5th",0.05]
[0.65741918881244998,{"$error":"#REF!"},6,918,{"$f":"IF(D13=\"\",\"\",(VLOOKUP(D13,'Membership #'!$A$1:$C$1005,2,0)))","v":"Keira Rose"},{"$f":"IF(D13=\"\",\"\",(VLOOKUP(D13,'Membership #'!$A$1:$C$1005,3,0)))","v":"LL Its All About Red"},15.67,null,15.67,null,null,null,"1st",0.35,{"$f":"N$11/3*N13","v":69.912499999999994},null,{"$f":"IF(P13=\"\",\"\",(VLOOKUP(P13,'Membership #'!$A$1:$C$1005,2,0)))","v":""}]
[5.8666304790970014E-2,{"$error":"#REF!"},7,556,{"$f":"IF(D14=\"\",\"\",(VLOOKUP(D14,'Membership #'!$A$1:$C$1005,2,0)))","v":"Stephaine Clark"},{"$f":"IF(D14=\"\",\"\",(VLOOKUP(D14,'Membership #'!$A$1:$C$1005,3,0)))","v":"Perks A Flyin"},15.696999999999999,null,15.696999999999999,null,null,null,"2nd",0.25,{"$f":"N$11/3*N14","v":49.9375},null,{"$f":"IF(P14=\"\",0,(VLOOKUP(P14,'Membership #'!$A$1:$C$1005,2,0)))","v":0}]
[0.82386296706020212,{"$error":"#REF!"},8,750,{"$f":"IF(D15=\"\",\"\",(VLOOKUP(D15,'Membership #'!$A$1:$C$1005,2,0)))","v":"Tanya Kennedy"},{"$f":"IF(D15=\"\",\"\",(VLOOKUP(D15,'Membership #'!$A$1:$C$1005,3,0)))","v":"Old Stations Pride"},15.702999999999999,null,15.702999999999999,null,null,null,"3rd",0.2,{"$f":"N$11/3*N15","v":39.950000000000003},null,{"$f":"IF(P15=\"\",0,(VLOOKUP(P15,'Membership #'!$A$1:$C$1005,2,0)))","v":0}]
[0.87595004836254708,{"$error":"#REF!"},9,516,{"$f":"IF(D16=\"\",\"\",(VLOOKUP(D16,'Membership #'!$A$1:$C$1005,2,0)))","v":"Laurie Don Reginato"},{"$f":"IF(D16=\"\",\"\",(VLOOKUP(D16,'Membership #'!$A$1:$C$1005,3,0)))","v":"TCR Gold Runny"},15.734,null,15.734,null,null,null,"4th",0.15,{"$f":"N$11/3*N16","v":29.962499999999999},null,{"$f":"IF(P16=\"\",0,(VLOOKUP(P16,'Membership #'!$A$1:$C$1005,2,0)))","v":0}]
[0.38460910161032702,{"$error":"#REF!"},10,698,{"$f":"IF(D17=\"\",\"\",(VLOOKUP(D17,'Membership #'!$A$1:$C$1005,2,0)))","v":"Kaleigh Denton"},{"$f":"IF(D17=\"\",\"\",(VLOOKUP(D17,'Membership #'!$A$1:$C$1005,3,0)))","v":"Coleasaki"},15.747999999999999,null,15.747999999999999,null,null,null,"5th",0.05,{"$f":"N$11/3*N17","v":9.9875000000000007},null,{"$f":"IF(P17=\"\",\"\",(VLOOKUP(P17,'Membership #'!$A$1:$C$1005,2,0)))","v":""}]
[4.8586070575252993E-2,{"$error":"#REF!"},11,684,{"$f":"IF(D18=\"\",\"\",(VLOOKUP(D18,'Membership #'!$A$1:$C$1005,2,0)))","v":"Shann Cox"},{"$f":"IF(D18=\"\",\"\",(VLOOKUP(D18,'Membership #'!$A$1:$C$1005,3,0)))","v":"Jags Cash Flow"},15.855,null,15.855,null,null,null,"2D","Percentage","Money","Ring #"]
[0.59085304908675207,{"$error":"#REF!"},12,892,{"$f":"IF(D19=\"\",\"\",(VLOOKUP(D19,'Membership #'!$A$1:$C$1005,2,0)))","v":"Donnie MacNeil"},{"$f":"IF(D19=\"\",\"\",(VLOOKUP(D19,'Membership #'!$A$1:$C$1005,3,0)))","v":"Gifted Go Gold"},15.879,null,15.879,null,null,null,"1st",0.35,{"$f":"N$11/3*N19","v":69.912499999999994},null,{"$f":"IF(P19=\"\",\"\",(VLOOKUP(P19,'Membership #'!$A$1:$C$1005,2,0)))","v":""}]
[0.51018729637572335,{"$error":"#REF!"},13,815,{"$f":"IF(D20=\"\",\"\",(VLOOKUP(D20,'Membership #'!$A$1:$C$1005,2,0)))","v":"Brooke Kennedy"},{"$f":"IF(D20=\"\",\"\",(VLOOKUP(D20,'Membership #'!$A$1:$C$1005,3,0)))","v":"Tic Toc Teazer"},15.925000000000001,null,15.925000000000001,null,null,null,"2nd",0.25,{"$f":"N$11/3*N20","v":49.9375},null,{"$f":"IF(P20=\"\",\"\",(VLOOKUP(P20,'Membership #'!$A$1:$C$1005,2,0)))","v":""}]
[0.87684851442346523,{"$error":"#REF!"},14,655,{"$f":"IF(D21=\"\",\"\",(VLOOKUP(D21,'Membership #'!$A$1:$C$1005,2,0)))","v":"Julia Parker"},{"$f":"IF(D21=\"\",\"\",(VLOOKUP(D21,'Membership #'!$A$1:$C$1005,3,0)))","v":"Boons Feature Star"},16.023,null,16.023,1,null,null,"3rd",0.2,{"$f":"N$11/3*N21","v":39.950000000000003},null,{"$f":"IF(P21=\"\",\"\",(VLOOKUP(P21,'Membership #'!$A$1:$C$1005,2,0)))","v":""}]
[0.9813068176653077,{"$error":"#REF!"},15,914,{"$f":"IF(D22=\"\",\"\",(VLOOKUP(D22,'Membership #'!$A$1:$C$1005,2,0)))","v":"Shelby MacPherson"},{"$f":"IF(D22=\"\",\"\",(VLOOKUP(D22,'Membership #'!$A$1:$C$1005,3,0)))","v":"Shelbys Badger Bar"},16.253,null,16.253,2,null,null,"4th",0.15,{"$f":"N$11/3*N22","v":29.962499999999999},null,{"$f":"IF(P22=\"\",\"\",(VLOOKUP(P22,'Membership #'!$A$1:$C$1005,2,0)))","v":""}]
[0.32288231647166055,{"$error":"#REF!"},16,616,{"$f":"IF(D23=\"\",\"\",(VLOOKUP(D23,'Membership #'!$A$1:$C$1005,2,0)))","v":"Judy Bateman"},{"$f":"IF(D23=\"\",\"\",(VLOOKUP(D23,'Membership #'!$A$1:$C$1005,3,0)))","v":"HM HollywoodRockstar"},16.34,null,16.34,3,null,null,"5th",0.05,{"$f":"N$11/3*N23","v":9.9875000000000007},null,{"$f":"IF(P23=\"\",\"\",(VLOOKUP(P23,'Membership #'!$A$1:$C$1005,2,0)))","v":""}]
[null,null,17,904,{"$f":"IF(D24=\"\",\"\",(VLOOKUP(D24,'Membership #'!$A$1:$C$1005,2,0)))","v":"Ella Cowley"},{"$f":"IF(D24=\"\",\"\",(VLOOKUP(D24,'Membership #'!$A$1:$C$1005,3,0)))","v":"Blazin Boots"},16.411999999999999,null,16.411999999999999,4]
[{"$f":"IF(#REF!<>\"\",RAND(),\"\")","v":{"$error":"#REF!"}},{"$f":"IF(#REF!<>\"\",RANK(A25,A$8:A$105),\"\")","v":{"$error":"#REF!"}},18,518,{"$f":"IF(D25=\"\",\"\",(VLOOKUP(D25,'Membership #'!$A$1:$C$1005,2,0)))","v":"Sylvester Weatherbie"},{"$f":"IF(D25=\"\",\"\",(VLOOKUP(D25,'Membership #'!$A$1:$C$1005,3,0)))","v":"J.R."},16.806999999999999,null,16.806999999999999,5,null,null,"3D","Percentage","Money","Ring #"]
[{"$f":"IF(D25<>\"\",RAND(),\"\")","v":0.5663467480508998},{"$f":"IF(D25<>\"\",RANK(A26,A$8:A$105),\"\")","v":{"$error":"#REF!"}},19,563,{"$f":"IF(D26=\"\",\"\",(VLOOKUP(D26,'Membership #'!$A$1:$C$1005,2,0)))","v":"Kevin Bateman"},{"$f":"IF(D26=\"\",\"\",(VLOOKUP(D26,'Membership #'!$A$1:$C$1005,3,0)))","v":"Jess Chasin A Hobby"},17.041,null,17.041,1,null,null,"1st",0.35,{"$f":"N$11/3*N26","v":69.912499999999994},null,{"$f":"IF(P26=\"\",\"\",(VLOOKUP(P26,'Membership #'!$A$1:$C$1005,2,0)))","v":""}]
[0.91105244518869077,{"$error":"#REF!"},20,909,{"$f":"IF(D27=\"\",\"\",(VLOOKUP(D27,'Membership #'!$A$1:$C$1005,2,0)))","v":"Rebecca Gillis"},{"$f":"IF(D27=\"\",\"\",(VLOOKUP(D27,'Membership #'!$A$1:$C$1005,3,0)))","v":"Martha's Tivio Moon"},17.166,null,17.166,2,null,null,"2nd",0.25,{"$f":"N$11/3*N27","v":49.9375},null,{"$f":"IF(P27=\"\",\"\",(VLOOKUP(P27,'Membership #'!$A$1:$C$1005,2,0)))","v":""}]
[4.9998627080748981E-2,{"$error":"#REF!"},21,591,{"$f":"IF(D28=\"\",\"\",(VLOOKUP(D28,'Membership #'!$A$1:$C$1005,2,0)))","v":"Wendy MacLean"},{"$f":"IF(D28=\"\",\"\",(VLOOKUP(D28,'Membership #'!$A$1:$C$1005,3,0)))","v":"White Sox N Flyin"},17.47,null,17.47,3,null,null,"3rd",0.2,{"$f":"N$11/3*N28","v":39.950000000000003},null,{"$f":"IF(P28=\"\",\"\",(VLOOKUP(P28,'Membership #'!$A$1:$C$1005,2,0)))","v":""}]
[0.96420764669222936,{"$error":"#REF!"},22,666,{"$f":"IF(D29=\"\",\"\",(VLOOKUP(D29,'Membership #'!$A$1:$C$1005,2,0)))","v":"Summer Fraser"},{"$f":"IF(D29=\"\",\"\",(VLOOKUP(D29,'Membership #'!$A$1:$C$1005,3,0)))","v":"Sheza Smokin' Girl"},17.567,null,17.567,4,null,null,"4th",0.15,{"$f":"N$11/3*N29","v":29.962499999999999},null,{"$f":"IF(P29=\"\",\"\",(VLOOKUP(P29,'Membership #'!$A$1:$C$1005,2,0)))","v":""}]
[0.62154356049731585,{"$error":"#REF!"},23,600,{"$f":"IF(D30=\"\",\"\",(VLOOKUP(D30,'Membership #'!$A$1:$C$1005,2,0)))","v":"Stan Brown"},{"$f":"IF(D30=\"\",\"\",(VLOOKUP(D30,'Membership #'!$A$1:$C$1005,3,0)))","v":"A Perty Sure Thing"},17.849,null,{"$f":"IF(G30=\"n\",\"No Time\",IF(G30=\"x\",\"Scratch\",IF(G30<>\"\",SUM(G30+H30),\"\")))","v":17.849},5,null,null,"5th",0.05,{"$f":"N$11/3*N30","v":9.9875000000000007},null,{"$f":"IF(P30=\"\",\"\",(VLOOKUP(P30,'Membership #'!$A$1:$C$1005,2,0)))","v":""}]
[0.35010492253543191,{"$error":"#REF!"},24,867,{"$f":"IF(D31=\"\",\"\",(VLOOKUP(D31,'Membership #'!$A$1:$C$1005,2,0)))","v":"Layla MacEachem"},{"$f":"IF(D31=\"\",\"\",(VLOOKUP(D31,'Membership #'!$A$1:$C$1005,3,0)))","v":"Shes a gem"},17.908999999999999,null,17.908999999999999]
[0.23457132245292756,{"$error":"#REF!"},25,753,{"$f":"IF(D32=\"\",\"\",(VLOOKUP(D32,'Membership #'!$A$1:$C$1005,2,0)))","v":"Kayla Boudreau"},{"$f":"IF(D32=\"\",\"\",(VLOOKUP(D32,'Membership #'!$A$1:$C$1005,3,0)))","v":"Lady Jane"},18.024000000000001,null,18.024000000000001,null,null,null,null,null,{"$f":"SUM(O13:O17,O19:O23,O26:O30)","v":599.25}]
[0.10105622084817156,{"$error":"#REF!"},26,636,{"$f":"IF(D33=\"\",\"\",(VLOOKUP(D33,'Membership #'!$A$1:$C$1005,2,0)))","v":"Ceilidh Gosse"},{"$f":"IF(D33=\"\",\"\",(VLOOKUP(D33,'Membership #'!$A$1:$C$1005,3,0)))","v":"ELM Silver Crime"},18.033999999999999,null,18.033999999999999]
[0.65020236541806609,{"$error":"#REF!"},27,973,{"$f":"IF(D34=\"\",\"\",(VLOOKUP(D34,'Membership #'!$A$1:$C$1005,2,0)))","v":"Sara Ivey"},{"$f":"IF(D34=\"\",\"\",(VLOOKUP(D34,'Membership #'!$A$1:$C$1005,3,0)))","v":"Ms Heavenly Gator"},19.314,null,19.314]
[0.96635354532560758,{"$error":"#REF!"},28,922,{"$f":"IF(D35=\"\",\"\",(VLOOKUP(D35,'Membership #'!$A$1:$C$1005,2,0)))","v":"Stevi Jardine"},{"$f":"IF(D35=\"\",\"\",(VLOOKUP(D35,'Membership #'!$A$1:$C$1005,3,0)))","v":"Paytons Pretty Cool"},15.395,5,20.395]
[0.85488832342117171,{"$error":"#REF!"},29,638,{"$f":"IF(D36=\"\",\"\",(VLOOKUP(D36,'Membership #'!$A$1:$C$1005,2,0)))","v":"Bella Peters"},{"$f":"IF(D36=\"\",\"\",(VLOOKUP(D36,'Membership #'!$A$1:$C$1005,3,0)))","v":"Super Star"},15.458,5,20.457999999999998,null,null,null,"Rollover"]
[0.82258858988959915,{"$error":"#REF!"},30,967,{"$f":"IF(D37=\"\",\"\",(VLOOKUP(D37,'Membership #'!$A$1:$C$1005,2,0)))","v":"Marissa Hillier"},{"$f":"IF(D37=\"\",\"\",(VLOOKUP(D37,'Membership #'!$A$1:$C$1005,3,0)))","v":"Notice Betty Boop"},20.550999999999998,null,20.550999999999998,null,null,null,616,{"$f":"IF(M37=\"\",\"\",(VLOOKUP(M37,'Membership #'!$A$1:$C$1005,2,0)))","v":"Judy Bateman"},{"$f":"IF(M37=\"\",\"\",(VLOOKUP(M37,'Membership #'!$A$1:$C$1005,3,0)))","v":"HM HollywoodRockstar"}]
[0.82293983671554249,{"$error":"#REF!"},31,702,{"$f":"IF(D38=\"\",\"\",(VLOOKUP(D38,'Membership #'!$A$1:$C$1005,2,0)))","v":"Jenna Proctor"},{"$f":"IF(D38=\"\",\"\",(VLOOKUP(D38,'Membership #'!$A$1:$C$1005,3,0)))","v":"Painted to Perfection"},20.623000000000001,null,20.623000000000001,null,null,null,684,{"$f":"IF(M38=\"\",\"\",(VLOOKUP(M38,'Membership #'!$A$1:$C$1005,2,0)))","v":"Shann Cox"},{"$f":"IF(M38=\"\",\"\",(VLOOKUP(M38,'Membership #'!$A$1:$C$1005,3,0)))","v":"Jags Cash Flow"}]
[0.87640603014872642,{"$error":"#REF!"},32,688,{"$f":"IF(D39=\"\",\"\",(VLOOKUP(D39,'Membership #'!$A$1:$C$1005,2,0)))","v":"Lenee Sampson"},{"$f":"IF(D39=\"\",\"\",(VLOOKUP(D39,'Membership #'!$A$1:$C$1005,3,0)))","v":"Six Dash Run"},20.738,null,20.738,null,null,null,688,{"$f":"IF(M39=\"\",\"\",(VLOOKUP(M39,'Membership #'!$A$1:$C$1005,2,0)))","v":"Lenee Sampson"},{"$f":"IF(M39=\"\",\"\",(VLOOKUP(M39,'Membership #'!$A$1:$C$1005,3,0)))","v":"Six Dash Run"}]
[0.80387871805350186,{"$error":"#REF!"},33,777,{"$f":"IF(D40=\"\",\"\",(VLOOKUP(D40,'Membership #'!$A$1:$C$1005,2,0)))","v":"Julia Parker"},{"$f":"IF(D40=\"\",\"\",(VLOOKUP(D40,'Membership #'!$A$1:$C$1005,3,0)))","v":"Doc's Spirit Prairie"},21.128,null,21.128,null,null,null,777,{"$f":"IF(M40=\"\",\"\",(VLOOKUP(M40,'Membership #'!$A$1:$C$1005,2,0)))","v":"Julia Parker"},{"$f":"IF(M40=\"\",\"\",(VLOOKUP(M40,'Membership #'!$A$1:$C$1005,3,0)))","v":"Doc's Spirit Prairie"}]
[0.41731781915613719,{"$error":"#REF!"},34,699,{"$f":"IF(D41=\"\",\"\",(VLOOKUP(D41,'Membership #'!$A$1:$C$1005,2,0)))","v":"Laura Morrison"},{"$f":"IF(D41=\"\",\"\",(VLOOKUP(D41,'Membership #'!$A$1:$C$1005,3,0)))","v":"MDC Dark Revelation"},16.184000000000001,5,21.184000000000001,null,null,null,516,{"$f":"IF(M41=\"\",\"\",(VLOOKUP(M41,'Membership #'!$A$1:$C$1005,2,0)))","v":"Laurie Don Reginato"},{"$f":"IF(M41=\"\",\"\",(VLOOKUP(M41,'Membership #'!$A$1:$C$1005,3,0)))","v":"TCR Gold Runny"}]
[0.28484793515387463,{"$error":"#REF!"},35,966,{"$f":"IF(D42=\"\",\"\",(VLOOKUP(D42,'Membership #'!$A$1:$C$1005,2,0)))","v":"Ava Anderson"},{"$f":"IF(D42=\"\",\"\",(VLOOKUP(D42,'Membership #'!$A$1:$C$1005,3,0)))","v":"Black Sass"},16.315000000000001,5,21.315000000000001,null,null,null,914,{"$f":"IF(M42=\"\",\"\",(VLOOKUP(M42,'Membership #'!$A$1:$C$1005,2,0)))","v":"Shelby MacPherson"},{"$f":"IF(M42=\"\",\"\",(VLOOKUP(M42,'Membership #'!$A$1:$C$1005,3,0)))","v":"Shelbys Badger Bar"}]
[9.1550611127911297E-2,{"$error":"#REF!"},36,786,{"$f":"IF(D43=\"\",\"\",(VLOOKUP(D43,'Membership #'!$A$1:$C$1005,2,0)))","v":"Rileigh Conrod"},{"$f":"IF(D43=\"\",\"\",(VLOOKUP(D43,'Membership #'!$A$1:$C$1005,3,0)))","v":"Scotches Harley"},21.771000000000001,null,21.771000000000001,null,null,null,698,{"$f":"IF(M43=\"\",\"\",(VLOOKUP(M43,'Membership #'!$A$1:$C$1005,2,0)))","v":"Kaleigh Denton"},{"$f":"IF(M43=\"\",\"\",(VLOOKUP(M43,'Membership #'!$A$1:$C$1005,3,0)))","v":"Coleasaki"}]
[0.81092342556028429,{"$error":"#REF!"},37,855,{"$f":"IF(D44=\"\",\"\",(VLOOKUP(D44,'Membership #'!$A$1:$C$1005,2,0)))","v":"Jenelle Collier"},{"$f":"IF(D44=\"\",\"\",(VLOOKUP(D44,'Membership #'!$A$1:$C$1005,3,0)))","v":"Peppy Sans Surprise"},16.899000000000001,5,21.899000000000001,null,null,null,716,{"$f":"IF(M44=\"\",\"\",(VLOOKUP(M44,'Membership #'!$A$1:$C$1005,2,0)))","v":"Kayla Martin"},{"$f":"IF(M44=\"\",\"\",(VLOOKUP(M44,'Membership #'!$A$1:$C$1005,3,0)))","v":"Dash Ta Home"}]
[0.67856273437062931,{"$error":"#REF!"},38,954,{"$f":"IF(D45=\"\",\"\",(VLOOKUP(D45,'Membership #'!$A$1:$C$1005,2,0)))","v":"Scotia MacEachern"},{"$f":"IF(D45=\"\",\"\",(VLOOKUP(D45,'Membership #'!$A$1:$C$1005,3,0)))","v":"Hick-a-Licious"},17.356000000000002,5,22.356000000000002,null,null,null,768,"Tracy Higgins","Iza Wicked Wind"]
[0.54945023972216267,{"$error":"#REF!"},39,514,{"$f":"IF(D46=\"\",\"\",(VLOOKUP(D46,'Membership #'!$A$1:$C$1005,2,0)))","v":"Heather Morrison"},{"$f":"IF(D46=\"\",\"\",(VLOOKUP(D46,'Membership #'!$A$1:$C$1005,3,0)))","v":"Black Fire Dash"},15.97,10,25.97,null,null,null,538,"Jean Dugas","Pal lil guy"]
[0.31553153796368483,{"$error":"#REF!"},40,768,"Tracey Higgins","Iza Wicked Wind",26.469000000000001,null,26.469000000000001]
[3.0134046093882261E-2,{"$error":"#REF!"},41,534,{"$f":"IF(D48=\"\",\"\",(VLOOKUP(D48,'Membership #'!$A$1:$C$1005,2,0)))","v":"Mary Lou Rankin Dentin"},{"$f":"IF(D48=\"\",\"\",(VLOOKUP(D48,'Membership #'!$A$1:$C$1005,3,0)))","v":"Brandy's Chocolena"},"n",null,{"$f":"IF(G48=\"n\",\"No Time\",IF(G48=\"x\",\"Scratch\",IF(G48<>\"\",SUM(G48+H48),\"\")))","v":"No Time"}]
[0.1289228245334374,{"$error":"#REF!"},42,716,{"$f":"IF(D49=\"\",\"\",(VLOOKUP(D49,'Membership #'!$A$1:$C$1005,2,0)))","v":"Kayla Martin"},{"$f":"IF(D49=\"\",\"\",(VLOOKUP(D49,'Membership #'!$A$1:$C$1005,3,0)))","v":"Dash Ta Home"},"n",null,"No Time"]
[0.42021758944156917,{"$error":"#REF!"},43,695,{"$f":"IF(D50=\"\",\"\",(VLOOKUP(D50,'Membership #'!$A$1:$C$1005,2,0)))","v":"Tessa Dicks"},{"$f":"IF(D50=\"\",\"\",(VLOOKUP(D50,'Membership #'!$A$1:$C$1005,3,0)))","v":"Charge's Dusty Luck"},"x",null,"Scratch"]
[0.76507347158794448,{"$error":"#REF!"},45,889,{"$f":"IF(D51=\"\",\"\",(VLOOKUP(D51,'Membership #'!$A$1:$C$1005,2,0)))","v":"Adelaine Cowley"},{"$f":"IF(D51=\"\",\"\",(VLOOKUP(D51,'Membership #'!$A$1:$C$1005,3,0)))","v":"Frenchman's Promise"},"x",null,"Scratch"]
[0.44258202212873088,{"$error":"#REF!"},46,971,{"$f":"IF(D52=\"\",\"\",(VLOOKUP(D52,'Membership #'!$A$1:$C$1005,2,0)))","v":"Arielle Burke"},{"$f":"IF(D52=\"\",\"\",(VLOOKUP(D52,'Membership #'!$A$1:$C$1005,3,0)))","v":"Elm Sally"},"x",null,"Scratch"]
[0.562939785661001,{"$error":"#REF!"},47,968,{"$f":"IF(D53=\"\",\"\",(VLOOKUP(D53,'Membership #'!$A$1:$C$1005,2,0)))","v":"Madison Pelly"},{"$f":"IF(D53=\"\",\"\",(VLOOKUP(D53,'Membership #'!$A$1:$C$1005,3,0)))","v":"Westin"},"x",null,"Scratch"]
[0.18270736240337648,{"$error":"#REF!"},48,530,{"$f":"IF(D54=\"\",\"\",(VLOOKUP(D54,'Membership #'!$A$1:$C$1005,2,0)))","v":"Joan Grant"},{"$f":"IF(D54=\"\",\"\",(VLOOKUP(D54,'Membership #'!$A$1:$C$1005,3,0)))","v":"SLS Dash to Holland"},"x",null,"Scratch"]
[{"$f":"IF(#REF!<>\"\",RAND(),\"\")","v":{"$error":"#REF!"}},{"$f":"IF(#REF!<>\"\",RANK(A55,A$8:A$105),\"\")","v":{"$error":"#REF!"}},49,732,{"$f":"IF(D55=\"\",\"\",(VLOOKUP(D55,'Membership #'!$A$1:$C$1005,2,0)))","v":"Brenna Carrigan"},{"$f":"IF(D55=\"\",\"\",(VLOOKUP(D55,'Membership #'!$A$1:$C$1005,3,0)))","v":"Carlos"},"x",null,"Scratch"]
[{"$f":"IF(D54<>\"\",RAND(),\"\")","v":0.16139171457628776},{"$f":"IF(D54<>\"\",RANK(A56,A$8:A$105),\"\")","v":{"$error":"#REF!"}},48,928,{"$f":"IF(D56=\"\",\"\",(VLOOKUP(D56,'Membership #'!$A$1:$C$1005,2,0)))","v":"Tessa Dicks"},{"$f":"IF(D56=\"\",\"\",(VLOOKUP(D56,'Membership #'!$A$1:$C$1005,3,0)))","v":"ELM Dash of Crime"},"x",null,"Scratch"]
[0.21005912379502212,{"$error":"#REF!"},49,null,{"$f":"IF(D57=\"\",\"\",(VLOOKUP(D57,'Membership #'!$A$1:$C$1005,2,0)))","v":""},{"$f":"IF(D57=\"\",\"\",(VLOOKUP(D57,'Membership #'!$A$1:$C$1005,3,0)))","v":""},null,null,{"$f":"IF(G57=\"n\",\"No Time\",IF(G57=\"x\",\"Scratch\",IF(G57<>\"\",SUM(G57+H57),\"\")))","v":""}]
[0.48476367260369424,{"$error":"#REF!"},50,null,{"$f":"IF(D58=\"\",\"\",(VLOOKUP(D58,'Membership #'!$A$1:$C$1005,2,0)))","v":""},{"$f":"IF(D58=\"\",\"\",(VLOOKUP(D58,'Membership #'!$A$1:$C$1005,3,0)))","v":""},null,null,""]
["","","",null,{"$f":"IF(D59=\"\",\"\",(VLOOKUP(D59,'Membership #'!$A$1:$C$1005,2,0)))","v":""},{"$f":"IF(D59=\"\",\"\",(VLOOKUP(D59,'Membership #'!$A$1:$C$1005,3,0)))","v":""},null,null,""]
["","","",null,{"$f":"IF(D60=\"\",\"\",(VLOOKUP(D60,'Membership #'!$A$1:$C$1005,2,0)))","v":""},{"$f":"IF(D60=\"\",\"\",(VLOOKUP(D60,'Membership #'!$A$1:$C$1005,3,0)))","v":""},null,null,""]
["","","",null,{"$f":"IF(D61=\"\",\"\",(VLOOKUP(D61,'Membership #'!$A$1:$C$1005,2,0)))","v":""},{"$f":"IF(D61=\"\",\"\",(VLOOKUP(D61,'Membership #'!$A$1:$C$1005,3,0)))","v":""},null,null,{"$f":"IF(G61=\"n\",\"No Time\",IF(G61=\"x\",\"Scratch\",IF(G61<>\"\",SUM(G61+H61),\"\")))","v":""}]
["","","",null,{"$f":"IF(D62=\"\",\"\",(VLOOKUP(D62,'Membership #'!$A$1:$C$1005,2,0)))","v":""},{"$f":"IF(D62=\"\",\"\",(VLOOKUP(D62,'Membership #'!$A$1:$C$1005,3,0)))","v":""},null,null,{"$f":"IF(G62=\"n\",\"No Time\",IF(G62=\"x\",\"Scratch\",IF(G62<>\"\",SUM(G62+H62),\"\")))","v":""}]
["","","",null,{"$f":"IF(D63=\"\",\"\",(VLOOKUP(D63,'Membership #'!$A$1:$C$1005,2,0)))","v":""},{"$f":"IF(D63=\"\",\"\",(VLOOKUP(D63,'Membership #'!$A$1:$C$1005,3,0)))","v":""},null,null,""]
["","","",null,{"$f":"IF(D64=\"\",\"\",(VLOOKUP(D64,'Membership #'!$A$1:$C$1005,2,0)))","v":""},{"$f":"IF(D64=\"\",\"\",(VLOOKUP(D64,'Membership #'!$A$1:$C$1005,3,0)))","v":""},null,null,""]
["","","",null,{"$f":"IF(D65=\"\",\"\",(VLOOKUP(D65,'Membership #'!$A$1:$C$1005,2,0)))","v":""},{"$f":"IF(D65=\"\",\"\",(VLOOKUP(D65,'Membership #'!$A$1:$C$1005,3,0)))","v":""},null,null,""]
["","","",null,{"$f":"IF(D66=\"\",\"\",(VLOOKUP(D66,'Membership #'!$A$1:$C$1005,2,0)))","v":""},{"$f":"IF(D66=\"\",\"\",(VLOOKUP(D66,'Membership #'!$A$1:$C$1005,3,0)))","v":""},null,null,""]
["","","",null,{"$f":"IF(D67=\"\",\"\",(VLOOKUP(D67,'Membership #'!$A$1:$C$1005,2,0)))","v":""},{"$f":"IF(D67=\"\",\"\",(VLOOKUP(D67,'Membership #'!$A$1:$C$1005,3,0)))","v":""},null,null,""]
["","","",null,{"$f":"IF(D68=\"\",\"\",(VLOOKUP(D68,'Membership #'!$A$1:$C$1005,2,0)))","v":""},{"$f":"IF(D68=\"\",\"\",(VLOOKUP(D68,'Membership #'!$A$1:$C$1005,3,0)))","v":""},null,null,""]
["","","",null,{"$f":"IF(D69=\"\",\"\",(VLOOKUP(D69,'Membership #'!$A$1:$C$1005,2,0)))","v":""},{"$f":"IF(D69=\"\",\"\",(VLOOKUP(D69,'Membership #'!$A$1:$C$1005,3,0)))","v":""},null,null,""]
["","","",null,{"$f":"IF(D70=\"\",\"\",(VLOOKUP(D70,'Membership #'!$A$1:$C$1005,2,0)))","v":""},{"$f":"IF(D70=\"\",\"\",(VLOOKUP(D70,'Membership #'!$A$1:$C$1005,3,0)))","v":""},null,null,{"$f":"IF(G70=\"n\",\"No Time\",IF(G70=\"x\",\"Scratch\",IF(G70<>\"\",SUM(G70+H70),\"\")))","v":""}]
["","","",null,{"$f":"IF(D71=\"\",\"\",(VLOOKUP(D71,'Membership #'!$A$1:$C$1005,2,0)))","v":""},{"$f":"IF(D71=\"\",\"\",(VLOOKUP(D71,'Membership #'!$A$1:$C$1005,3,0)))","v":""},null,null,""]
["","","",null,{"$f":"IF(D72=\"\",\"\",(VLOOKUP(D72,'Membership #'!$A$1:$C$1005,2,0)))","v":""},{"$f":"IF(D72=\"\",\"\",(VLOOKUP(D72,'Membership #'!$A$1:$C$1005,3,0)))","v":""},null,null,""]
["","","",null,{"$f":"IF(D73=\"\",\"\",(VLOOKUP(D73,'Membership #'!$A$1:$C$1005,2,0)))","v":""},{"$f":"IF(D73=\"\",\"\",(VLOOKUP(D73,'Membership #'!$A$1:$C$1005,3,0)))","v":""},null,null,""]
["","","",null,{"$f":"IF(D74=\"\",\"\",(VLOOKUP(D74,'Membership #'!$A$1:$C$1005,2,0)))","v":""},{"$f":"IF(D74=\"\",\"\",(VLOOKUP(D74,'Membership #'!$A$1:$C$1005,3,0)))","v":""},null,null,{"$f":"IF(G74=\"n\",\"No Time\",IF(G74=\"x\",\"Scratch\",IF(G74<>\"\",SUM(G74+H74),\"\")))","v":""}]
["","","",null,{"$f":"IF(D75=\"\",\"\",(VLOOKUP(D75,'Membership #'!$A$1:$C$1005,2,0)))","v":""},{"$f":"IF(D75=\"\",\"\",(VLOOKUP(D75,'Membership #'!$A$1:$C$1005,3,0)))","v":""},null,null,""]
["","","",null,{"$f":"IF(D76=\"\",\"\",(VLOOKUP(D76,'Membership #'!$A$1:$C$1005,2,0)))","v":""},{"$f":"IF(D76=\"\",\"\",(VLOOKUP(D76,'Membership #'!$A$1:$C$1005,3,0)))","v":""},null,null,""]
["","","",null,{"$f":"IF(D77=\"\",\"\",(VLOOKUP(D77,'Membership #'!$A$1:$C$1005,2,0)))","v":""},{"$f":"IF(D77=\"\",\"\",(VLOOKUP(D77,'Membership #'!$A$1:$C$1005,3,0)))","v":""},null,null,""]
["","","",null,{"$f":"IF(D78=\"\",\"\",(VLOOKUP(D78,'Membership #'!$A$1:$C$1005,2,0)))","v":""},{"$f":"IF(D78=\"\",\"\",(VLOOKUP(D78,'Membership #'!$A$1:$C$1005,3,0)))","v":""},null,null,""]
["","","",null,{"$f":"IF(D79=\"\",\"\",(VLOOKUP(D79,'Membership #'!$A$1:$C$1005,2,0)))","v":""},{"$f":"IF(D79=\"\",\"\",(VLOOKUP(D79,'Membership #'!$A$1:$C$1005,3,0)))","v":""},null,null,""]
["","","",null,{"$f":"IF(D80=\"\",\"\",(VLOOKUP(D80,'Membership #'!$A$1:$C$1005,2,0)))","v":""},{"$f":"IF(D80=\"\",\"\",(VLOOKUP(D80,'Membership #'!$A$1:$C$1005,3,0)))","v":""},null,null,""]
["","","",null,{"$f":"IF(D81=\"\",\"\",(VLOOKUP(D81,'Membership #'!$A$1:$C$1005,2,0)))","v":""},{"$f":"IF(D81=\"\",\"\",(VLOOKUP(D81,'Membership #'!$A$1:$C$1005,3,0)))","v":""},null,null,""]
["","","",null,{"$f":"IF(D82=\"\",\"\",(VLOOKUP(D82,'Membership #'!$A$1:$C$1005,2,0)))","v":""},{"$f":"IF(D82=\"\",\"\",(VLOOKUP(D82,'Membership #'!$A$1:$C$1005,3,0)))","v":""},null,null,""]
["","","",null,{"$f":"IF(D83=\"\",\"\",(VLOOKUP(D83,'Membership #'!$A$1:$C$1005,2,0)))","v":""},{"$f":"IF(D83=\"\",\"\",(VLOOKUP(D83,'Membership #'!$A$1:$C$1005,3,0)))","v":""},null,null,""]
["","","",null,{"$f":"IF(D84=\"\",\"\",(VLOOKUP(D84,'Membership #'!$A$1:$C$1005,2,0)))","v":""},{"$f":"IF(D84=\"\",\"\",(VLOOKUP(D84,'Membership #'!$A$1:$C$1005,3,0)))","v":""},null,null,""]
["","","",null,{"$f":"IF(D85=\"\",\"\",(VLOOKUP(D85,'Membership #'!$A$1:$C$1005,2,0)))","v":""},{"$f":"IF(D85=\"\",\"\",(VLOOKUP(D85,'Membership #'!$A$1:$C$1005,3,0)))","v":""},null,null,{"$f":"IF(G85=\"n\",\"No Time\",IF(G85=\"x\",\"Scratch\",IF(G85<>\"\",SUM(G85+H85),\"\")))","v":""}]
["","","",null,{"$f":"IF(D86=\"\",\"\",(VLOOKUP(D86,'Membership #'!$A$1:$C$1005,2,0)))","v":""},{"$f":"IF(D86=\"\",\"\",(VLOOKUP(D86,'Membership #'!$A$1:$C$1005,3,0)))","v":""},null,null,""]
["","","",null,{"$f":"IF(D87=\"\",\"\",(VLOOKUP(D87,'Membership #'!$A$1:$C$1005,2,0)))","v":""},{"$f":"IF(D87=\"\",\"\",(VLOOKUP(D87,'Membership #'!$A$1:$C$1005,3,0)))","v":""},null,null,{"$f":"IF(G87=\"n\",\"No Time\",IF(G87=\"x\",\"Scratch\",IF(G87<>\"\",SUM(G87+H87),\"\")))","v":""}]
[{"$f":"IF(D86<>\"\",RAND(),\"\")","v":""},{"$f":"IF(D86<>\"\",RANK(A88,A$8:A$105),\"\")","v":""},"",null,{"$f":"IF(D88=\"\",\"\",(VLOOKUP(D88,'Membership #'!$A$1:$C$1005,2,0)))","v":""},{"$f":"IF(D88=\"\",\"\",(VLOOKUP(D88,'Membership #'!$A$1:$C$1005,3,0)))","v":""},null,null,""]
["","","",null,{"$f":"IF(D89=\"\",\"\",(VLOOKUP(D89,'Membership #'!$A$1:$C$1005,2,0)))","v":""},{"$f":"IF(D89=\"\",\"\",(VLOOKUP(D89,'Membership #'!$A$1:$C$1005,3,0)))","v":""},null,null,{"$f":"IF(G89=\"n\",\"No Time\",IF(G89=\"x\",\"Scratch\",IF(G89<>\"\",SUM(G89+H89),\"\")))","v":""}]
["","","",null,{"$f":"IF(D90=\"\",\"\",(VLOOKUP(D90,'Membership #'!$A$1:$C$1005,2,0)))","v":""},{"$f":"IF(D90=\"\",\"\",(VLOOKUP(D90,'Membership #'!$A$1:$C$1005,3,0)))","v":""},null,null,""]
["","","",null,{"$f":"IF(D91=\"\",\"\",(VLOOKUP(D91,'Membership #'!$A$1:$C$1005,2,0)))","v":""},{"$f":"IF(D91=\"\",\"\",(VLOOKUP(D91,'Membership #'!$A$1:$C$1005,3,0)))","v":""},null,null,""]
["","","",null,{"$f":"IF(D92=\"\",\"\",(VLOOKUP(D92,'Membership #'!$A$1:$C$1005,2,0)))","v":""},{"$f":"IF(D92=\"\",\"\",(VLOOKUP(D92,'Membership #'!$A$1:$C$1005,3,0)))","v":""},null,null,{"$f":"IF(G92=\"n\",\"No Time\",IF(G92=\"x\",\"Scratch\",IF(G92<>\"\",SUM(G92+H92),\"\")))","v":""}]
["","","",null,{"$f":"IF(D93=\"\",\"\",(VLOOKUP(D93,'Membership #'!$A$1:$C$1005,2,0)))","v":""},{"$f":"IF(D93=\"\",\"\",(VLOOKUP(D93,'Membership #'!$A$1:$C$1005,3,0)))","v":""},null,null,""]
["","","",null,{"$f":"IF(D94=\"\",\"\",(VLOOKUP(D94,'Membership #'!$A$1:$C$1005,2,0)))","v":""},{"$f":"IF(D94=\"\",\"\",(VLOOKUP(D94,'Membership #'!$A$1:$C$1005,3,0)))","v":""},null,null,""]
["","","",null,{"$f":"IF(D95=\"\",\"\",(VLOOKUP(D95,'Membership #'!$A$1:$C$1005,2,0)))","v":""},{"$f":"IF(D95=\"\",\"\",(VLOOKUP(D95,'Membership #'!$A$1:$C$1005,3,0)))","v":""},null,null,""]
["","","",null,{"$f":"IF(D96=\"\",\"\",(VLOOKUP(D96,'Membership #'!$A$1:$C$1005,2,0)))","v":""},{"$f":"IF(D96=\"\",\"\",(VLOOKUP(D96,'Membership #'!$A$1:$C$1005,3,0)))","v":""},null,null,""]
["","","",null,{"$f":"IF(D97=\"\",\"\",(VLOOKUP(D97,'Membership #'!$A$1:$C$1005,2,0)))","v":""},{"$f":"IF(D97=\"\",\"\",(VLOOKUP(D97,'Membership #'!$A$1:$C$1005,3,0)))","v":""},null,null,""]
["","","",null,{"$f":"IF(D98=\"\",\"\",(VLOOKUP(D98,'Membership #'!$A$1:$C$1005,2,0)))","v":""},{"$f":"IF(D98=\"\",\"\",(VLOOKUP(D98,'Membership #'!$A$1:$C$1005,3,0)))","v":""},null,null,""]
["","","",null,{"$f":"IF(D99=\"\",\"\",(VLOOKUP(D99,'Membership #'!$A$1:$C$1005,2,0)))","v":""},{"$f":"IF(D99=\"\",\"\",(VLOOKUP(D99,'Membership #'!$A$1:$C$1005,3,0)))","v":""},null,null,""]
["","","",null,{"$f":"IF(D100=\"\",\"\",(VLOOKUP(D100,'Membership #'!$A$1:$C$1005,2,0)))","v":""},{"$f":"IF(D100=\"\",\"\",(VLOOKUP(D100,'Membership #'!$A$1:$C$1005,3,0)))","v":""},null,null,""]
["","","",null,{"$f":"IF(D101=\"\",\"\",(VLOOKUP(D101,'Membership #'!$A$1:$C$1005,2,0)))","v":""},{"$f":"IF(D101=\"\",\"\",(VLOOKUP(D101,'Membership #'!$A$1:$C$1005,3,0)))","v":""},null,null,""]
["","","",null,{"$f":"IF(D102=\"\",\"\",(VLOOKUP(D102,'Membership #'!$A$1:$C$1005,2,0)))","v":""},{"$f":"IF(D102=\"\",\"\",(VLOOKUP(D102,'Membership #'!$A$1:$C$1005,3,0)))","v":""},null,null,""]
["","","",null,{"$f":"IF(D103=\"\",\"\",(VLOOKUP(D103,'Membership #'!$A$1:$C$1005,2,0)))","v":""},{"$f":"IF(D103=\"\",\"\",(VLOOKUP(D103,'Membership #'!$A$1:$C$1005,3,0)))","v":""},null,null,""]
["","","",null,null,null,null,null,""]
["","",null,null,null,null,null,null,""]

{"sheet":"GT_Custom","index":17,"n_rows":8,"n_cols":2,"rows_kept":8,"cut":false,"hidden":true,"merged":[]}
["C1","Custom 1"]
["C2","Custom 2"]
["C3","Custom 3"]
["C4","Custom 4"]
["C5","Custom 5"]
["C6","Custom 6"]
["C7","Custom 7"]
["C8","Custom 8"]

{"sheet":"Payouts","index":18,"n_rows":102,"n_cols":8,"rows_kept":102,"cut":false,"hidden":false,"merged":[]}
["Money","Ring #","Class"]
[{"$f":"'JUNIOR HORSE BARRELS'!O$13","v":34.730000000000004},{"$f":"'JUNIOR HORSE BARRELS'!P$13","v":0},"Jr Horse",null,null,"Sum of Money"]
[{"$f":"'JUNIOR HORSE BARRELS'!O$14","v":25.67},{"$f":"'JUNIOR HORSE BARRELS'!P$14","v":0},"Jr Horse",null,null,"Ring #","Class","Total"]
[{"$f":"'JUNIOR HORSE BARRELS'!O$15","v":15.100000000000001},{"$f":"'JUNIOR HORSE BARRELS'!P$15","v":0},"Jr Horse",null,null,0,"3D Barrels",200.00000000000003]
[{"$f":"'JUNIOR HORSE BARRELS'!O$16","v":""},{"$f":"'JUNIOR HORSE BARRELS'!P$16","v":0},"Jr Horse",null,null,null,"Adult Barrels",25]
[{"$f":"'JUNIOR HORSE BARRELS'!O$17","v":""},{"$f":"'JUNIOR HORSE BARRELS'!P$17","v":0},"Jr Horse",null,null,null,"Adult Poles",25]
[{"$f":"'JUNIOR HORSE BARRELS'!O$18","v":""},{"$f":"'JUNIOR HORSE BARRELS'!P$18","v":0},"Jr Horse",null,null,null,"Jr Horse",50]
[{"$f":"'JUNIOR HORSE BARRELS'!O$19","v":""},{"$f":"'JUNIOR HORSE BARRELS'!P$19","v":0},"Jr Horse",null,null,null,"Novice Barrels",0]
[{"$f":"'JUNIOR HORSE BARRELS'!O$20","v":""},{"$f":"'JUNIOR HORSE BARRELS'!P$20","v":0},"Jr Horse",null,null,null,"Novice Poles",0]
[{"$f":"'JUNIOR HORSE BARRELS'!O$21","v":""},{"$f":"'JUNIOR HORSE BARRELS'!P$21","v":0},"Jr Horse",null,null,null,"Open Barrels",150]
[{"$f":"'JUNIOR HORSE BARRELS'!O$22","v":""},{"$f":"'JUNIOR HORSE BARRELS'!P$22","v":0},"Jr Horse",null,null,null,"Open Poles",0]
[{"$f":"'YOUTH BARRELS'!O$13","v":28.400000000000002},{"$f":"'YOUTH BARRELS'!P$13","v":0},"Youth Barrels",null,null,null,"Youth Barrels",25]
[{"$f":"'YOUTH BARRELS'!O$14","v":20.412500000000001},{"$f":"'YOUTH BARRELS'!P$14","v":0},"Youth Barrels",null,null,null,"Youth Poles",25]
[{"$f":"'YOUTH BARRELS'!O$15","v":13.3125},{"$f":"'YOUTH BARRELS'!P$15","v":0},"Youth Barrels",null,null,"0 Total",null,500]
[{"$f":"'YOUTH BARRELS'!O$16","v":10.65},{"$f":"'YOUTH BARRELS'!P$16","v":0},"Youth Barrels",null,null,"Grand Total",null,500]
[{"$f":"'YOUTH BARRELS'!O$17","v":8.875},{"$f":"'YOUTH BARRELS'!P$17","v":0},"Youth Barrels"]
[{"$f":"'YOUTH BARRELS'!O$18","v":7.1000000000000005},{"$f":"'YOUTH BARRELS'!P$18","v":0},"Youth Barrels"]
[{"$f":"'YOUTH BARRELS'!O$19","v":""},{"$f":"'YOUTH BARRELS'!P$19","v":0},"Youth Barrels"]
[{"$f":"'YOUTH BARRELS'!O$20","v":""},{"$f":"'YOUTH BARRELS'!P$20","v":0},"Youth Barrels"]
[{"$f":"'YOUTH BARRELS'!O$21","v":""},{"$f":"'YOUTH BARRELS'!P$21","v":0},"Youth Barrels"]
[{"$f":"'YOUTH BARRELS'!O$22","v":""},{"$f":"'YOUTH BARRELS'!P$22","v":0},"Youth Barrels"]
[{"$f":"'NOVICE BARRELS'!O$13","v":92},{"$f":"'NOVICE BARRELS'!P$13","v":0},"Novice Barrels"]
[{"$f":"'NOVICE BARRELS'!O$14","v":66.125},{"$f":"'NOVICE BARRELS'!P$14","v":0},"Novice Barrels"]
[{"$f":"'NOVICE BARRELS'!O$15","v":43.125},{"$f":"'NOVICE BARRELS'!P$15","v":0},"Novice Barrels"]
[{"$f":"'NOVICE BARRELS'!O$16","v":34.5},{"$f":"'NOVICE BARRELS'!P$16","v":0},"Novice Barrels"]
[{"$f":"'NOVICE BARRELS'!O$17","v":28.75},{"$f":"'NOVICE BARRELS'!P$17","v":0},"Novice Barrels"]
[{"$f":"'NOVICE BARRELS'!O$18","v":23},{"$f":"'NOVICE BARRELS'!P$18","v":0},"Novice Barrels"]
[{"$f":"'NOVICE BARRELS'!O$19","v":""},{"$f":"'NOVICE BARRELS'!P$19","v":0},"Novice Barrels"]
[{"$f":"'NOVICE BARRELS'!O$20","v":""},{"$f":"'NOVICE BARRELS'!P$20","v":0},"Novice Barrels"]
[{"$f":"'NOVICE BARRELS'!O$21","v":""},{"$f":"'NOVICE BARRELS'!P$21","v":0},"Novice Barrels"]
[{"$f":"'NOVICE BARRELS'!O$22","v":""},{"$f":"'NOVICE BARRELS'!P$22","v":0},"Novice Barrels"]
[{"$f":"'OPEN BARRELS'!O$13","v":142.07999999999998},{"$f":"'OPEN BARRELS'!P$13","v":0},"Open Barrels"]
[{"$f":"'OPEN BARRELS'!O$14","v":112.48},{"$f":"'OPEN BARRELS'!P$14","v":0},"Open Barrels"]
[{"$f":"'OPEN BARRELS'!O$15","v":94.72},{"$f":"'OPEN BARRELS'!P$15","v":0},"Open Barrels"]
[{"$f":"'OPEN BARRELS'!O$16","v":76.960000000000008},{"$f":"'OPEN BARRELS'!P$16","v":0},"Open Barrels"]
[{"$f":"'OPEN BARRELS'!O$17","v":47.36},{"$f":"'OPEN BARRELS'!P$17","v":0},"Open Barrels"]
[{"$f":"'OPEN BARRELS'!O$18","v":35.519999999999996},{"$f":"'OPEN BARRELS'!P$18","v":0},"Open Barrels"]
[{"$f":"'OPEN BARRELS'!O$19","v":29.6},{"$f":"'OPEN BARRELS'!P$19","v":0},"Open Barrels"]
[{"$f":"'OPEN BARRELS'!O$20","v":23.68},{"$f":"'OPEN BARRELS'!P$20","v":0},"Open Barrels"]
[{"$f":"'OPEN BARRELS'!O$21","v":17.759999999999998},{"$f":"'OPEN BARRELS'!P$21","v":0},"Open Barrels"]
[{"$f":"'OPEN BARRELS'!O$22","v":11.84},{"$f":"'OPEN BARRELS'!P$22","v":0},"Open Barrels"]
[{"$f":"'YOUTH POLES'!O$13","v":29.76},{"$f":"'YOUTH POLES'!P$13","v":0},"Youth Poles"]
[{"$f":"'YOUTH POLES'!O$14","v":21.39},{"$f":"'YOUTH POLES'!P$14","v":0},"Youth Poles"]
[{"$f":"'YOUTH POLES'!O$15","v":13.95},{"$f":"'YOUTH POLES'!P$15","v":0},"Youth Poles"]
[{"$f":"'YOUTH POLES'!O$16","v":11.16},{"$f":"'YOUTH POLES'!P$16","v":0},"Youth Poles"]
[{"$f":"'YOUTH POLES'!O$17","v":9.3000000000000007},{"$f":"'YOUTH POLES'!P$17","v":0},"Youth Poles"]
[{"$f":"'YOUTH POLES'!O$18","v":7.44},{"$f":"'YOUTH POLES'!P$18","v":0},"Youth Poles"]
[{"$f":"'YOUTH POLES'!O$19","v":""},{"$f":"'YOUTH POLES'!P$19","v":0},"Youth Poles"]
[{"$f":"'YOUTH POLES'!O$20","v":""},{"$f":"'YOUTH POLES'!P$20","v":0},"Youth Poles"]
[{"$f":"'YOUTH POLES'!O$21","v":""},{"$f":"'YOUTH POLES'!P$21","v":0},"Youth Poles"]
[{"$f":"'YOUTH POLES'!O$22","v":""},{"$f":"'YOUTH POLES'!P$22","v":0},"Youth Poles"]
[{"$f":"'NOVICE POLES'!O$13","v":75.680000000000007},{"$f":"'NOVICE POLES'!P$13","v":0},"Novice Poles"]
[{"$f":"'NOVICE POLES'!O$14","v":54.395000000000003},{"$f":"'NOVICE POLES'!P$14","v":0},"Novice Poles"]
[{"$f":"'NOVICE POLES'!O$15","v":35.475000000000001},{"$f":"'NOVICE POLES'!P$15","v":0},"Novice Poles"]
[{"$f":"'NOVICE POLES'!O$16","v":28.38},{"$f":"'NOVICE POLES'!P$16","v":0},"Novice Poles"]
[{"$f":"'NOVICE POLES'!O$17","v":23.650000000000002},{"$f":"'NOVICE POLES'!P$17","v":0},"Novice Poles"]
[{"$f":"'NOVICE POLES'!O$18","v":18.920000000000002},{"$f":"'NOVICE POLES'!P$18","v":0},"Novice Poles"]
[{"$f":"'NOVICE POLES'!O$19","v":""},{"$f":"'NOVICE POLES'!P$19","v":0},"Novice Poles"]
[{"$f":"'NOVICE POLES'!O$20","v":""},{"$f":"'NOVICE POLES'!P$20","v":0},"Novice Poles"]
[{"$f":"'NOVICE POLES'!O$21","v":""},{"$f":"'NOVICE POLES'!P$21","v":0},"Novice Poles"]
[{"$f":"'NOVICE POLES'!O$22","v":""},{"$f":"'NOVICE POLES'!P$22","v":0},"Novice Poles"]
[{"$f":"'OPEN POLES'!O$13","v":127.71000000000001},{"$f":"'OPEN POLES'!P$13","v":0},"Open Poles"]
[{"$f":"'OPEN POLES'!O$14","v":104.06},{"$f":"'OPEN POLES'!P$14","v":0},"Open Poles"]
[{"$f":"'OPEN POLES'!O$15","v":85.14},{"$f":"'OPEN POLES'!P$15","v":0},"Open Poles"]
[{"$f":"'OPEN POLES'!O$16","v":61.49},{"$f":"'OPEN POLES'!P$16","v":0},"Open Poles"]
[{"$f":"'OPEN POLES'!O$17","v":42.57},{"$f":"'OPEN POLES'!P$17","v":0},"Open Poles"]
[{"$f":"'OPEN POLES'!O$18","v":28.38},{"$f":"'OPEN POLES'!P$18","v":0},"Open Poles"]
[{"$f":"'OPEN POLES'!O$19","v":14.19},{"$f":"'OPEN POLES'!P$19","v":0},"Open Poles"]
[{"$f":"'OPEN POLES'!O$20","v":9.4600000000000009},{"$f":"'OPEN POLES'!P$20","v":0},"Open Poles"]
[{"$f":"'OPEN POLES'!O$21","v":""},{"$f":"'OPEN POLES'!P$21","v":0},"Open Poles"]
[{"$f":"'OPEN POLES'!O$22","v":""},{"$f":"'OPEN POLES'!P$22","v":0},"Open Poles"]
[{"$f":"'3D Barrels'!O13","v":69.912499999999994},{"$f":"'3D Barrels'!P13","v":0},"3D Barrels"]
[{"$f":"'3D Barrels'!O14","v":49.9375},{"$f":"'3D Barrels'!P14","v":0},"3D Barrels"]
[{"$f":"'3D Barrels'!O15","v":39.950000000000003},{"$f":"'3D Barrels'!P15","v":0},"3D Barrels"]
[{"$f":"'3D Barrels'!O16","v":29.962499999999999},{"$f":"'3D Barrels'!P16","v":0},"3D Barrels"]
[{"$f":"'3D Barrels'!O17","v":9.9875000000000007},{"$f":"'3D Barrels'!P17","v":0},"3D Barrels"]
[{"$f":"'3D Barrels'!O19","v":69.912499999999994},{"$f":"'3D Barrels'!P19","v":0},"3D Barrels"]
[{"$f":"'3D Barrels'!O20","v":49.9375},{"$f":"'3D Barrels'!P20","v":0},"3D Barrels"]
[{"$f":"'3D Barrels'!O21","v":39.950000000000003},{"$f":"'3D Barrels'!P21","v":0},"3D Barrels"]
[{"$f":"'3D Barrels'!O22","v":29.962499999999999},{"$f":"'3D Barrels'!P22","v":0},"3D Barrels"]
[{"$f":"'3D Barrels'!O23","v":9.9875000000000007},{"$f":"'3D Barrels'!P23","v":0},"3D Barrels"]
[{"$f":"'3D Barrels'!O26","v":69.912499999999994},{"$f":"'3D Barrels'!P26","v":0},"3D Barrels"]
[{"$f":"'3D Barrels'!O27","v":49.9375},{"$f":"'3D Barrels'!P27","v":0},"3D Barrels"]
[{"$f":"'3D Barrels'!O28","v":39.950000000000003},{"$f":"'3D Barrels'!P28","v":0},"3D Barrels"]
[{"$f":"'3D Barrels'!O29","v":29.962499999999999},{"$f":"'3D Barrels'!P29","v":0},"3D Barrels"]
[{"$f":"'3D Barrels'!O30","v":9.9875000000000007},{"$f":"'3D Barrels'!P30","v":0},"3D Barrels"]
[{"$f":"'Adult Green Barrels'!O$13","v":42},{"$f":"'Adult Green Barrels'!P$13","v":0},"Adult Barrels"]
[{"$f":"'Adult Green Barrels'!O$14","v":""},{"$f":"'Adult Green Barrels'!P$14","v":0},"Adult Barrels"]
[{"$f":"'Adult Green Barrels'!O$15","v":""},{"$f":"'Adult Green Barrels'!P$15","v":0},"Adult Barrels"]
[{"$f":"'Adult Green Barrels'!O$16","v":""},{"$f":"'Adult Green Barrels'!P$16","v":0},"Adult Barrels"]
[{"$f":"'Adult Green Barrels'!O$17","v":""},{"$f":"'Adult Green Barrels'!P$17","v":0},"Adult Barrels"]
[{"$f":"'Adult Green Barrels'!O$18","v":""},{"$f":"'Adult Green Barrels'!P$18","v":0},"Adult Barrels"]
[{"$f":"'Adult Green Barrels'!O$19","v":""},{"$f":"'Adult Green Barrels'!P$19","v":0},"Adult Barrels"]
[{"$f":"'Adult Green Barrels'!O$20","v":""},{"$f":"'Adult Green Barrels'!P$20","v":0},"Adult Barrels"]
[{"$f":"'ADULT GREEN POLES'!O$13","v":42},{"$f":"'ADULT GREEN POLES'!P$13","v":0},"Adult Poles"]
[{"$f":"'ADULT GREEN POLES'!O$14","v":""},{"$f":"'ADULT GREEN POLES'!P$14","v":0},"Adult Poles"]
[{"$f":"'ADULT GREEN POLES'!O$15","v":""},{"$f":"'ADULT GREEN POLES'!P$15","v":0},"Adult Poles"]
[{"$f":"'ADULT GREEN POLES'!O$16","v":""},{"$f":"'ADULT GREEN POLES'!P$16","v":0},"Adult Poles"]
[{"$f":"'ADULT GREEN POLES'!O$17","v":""},{"$f":"'ADULT GREEN POLES'!P$17","v":0},"Adult Poles"]
[{"$f":"'ADULT GREEN POLES'!O$18","v":""},{"$f":"'ADULT GREEN POLES'!P$18","v":0},"Adult Poles"]
[{"$f":"'ADULT GREEN POLES'!O$19","v":""},{"$f":"'ADULT GREEN POLES'!P$19","v":0},"Adult Poles"]
[{"$f":"'ADULT GREEN POLES'!O$20","v":""},{"$f":"'ADULT GREEN POLES'!P$20","v":0},"Adult Poles"]

{"sheet":"Show Report","index":19,"n_rows":25,"n_cols":5,"rows_kept":25,"cut":false,"hidden":false,"merged":[[0,0,0,4]]}
["MBRA Jackpot - Windsor - July 24 & 25, 2021"]
[]
["INCOME"]
["Head Fee",2250]
["Drug Fee",225]
["Class Fee Day 1",1090]
["Class Fee Day 2",1120]
["3D",585]
["Added Day 1",600]
["Added Day 2",600]
["3D Sponsor",100]
[]
[null,{"$f":"SUM(B4:B11)","v":6570},null,{"$f":"SUM(B13)","v":6570}]
[]
["EXPENSES"]
["Heather/Timer"]
["Day 1 Payouts (15%)",null,-2124]
["Day 2 Payouts (15%)",null,-1552,null,{"$f":"SUM(C17:C18)","v":-3676}]
["Kids Prizes"]
["Ground Rental"]
["User Fee 69 @ $5"]
[null,null,{"$f":"SUM(C16:C21)","v":-3676},{"$f":"SUM(C22)","v":-3676}]
["Total Income"]
[]
["CASH ON HAND",null,null,{"$f":"SUM(D13:D22)","v":2894}]

{"sheet":"Sheet3","index":20,"n_rows":0,"n_cols":0,"rows_kept":0,"cut":false,"hidden":false,"merged":[]}